﻿[
  {
    "actor": {
      "identity": 1288,
      "labels": [
        "Person"
      ],
      "properties": {
        "name": "Keanu Reeves",
        "born": 1964
      }
    },
    "count(movie)": 7
  },
  {
    "actor": {
      "identity": 1289,
      "labels": [
        "Person"
      ],
      "properties": {
        "name": "Carrie-Anne Moss",
        "born": 1967
      }
    },
    "count(movie)": 3
  },
  {
    "actor": {
      "identity": 1290,
      "labels": [
        "Person"
      ],
      "properties": {
        "name": "Laurence Fishburne",
        "born": 1961
      }
    },
    "count(movie)": 3
  },
  {
    "actor": {
      "identity": 1291,
      "labels": [
        "Person"
      ],
      "properties": {
        "name": "Hugo Weaving",
        "born": 1960
      }
    },
    "count(movie)": 5
  },
  {
    "actor": {
      "identity": 1295,
      "labels": [
        "Person"
      ],
      "properties": {
        "name": "Emil Eifrem",
        "born": 1978
      }
    },
    "count(movie)": 1
  },
  {
    "actor": {
      "identity": 1299,
      "labels": [
        "Person"
      ],
      "properties": {
        "name": "Charlize Theron",
        "born": 1975
      }
    },
    "count(movie)": 2
  },
  {
    "actor": {
      "identity": 1300,
      "labels": [
        "Person"
      ],
      "properties": {
        "name": "Al Pacino",
        "born": 1940
      }
    },
    "count(movie)": 1
  },
  {
    "actor": {
      "identity": 1303,
      "labels": [
        "Person"
      ],
      "properties": {
        "name": "Tom Cruise",
        "born": 1962
      }
    },
    "count(movie)": 3
  },
  {
    "actor": {
      "identity": 1304,
      "labels": [
        "Person"
      ],
      "properties": {
        "name": "Jack Nicholson",
        "born": 1937
      }
    },
    "count(movie)": 5
  },
  {
    "actor": {
      "identity": 1305,
      "labels": [
        "Person"
      ],
      "properties": {
        "name": "Demi Moore",
        "born": 1962
      }
    },
    "count(movie)": 1
  },
  {
    "actor": {
      "identity": 1306,
      "labels": [
        "Person"
      ],
      "properties": {
        "name": "Kevin Bacon",
        "born": 1958
      }
    },
    "count(movie)": 3
  },
  {
    "actor": {
      "identity": 1307,
      "labels": [
        "Person"
      ],
      "properties": {
        "name": "Kiefer Sutherland",
        "born": 1966
      }
    },
    "count(movie)": 2
  },
  {
    "actor": {
      "identity": 1308,
      "labels": [
        "Person"
      ],
      "properties": {
        "name": "Noah Wyle",
        "born": 1971
      }
    },
    "count(movie)": 1
  },
  {
    "actor": {
      "identity": 1309,
      "labels": [
        "Person"
      ],
      "properties": {
        "name": "Cuba Gooding Jr.",
        "born": 1968
      }
    },
    "count(movie)": 4
  },
  {
    "actor": {
      "identity": 1310,
      "labels": [
        "Person"
      ],
      "properties": {
        "name": "Kevin Pollak",
        "born": 1957
      }
    },
    "count(movie)": 1
  },
  {
    "actor": {
      "identity": 1311,
      "labels": [
        "Person"
      ],
      "properties": {
        "name": "J.T. Walsh",
        "born": 1943
      }
    },
    "count(movie)": 2
  },
  {
    "actor": {
      "identity": 1312,
      "labels": [
        "Person"
      ],
      "properties": {
        "name": "James Marshall",
        "born": 1967
      }
    },
    "count(movie)": 1
  },
  {
    "actor": {
      "identity": 1313,
      "labels": [
        "Person"
      ],
      "properties": {
        "name": "Christopher Guest",
        "born": 1948
      }
    },
    "count(movie)": 1
  },
  {
    "actor": {
      "identity": 1315,
      "labels": [
        "Person"
      ],
      "properties": {
        "name": "Aaron Sorkin",
        "born": 1961
      }
    },
    "count(movie)": 1
  },
  {
    "actor": {
      "identity": 1317,
      "labels": [
        "Person"
      ],
      "properties": {
        "name": "Kelly McGillis",
        "born": 1957
      }
    },
    "count(movie)": 1
  },
  {
    "actor": {
      "identity": 1318,
      "labels": [
        "Person"
      ],
      "properties": {
        "name": "Val Kilmer",
        "born": 1959
      }
    },
    "count(movie)": 1
  },
  {
    "actor": {
      "identity": 1319,
      "labels": [
        "Person"
      ],
      "properties": {
        "name": "Anthony Edwards",
        "born": 1962
      }
    },
    "count(movie)": 1
  },
  {
    "actor": {
      "identity": 1320,
      "labels": [
        "Person"
      ],
      "properties": {
        "name": "Tom Skerritt",
        "born": 1933
      }
    },
    "count(movie)": 1
  },
  {
    "actor": {
      "identity": 1321,
      "labels": [
        "Person"
      ],
      "properties": {
        "name": "Meg Ryan",
        "born": 1961
      }
    },
    "count(movie)": 5
  },
  {
    "actor": {
      "identity": 1325,
      "labels": [
        "Person"
      ],
      "properties": {
        "name": "Renee Zellweger",
        "born": 1969
      }
    },
    "count(movie)": 1
  },
  {
    "actor": {
      "identity": 1326,
      "labels": [
        "Person"
      ],
      "properties": {
        "name": "Kelly Preston",
        "born": 1962
      }
    },
    "count(movie)": 1
  },
  {
    "actor": {
      "identity": 1327,
      "labels": [
        "Person"
      ],
      "properties": {
        "name": "Jerry O'Connell",
        "born": 1974
      }
    },
    "count(movie)": 2
  },
  {
    "actor": {
      "identity": 1328,
      "labels": [
        "Person"
      ],
      "properties": {
        "name": "Jay Mohr",
        "born": 1970
      }
    },
    "count(movie)": 1
  },
  {
    "actor": {
      "identity": 1329,
      "labels": [
        "Person"
      ],
      "properties": {
        "name": "Bonnie Hunt",
        "born": 1961
      }
    },
    "count(movie)": 2
  },
  {
    "actor": {
      "identity": 1330,
      "labels": [
        "Person"
      ],
      "properties": {
        "name": "Regina King",
        "born": 1971
      }
    },
    "count(movie)": 1
  },
  {
    "actor": {
      "identity": 1331,
      "labels": [
        "Person"
      ],
      "properties": {
        "name": "Jonathan Lipnicki",
        "born": 1996
      }
    },
    "count(movie)": 1
  },
  {
    "actor": {
      "identity": 1334,
      "labels": [
        "Person"
      ],
      "properties": {
        "name": "River Phoenix",
        "born": 1970
      }
    },
    "count(movie)": 1
  },
  {
    "actor": {
      "identity": 1335,
      "labels": [
        "Person"
      ],
      "properties": {
        "name": "Corey Feldman",
        "born": 1971
      }
    },
    "count(movie)": 1
  },
  {
    "actor": {
      "identity": 1336,
      "labels": [
        "Person"
      ],
      "properties": {
        "name": "Wil Wheaton",
        "born": 1972
      }
    },
    "count(movie)": 1
  },
  {
    "actor": {
      "identity": 1337,
      "labels": [
        "Person"
      ],
      "properties": {
        "name": "John Cusack",
        "born": 1966
      }
    },
    "count(movie)": 1
  },
  {
    "actor": {
      "identity": 1338,
      "labels": [
        "Person"
      ],
      "properties": {
        "name": "Marshall Bell",
        "born": 1942
      }
    },
    "count(movie)": 2
  },
  {
    "actor": {
      "identity": 1340,
      "labels": [
        "Person"
      ],
      "properties": {
        "name": "Helen Hunt",
        "born": 1963
      }
    },
    "count(movie)": 3
  },
  {
    "actor": {
      "identity": 1341,
      "labels": [
        "Person"
      ],
      "properties": {
        "name": "Greg Kinnear",
        "born": 1963
      }
    },
    "count(movie)": 2
  },
  {
    "actor": {
      "identity": 1344,
      "labels": [
        "Person"
      ],
      "properties": {
        "name": "Annabella Sciorra",
        "born": 1960
      }
    },
    "count(movie)": 1
  },
  {
    "actor": {
      "identity": 1345,
      "labels": [
        "Person"
      ],
      "properties": {
        "name": "Max von Sydow",
        "born": 1929
      }
    },
    "count(movie)": 2
  },
  {
    "actor": {
      "identity": 1346,
      "labels": [
        "Person"
      ],
      "properties": {
        "name": "Werner Herzog",
        "born": 1942
      }
    },
    "count(movie)": 1
  },
  {
    "actor": {
      "identity": 1347,
      "labels": [
        "Person"
      ],
      "properties": {
        "name": "Robin Williams",
        "born": 1951
      }
    },
    "count(movie)": 3
  },
  {
    "actor": {
      "identity": 1350,
      "labels": [
        "Person"
      ],
      "properties": {
        "name": "Ethan Hawke",
        "born": 1970
      }
    },
    "count(movie)": 1
  },
  {
    "actor": {
      "identity": 1351,
      "labels": [
        "Person"
      ],
      "properties": {
        "name": "Rick Yune",
        "born": 1971
      }
    },
    "count(movie)": 2
  },
  {
    "actor": {
      "identity": 1352,
      "labels": [
        "Person"
      ],
      "properties": {
        "name": "James Cromwell",
        "born": 1940
      }
    },
    "count(movie)": 2
  },
  {
    "actor": {
      "identity": 1355,
      "labels": [
        "Person"
      ],
      "properties": {
        "name": "Parker Posey",
        "born": 1968
      }
    },
    "count(movie)": 1
  },
  {
    "actor": {
      "identity": 1356,
      "labels": [
        "Person"
      ],
      "properties": {
        "name": "Dave Chappelle",
        "born": 1973
      }
    },
    "count(movie)": 1
  },
  {
    "actor": {
      "identity": 1357,
      "labels": [
        "Person"
      ],
      "properties": {
        "name": "Steve Zahn",
        "born": 1967
      }
    },
    "count(movie)": 2
  },
  {
    "actor": {
      "identity": 1358,
      "labels": [
        "Person"
      ],
      "properties": {
        "name": "Tom Hanks",
        "born": 1956
      }
    },
    "count(movie)": 12
  },
  {
    "actor": {
      "identity": 1361,
      "labels": [
        "Person"
      ],
      "properties": {
        "name": "Rita Wilson",
        "born": 1956
      }
    },
    "count(movie)": 1
  },
  {
    "actor": {
      "identity": 1362,
      "labels": [
        "Person"
      ],
      "properties": {
        "name": "Bill Pullman",
        "born": 1953
      }
    },
    "count(movie)": 1
  },
  {
    "actor": {
      "identity": 1363,
      "labels": [
        "Person"
      ],
      "properties": {
        "name": "Victor Garber",
        "born": 1949
      }
    },
    "count(movie)": 1
  },
  {
    "actor": {
      "identity": 1364,
      "labels": [
        "Person"
      ],
      "properties": {
        "name": "Rosie O'Donnell",
        "born": 1962
      }
    },
    "count(movie)": 2
  },
  {
    "actor": {
      "identity": 1367,
      "labels": [
        "Person"
      ],
      "properties": {
        "name": "Nathan Lane",
        "born": 1956
      }
    },
    "count(movie)": 2
  },
  {
    "actor": {
      "identity": 1369,
      "labels": [
        "Person"
      ],
      "properties": {
        "name": "Billy Crystal",
        "born": 1948
      }
    },
    "count(movie)": 1
  },
  {
    "actor": {
      "identity": 1370,
      "labels": [
        "Person"
      ],
      "properties": {
        "name": "Carrie Fisher",
        "born": 1956
      }
    },
    "count(movie)": 1
  },
  {
    "actor": {
      "identity": 1371,
      "labels": [
        "Person"
      ],
      "properties": {
        "name": "Bruno Kirby",
        "born": 1949
      }
    },
    "count(movie)": 1
  },
  {
    "actor": {
      "identity": 1373,
      "labels": [
        "Person"
      ],
      "properties": {
        "name": "Liv Tyler",
        "born": 1977
      }
    },
    "count(movie)": 1
  },
  {
    "actor": {
      "identity": 1375,
      "labels": [
        "Person"
      ],
      "properties": {
        "name": "Brooke Langton",
        "born": 1970
      }
    },
    "count(movie)": 1
  },
  {
    "actor": {
      "identity": 1376,
      "labels": [
        "Person"
      ],
      "properties": {
        "name": "Gene Hackman",
        "born": 1930
      }
    },
    "count(movie)": 3
  },
  {
    "actor": {
      "identity": 1377,
      "labels": [
        "Person"
      ],
      "properties": {
        "name": "Orlando Jones",
        "born": 1968
      }
    },
    "count(movie)": 1
  },
  {
    "actor": {
      "identity": 1380,
      "labels": [
        "Person"
      ],
      "properties": {
        "name": "Christian Bale",
        "born": 1974
      }
    },
    "count(movie)": 1
  },
  {
    "actor": {
      "identity": 1381,
      "labels": [
        "Person"
      ],
      "properties": {
        "name": "Zach Grenier",
        "born": 1954
      }
    },
    "count(movie)": 2
  },
  {
    "actor": {
      "identity": 1385,
      "labels": [
        "Person"
      ],
      "properties": {
        "name": "Richard Harris",
        "born": 1930
      }
    },
    "count(movie)": 1
  },
  {
    "actor": {
      "identity": 1386,
      "labels": [
        "Person"
      ],
      "properties": {
        "name": "Clint Eastwood",
        "born": 1930
      }
    },
    "count(movie)": 1
  },
  {
    "actor": {
      "identity": 1388,
      "labels": [
        "Person"
      ],
      "properties": {
        "name": "Takeshi Kitano",
        "born": 1947
      }
    },
    "count(movie)": 1
  },
  {
    "actor": {
      "identity": 1389,
      "labels": [
        "Person"
      ],
      "properties": {
        "name": "Dina Meyer",
        "born": 1968
      }
    },
    "count(movie)": 1
  },
  {
    "actor": {
      "identity": 1390,
      "labels": [
        "Person"
      ],
      "properties": {
        "name": "Ice-T",
        "born": 1958
      }
    },
    "count(movie)": 1
  },
  {
    "actor": {
      "identity": 1393,
      "labels": [
        "Person"
      ],
      "properties": {
        "name": "Halle Berry",
        "born": 1966
      }
    },
    "count(movie)": 1
  },
  {
    "actor": {
      "identity": 1394,
      "labels": [
        "Person"
      ],
      "properties": {
        "name": "Jim Broadbent",
        "born": 1949
      }
    },
    "count(movie)": 1
  },
  {
    "actor": {
      "identity": 1399,
      "labels": [
        "Person"
      ],
      "properties": {
        "name": "Ian McKellen",
        "born": 1939
      }
    },
    "count(movie)": 1
  },
  {
    "actor": {
      "identity": 1400,
      "labels": [
        "Person"
      ],
      "properties": {
        "name": "Audrey Tautou",
        "born": 1976
      }
    },
    "count(movie)": 1
  },
  {
    "actor": {
      "identity": 1401,
      "labels": [
        "Person"
      ],
      "properties": {
        "name": "Paul Bettany",
        "born": 1971
      }
    },
    "count(movie)": 1
  },
  {
    "actor": {
      "identity": 1404,
      "labels": [
        "Person"
      ],
      "properties": {
        "name": "Natalie Portman",
        "born": 1981
      }
    },
    "count(movie)": 1
  },
  {
    "actor": {
      "identity": 1405,
      "labels": [
        "Person"
      ],
      "properties": {
        "name": "Stephen Rea",
        "born": 1946
      }
    },
    "count(movie)": 1
  },
  {
    "actor": {
      "identity": 1406,
      "labels": [
        "Person"
      ],
      "properties": {
        "name": "John Hurt",
        "born": 1940
      }
    },
    "count(movie)": 1
  },
  {
    "actor": {
      "identity": 1407,
      "labels": [
        "Person"
      ],
      "properties": {
        "name": "Ben Miles",
        "born": 1967
      }
    },
    "count(movie)": 3
  },
  {
    "actor": {
      "identity": 1409,
      "labels": [
        "Person"
      ],
      "properties": {
        "name": "Emile Hirsch",
        "born": 1985
      }
    },
    "count(movie)": 1
  },
  {
    "actor": {
      "identity": 1410,
      "labels": [
        "Person"
      ],
      "properties": {
        "name": "John Goodman",
        "born": 1960
      }
    },
    "count(movie)": 1
  },
  {
    "actor": {
      "identity": 1411,
      "labels": [
        "Person"
      ],
      "properties": {
        "name": "Susan Sarandon",
        "born": 1946
      }
    },
    "count(movie)": 1
  },
  {
    "actor": {
      "identity": 1412,
      "labels": [
        "Person"
      ],
      "properties": {
        "name": "Matthew Fox",
        "born": 1966
      }
    },
    "count(movie)": 1
  },
  {
    "actor": {
      "identity": 1413,
      "labels": [
        "Person"
      ],
      "properties": {
        "name": "Christina Ricci",
        "born": 1980
      }
    },
    "count(movie)": 1
  },
  {
    "actor": {
      "identity": 1414,
      "labels": [
        "Person"
      ],
      "properties": {
        "name": "Rain",
        "born": 1982
      }
    },
    "count(movie)": 2
  },
  {
    "actor": {
      "identity": 1416,
      "labels": [
        "Person"
      ],
      "properties": {
        "name": "Naomie Harris"
      }
    },
    "count(movie)": 1
  },
  {
    "actor": {
      "identity": 1418,
      "labels": [
        "Person"
      ],
      "properties": {
        "name": "Michael Clarke Duncan",
        "born": 1957
      }
    },
    "count(movie)": 1
  },
  {
    "actor": {
      "identity": 1419,
      "labels": [
        "Person"
      ],
      "properties": {
        "name": "David Morse",
        "born": 1953
      }
    },
    "count(movie)": 1
  },
  {
    "actor": {
      "identity": 1420,
      "labels": [
        "Person"
      ],
      "properties": {
        "name": "Sam Rockwell",
        "born": 1968
      }
    },
    "count(movie)": 2
  },
  {
    "actor": {
      "identity": 1421,
      "labels": [
        "Person"
      ],
      "properties": {
        "name": "Gary Sinise",
        "born": 1955
      }
    },
    "count(movie)": 2
  },
  {
    "actor": {
      "identity": 1422,
      "labels": [
        "Person"
      ],
      "properties": {
        "name": "Patricia Clarkson",
        "born": 1959
      }
    },
    "count(movie)": 1
  },
  {
    "actor": {
      "identity": 1425,
      "labels": [
        "Person"
      ],
      "properties": {
        "name": "Frank Langella",
        "born": 1938
      }
    },
    "count(movie)": 1
  },
  {
    "actor": {
      "identity": 1426,
      "labels": [
        "Person"
      ],
      "properties": {
        "name": "Michael Sheen",
        "born": 1969
      }
    },
    "count(movie)": 1
  },
  {
    "actor": {
      "identity": 1427,
      "labels": [
        "Person"
      ],
      "properties": {
        "name": "Oliver Platt",
        "born": 1960
      }
    },
    "count(movie)": 2
  },
  {
    "actor": {
      "identity": 1429,
      "labels": [
        "Person"
      ],
      "properties": {
        "name": "Danny DeVito",
        "born": 1944
      }
    },
    "count(movie)": 2
  },
  {
    "actor": {
      "identity": 1430,
      "labels": [
        "Person"
      ],
      "properties": {
        "name": "John C. Reilly",
        "born": 1965
      }
    },
    "count(movie)": 1
  },
  {
    "actor": {
      "identity": 1432,
      "labels": [
        "Person"
      ],
      "properties": {
        "name": "Ed Harris",
        "born": 1950
      }
    },
    "count(movie)": 1
  },
  {
    "actor": {
      "identity": 1433,
      "labels": [
        "Person"
      ],
      "properties": {
        "name": "Bill Paxton",
        "born": 1955
      }
    },
    "count(movie)": 3
  },
  {
    "actor": {
      "identity": 1435,
      "labels": [
        "Person"
      ],
      "properties": {
        "name": "Philip Seymour Hoffman",
        "born": 1967
      }
    },
    "count(movie)": 2
  },
  {
    "actor": {
      "identity": 1442,
      "labels": [
        "Person"
      ],
      "properties": {
        "name": "Diane Keaton",
        "born": 1946
      }
    },
    "count(movie)": 1
  },
  {
    "actor": {
      "identity": 1447,
      "labels": [
        "Person"
      ],
      "properties": {
        "name": "Julia Roberts",
        "born": 1967
      }
    },
    "count(movie)": 1
  },
  {
    "actor": {
      "identity": 1450,
      "labels": [
        "Person"
      ],
      "properties": {
        "name": "Madonna",
        "born": 1954
      }
    },
    "count(movie)": 1
  },
  {
    "actor": {
      "identity": 1451,
      "labels": [
        "Person"
      ],
      "properties": {
        "name": "Geena Davis",
        "born": 1956
      }
    },
    "count(movie)": 1
  },
  {
    "actor": {
      "identity": 1452,
      "labels": [
        "Person"
      ],
      "properties": {
        "name": "Lori Petty",
        "born": 1963
      }
    },
    "count(movie)": 1
  }
]