﻿[
  {
    "p": {
      "identity": 10,
      "labels": [
        "Person"
      ],
      "properties": {
        "name": "Hugo Weaving",
        "born": 1960
      }
    },
    "movie": {
      "identity": 185,
      "labels": [
        "Movie"
      ],
      "properties": {
        "title": "Captain America: The First Avenger",
        "tagline": "Free your mind",
        "released": 2011
      }
    },
    "r": {
      "identity": 256,
      "start": 10,
      "end": 185,
      "type": "ACTED_IN",
      "properties": {}
    }
  },
  {
    "p": {
      "identity": 187,
      "labels": [
        "Person"
      ],
      "properties": {
        "name": "Christopher Markus",
        "born": 1950
      }
    },
    "movie": {
      "identity": 185,
      "labels": [
        "Movie"
      ],
      "properties": {
        "title": "Captain America: The First Avenger",
        "tagline": "Free your mind",
        "released": 2011
      }
    },
    "r": {
      "identity": 254,
      "start": 187,
      "end": 185,
      "type": "WROTE",
      "properties": {}
    }
  },
  {
    "p": {
      "identity": 186,
      "labels": [
        "Person"
      ],
      "properties": {
        "name": "Joe Johnston",
        "born": 1950
      }
    },
    "movie": {
      "identity": 185,
      "labels": [
        "Movie"
      ],
      "properties": {
        "title": "Captain America: The First Avenger",
        "tagline": "Free your mind",
        "released": 2011
      }
    },
    "r": {
      "identity": 253,
      "start": 186,
      "end": 185,
      "type": "DIRECTED",
      "properties": {}
    }
  },
  {
    "p": {
      "identity": 188,
      "labels": [
        "Person"
      ],
      "properties": {
        "name": "Stephen McFeely",
        "born": 1950
      }
    },
    "movie": {
      "identity": 185,
      "labels": [
        "Movie"
      ],
      "properties": {
        "title": "Captain America: The First Avenger",
        "tagline": "Free your mind",
        "released": 2011
      }
    },
    "r": {
      "identity": 255,
      "start": 188,
      "end": 185,
      "type": "WROTE",
      "properties": {}
    }
  },
  {
    "p": {
      "identity": 190,
      "labels": [
        "Person"
      ],
      "properties": {
        "name": "Samuel L. Jackson",
        "born": 1950
      }
    },
    "movie": {
      "identity": 185,
      "labels": [
        "Movie"
      ],
      "properties": {
        "title": "Captain America: The First Avenger",
        "tagline": "Free your mind",
        "released": 2011
      }
    },
    "r": {
      "identity": 258,
      "start": 190,
      "end": 185,
      "type": "ACTED_IN",
      "properties": {}
    }
  },
  {
    "p": {
      "identity": 189,
      "labels": [
        "Person"
      ],
      "properties": {
        "name": "Chris Evans",
        "born": 1950
      }
    },
    "movie": {
      "identity": 185,
      "labels": [
        "Movie"
      ],
      "properties": {
        "title": "Captain America: The First Avenger",
        "tagline": "Free your mind",
        "released": 2011
      }
    },
    "r": {
      "identity": 257,
      "start": 189,
      "end": 185,
      "type": "ACTED_IN",
      "properties": {}
    }
  }
]