Test results:
0 17136
1 10109
2 9807
3 13602
4 9803
5 10136
6 10681
7 9818
8 10001
9 15839
10 9811
11 8194
12 9820
13 14338
14 9966
15 9572
16 9938
17 13054
18 10572
19 9990
20 10287
21 11389
22 9999
23 9901
24 17008
25 18397
26 11501
27 9960
28 9808
29 16926
30 10200
31 9832
32 9881
33 15387
34 9998
35 9975
36 9829
37 8890
38 18595
39 11476
40 10036
41 9817
42 16486
43 8948
44 10258
45 8807
46 5998
47 16692
48 4145
49 7179
50 7227
51 19772
52 9858
53 14199
54 8720
55 9868
56 10012
57 9776
58 9219
59 7079
60 7119
61 23863
62 11723
63 10046
64 10019
65 13752
66 9934
67 9463
68 7087
69 10424
70 15090
71 9632
72 7100
73 11719
74 7077
75 7078
76 14249
77 15667
78 9929
79 9740
80 15591
81 10007
82 7053
83 9915
84 9457
85 7120
86 7016
87 9949
88 9587
89 11653
90 10085
91 9966
92 17454
93 7582
94 6633
95 15356
96 15843
97 10580
98 6424
99 7519
100 13148
101 8883
102 3103
103 4911
104 7746
105 15129
106 7169
107 13534
108 17717
109 10798
110 10081
111 6503
112 13679
113 6979
114 11001
115 7070
116 10982
117 6971
118 7055
119 6713
120 12925
121 9858
122 9974
123 7102
124 7305
125 7090
126 7072
127 8792
128 11072
129 15231
130 10025
131 10102
132 12267
133 10518
134 10381
135 18305
136 10981
137 7038
138 6933
139 22248
140 10505
141 10450
142 10598
143 14119
144 10141
145 9924
146 13229
147 6703
148 6922
149 7052
150 5871
151 14522
152 10538
153 10047
154 9869
155 15804
156 6643
157 20827
158 13940
159 11886
160 7086
161 7038
162 9738
163 9837
164 9857
165 9883
166 11313
167 7055
168 7072
169 7038
170 17354
171 7044
172 5957
173 15389
174 8622
175 15035
176 9804
177 16536
178 10019
179 9879
180 9864
181 15058
182 7090
183 7065
184 5952
185 15089
186 8735
187 9843
188 9831
189 16497
190 8542
191 10226
192 7089
193 12662
194 15360
195 9128
196 7095
197 25540
198 9739
199 9860
200 10161
201 12532
202 7106
203 7126
204 15143
205 15359
206 7095
207 9786
208 9946
209 13585
210 8540
211 9952
212 7055
213 9424
214 7108
215 7079
216 14949
217 8063
218 7066
219 15146
220 13438
221 7146
222 6788
223 14727
224 17688
225 10785
226 7062
227 9941
228 7036
229 24160
230 6884
231 7064
232 22760
233 10386
234 9834
235 10009
236 13177
237 7041
238 7192
239 7078
240 10884
241 7045
242 15309
243 16125
244 11061
245 12940
246 7070
247 7050
248 15743
249 14478
250 3367
251 7060
252 16218
253 10383
254 11096
255 10532
256 12634
257 25696
258 7009
259 7033
260 9657
261 7440
262 16057
263 17230
264 10010
265 9922
266 7077
267 24931
268 12264
269 6657
270 4222
271 7089
272 9765
273 7143
274 7458
275 6991
276 9245
277 15179
278 10079
279 17438
280 9889
281 10204
282 43309
283 6271
284 7103
285 7043
286 6985
287 15227
288 13362
289 9805
290 6464
291 10123
292 9056
293 6674
294 6991
295 14524
296 7647
297 15162
298 9868
299 15811
300 9858
301 9725
302 16382
303 10676
304 6967
305 6982
306 12071
307 9853
308 9541
309 9919
310 13301
311 9820
312 9811
313 10738
314 9142
315 6982
316 6990
317 14391
318 7632
319 7042
320 6991
321 15314
322 11671
323 7114
324 10160
325 9836
326 10327
327 6562
328 7028
329 14817
330 16611
331 9855
332 9812
333 16431
334 10062
335 9888
336 6978
337 24110
338 5804
339 7396
340 23273
341 18057
342 11881
343 9808
344 9871
345 16825
346 10169
347 6266
348 6969
349 11235
350 6979
351 7000
352 9882
353 13992
354 9830
355 9834
356 9929
357 9544
358 6937
359 6468
360 14929
361 7039
362 11096
363 9902
364 9890
365 16612
366 9886
367 7018
368 7030
369 12183
370 6977
371 6985
372 6966
373 10591
374 6997
375 6907
376 6701
377 12421
378 11337
379 10702
380 14158
381 10166
382 6991
383 6977
384 6997
385 10011
386 6766
387 9883
388 18389
389 11568
390 10583
391 9973
392 13634
393 7331
394 7078
395 15236
396 16245
397 9968
398 10065
399 9960
400 14045
401 10657
402 6656
403 7019
404 15758
405 9411
406 6966
407 9757
408 17145
409 10044
410 9511
411 9529
412 12996
413 7187
414 6605
415 7005
416 10931
417 7052
418 14938
419 9883
420 13716
421 7032
422 7015
423 19387
424 12620
425 15026
426 6952
427 6993
428 11050
429 14889
430 9519
431 7002
432 11998
433 9909
434 9555
435 18414
436 8159
437 6986
438 6963
439 9136
440 9475
441 6958
442 17427
443 10733
444 9548
445 9514
446 13435
447 6949
448 6976
449 7238
450 11874
451 6532
452 11162
453 9623
454 13104
455 9545
456 7028
457 24440
458 16958
459 8326
460 7006
461 6955
462 20688
463 9529
464 9525
465 7977
466 7142
467 7029
468 14984
469 9567
470 9397
471 6955
472 7037
473 15190
474 16264
475 9511
476 7026
477 24364
478 9638
479 11952
480 9543
481 9594
482 14876
483 7998
484 6960
485 6929
486 13383
487 14685
488 9543
489 10285
490 15118
491 10202
492 6929
493 6365
494 10092
495 7047
496 10306
497 10289
498 12209
499 9460
500 9584
501 9568
502 8636
503 6998
504 6326
505 15144
506 8325
507 14868
508 9588
509 16273
510 9474
511 9558
512 6969
513 12089
514 7078
515 2660
516 2473
517 8752
518 14963
519 6972
520 6935
521 13604
522 6840
523 6930
524 6976
525 12167
526 6942
527 6968
528 6509
529 10752
530 6944
531 14902
532 9650
533 11741
534 9766
535 8409
536 11901
537 7073
538 7041
539 13851
540 18654
541 10805
542 14912
543 9463
544 9578
545 12734
546 5796
547 6980
548 15500
549 4680
550 7147
551 6955
552 22025
553 10420
554 9801
555 9707
556 11815
557 9749
558 5236
559 12902
560 7019
561 9079
562 14640
563 4378
564 17565
565 10856
566 9591
567 9546
568 12231
569 2581
570 2501
571 9116
572 7738
573 2620
574 18771
575 12829
576 9426
577 10042
578 9671
579 9580
580 11773
581 9761
582 7036
583 16261
584 7833
585 7028
586 14973
587 14970
588 7746
589 9509
590 9638
591 14312
592 9046
593 7081
594 14963
595 10625
596 14925
597 9283
598 9489
599 11561
600 9783
601 9678
602 17058
603 7567
604 6681
605 15048
606 14464
607 9786
608 7781
609 9667
610 14091
611 9753
612 7039
613 7101
614 17839
615 7018
616 7034
617 7038
618 11999
619 6858
620 15585
621 10281
622 10995
623 7004
624 15554
625 7045
626 9435
627 7025
628 6586
629 40434
630 30857
631 30335
632 23038
633 14527
634 9776
635 9681
636 9630
637 6982
638 10944
639 6963
640 6564
641 6733
642 12209
643 9624
644 9658
645 17814
646 7954
647 6945
648 6952
649 13565
650 6703
651 6408
652 9757
653 12914
654 9656
655 9813
656 12847
657 15580
658 8807
659 6560
660 6922
661 14030
662 10267
663 9624
664 9284
665 15606
666 6972
667 6551
668 6933
669 11237
670 7013
671 6937
672 14352
673 7001
674 7043
675 7301
676 12255
677 16334
678 9528
679 8885
680 8284
681 14244
682 6847
683 2680
684 2697
685 10442
686 7163
687 9494
688 13253
689 9906
690 9687
691 9761
692 12579
693 6929
694 6946
695 6992
696 9441
697 9667
698 9673
699 9639
700 9926
701 12769
702 6904
703 6886
704 15372
705 8586
706 6876
707 9651
708 13891
709 9670
710 9667
711 9902
712 7494
713 6292
714 14974
715 15662
716 6903
717 6902
718 6691
719 19566
720 6969
721 6888
722 5987
723 13386
724 9410
725 5222
726 6859
727 8330
728 6864
729 15669
730 13993
731 6856
732 15568
733 10234
734 8557
735 7830
736 2224
737 3529
738 2317
739 18193
740 6030
741 6900
742 22771
743 5183
744 7804
745 9382
746 13162
747 24082
748 3346
749 6939
750 11118
751 6927
752 15134
753 9626
754 16996
755 10174
756 6315
757 24725
758 12776
759 6898
760 6864
761 6859
762 16825
763 9422
764 9952
765 9621
766 9831
767 24725
768 6859
769 15166
770 7201
771 6906
772 7003
773 19564
774 13012
775 6969
776 6865
777 15257
778 13930
779 9673
780 9656
781 8051
782 8913
783 15254
784 22368
785 15260
786 7509
787 9073
788 9731
789 15585
790 9697
791 9792
792 13876
793 6865
794 10596
795 6272
796 6877
797 18508
798 12580
799 9617
800 9683
801 17236
802 7710
803 5788
804 6865
805 13065
806 6679
807 12721
808 9657
809 14057
810 9763
811 9757
812 14152
813 8372
814 7003
815 6896
816 6849
817 14440
818 7669
819 3610
820 6882
821 20887
822 7156
823 6876
824 6896
825 11418
826 6974
827 6789
828 6876
829 8492
830 6935
831 14990
832 12720
833 10580
834 9797
835 9642
836 6879
837 12925
838 6685
839 7180
840 14714
841 14073
842 10646
843 10403
844 10423
845 13481
846 6878
847 6905
848 16253
849 6851
850 15529
851 19403
852 12120
853 9756
854 9744
855 17448
856 10567
857 6260
858 6887
859 13052
860 6903
861 6876
862 9557
863 14457
864 9792
865 9700
866 9682
867 9487
868 13104
869 27031
870 19573
871 12506
872 6960
873 6890
874 6904
875 12073
876 6933
877 9697
878 9657
879 13424
880 9650
881 9715
882 6879
883 9190
884 6872
885 6862
886 6886
887 5958
888 10579
889 9881
890 9674
891 14554
892 6868
893 6864
894 7148
895 12091
896 8961
897 9721
898 9831
899 10968
900 9742
901 8344
902 13802
903 6993
904 6950
905 6879
906 10833
907 9869
908 9890
909 9886
910 11245
911 12009
912 6892
913 6880
914 14451
915 7764
916 6932
917 6852
918 13028
919 15076
920 9705
921 6901
922 11551
923 6850
924 6870
925 6872
926 10085
927 6939
928 6956
929 19522
930 9870
931 7177
932 9714
933 9706
934 15531
935 9747
936 6869
937 6873
938 11105
939 7057
940 6857
941 6869
942 12756
943 9863
944 9727
945 9844
946 6620
947 5904
948 6994
949 10553
950 8366
951 6934
952 9131
953 9701
954 13697
955 9376
956 6896
957 6885
958 9461
959 6864
960 6920
961 6874
962 16181
963 10553
964 10336
965 16676
966 6952
967 6956
968 14768
969 11382
970 6959
971 6915
972 31665
973 16097
974 9068
975 6884
976 6884
977 14448
978 7769
979 6548
980 6878
981 13083
982 9807
983 9746
984 9722
985 14095
986 9748
987 6909
988 23897
989 9760
990 9714
991 6851
992 23877
993 8064
994 9772
995 9772
996 11021
997 6883
998 25603
999 13109