Test results:
no all malformed skipped:
0 110865 0 0
1 110842 0 0
2 110864 0 0
3 110856 0 0
4 110835 0 0
5 110847 0 0
6 110863 0 0
7 110860 0 0
8 110846 0 0
9 110835 0 0
10 110850 0 0
11 110864 0 0
12 110859 0 0
13 110843 0 0
14 110835 0 0
15 110851 0 0
16 110861 0 0
17 110861 0 0
18 110844 0 0
19 110833 0 0
20 110849 0 0
21 110858 0 0
22 110860 0 0
23 110848 0 0
24 110835 0 0
25 110847 0 0
26 110856 0 0
27 110862 0 0
28 110851 0 0
29 110833 0 0
30 110844 0 0
31 110857 0 0
32 110862 0 0
33 110851 0 0
34 110833 0 0
35 110843 0 0
36 110852 0 0
37 110865 0 0
38 110857 0 0
39 110840 0 0
40 110836 0 0
41 110851 0 0
42 110866 0 0
43 110862 0 0
44 110845 0 0
45 110830 0 0
46 110846 0 0
47 110861 0 0
48 110866 0 0
49 110854 0 0
50 110832 0 0
51 110839 0 0
52 110855 0 0
53 110867 0 0
54 110860 0 0
55 110842 0 0
56 110829 0 0
57 110848 0 0
58 110863 0 0
59 110865 0 0
60 110852 0 0
61 110831 0 0
62 110839 0 0
63 110856 0 0
64 110867 0 0
65 110860 0 0
66 110841 0 0
67 110832 0 0
68 110847 0 0
69 110862 0 0
70 110866 0 0
71 110853 0 0
72 110832 0 0
73 110841 0 0
74 110855 0 0
75 110867 0 0
76 110860 0 0
77 110844 0 0
78 110831 0 0
79 110845 0 0
80 110859 0 0
81 110865 0 0
82 110855 0 0
83 110839 0 0
84 110836 0 0
85 110850 0 0
86 110860 0 0
87 110865 0 0
88 110852 0 0
89 110836 0 0
90 110837 0 0
91 110852 0 0
92 110860 0 0
93 110864 0 0
94 110858 0 0
95 110842 0 0
96 110833 0 0
97 110844 0 0
98 110857 0 0
99 110866 0 0