Test results:
no all malformed skipped:
0 151427 0 0
1 151421 0 0
2 151428 0 0
3 151429 0 0
4 151431 0 0
5 151427 0 0
6 151428 0 0
7 151429 0 0
8 151430 0 0
9 151430 0 0
10 151429 0 0
11 151428 0 0
12 151428 0 0
13 151430 0 0
14 151430 0 0
15 151428 0 0
16 151428 0 0
17 151428 0 0
18 151430 0 0
19 151429 0 0
20 151427 0 0
21 151427 0 0
22 151433 0 0
23 151432 0 0
24 151430 0 0
25 151427 0 0
26 151430 0 0
27 151433 0 0
28 151431 0 0
29 151430 0 0
30 151429 0 0
31 151429 0 0
32 151431 0 0
33 151433 0 0
34 151432 0 0
35 151430 0 0
36 151429 0 0
37 151430 0 0
38 151432 0 0
39 151432 0 0
40 151429 0 0
41 151430 0 0
42 151428 0 0
43 151428 0 0
44 151428 0 0
45 151428 0 0
46 151428 0 0
47 151429 0 0
48 151431 0 0
49 151429 0 0
50 151428 0 0
51 151427 0 0
52 151429 0 0
53 151430 0 0
54 151430 0 0
55 151428 0 0
56 151428 0 0
57 151427 0 0
58 151430 0 0
59 151430 0 0
60 151429 0 0
61 151428 0 0
62 151430 0 0
63 151430 0 0
64 151429 0 0
65 151429 0 0
66 151426 0 0
67 151428 0 0
68 151430 0 0
69 151430 0 0
70 151429 0 0
71 151427 0 0
72 151427 0 0
73 151429 0 0
74 151431 0 0
75 151430 0 0
76 151428 0 0
77 151428 0 0
78 151428 0 0
79 151429 0 0
80 151430 0 0
81 151427 0 0
82 151428 0 0
83 151429 0 0
84 151431 0 0
85 151430 0 0
86 151429 0 0
87 151427 0 0
88 151428 0 0
89 151430 0 0
90 151429 0 0
91 151431 0 0
92 151429 0 0
93 151428 0 0
94 151428 0 0
95 151430 0 0
96 151430 0 0
97 151429 0 0
98 151428 0 0
99 151427 0 0