Test results:
0 16130
1 9752
2 7966
3 13609
4 9788
5 9410
6 9710
7 13614
8 9813
9 9837
10 14485
11 10565
12 10206
13 8998
14 14831
15 10201
16 9815
17 7257
18 13451
19 9762
20 9876
21 16609
22 21685
23 9688
24 9627
25 17636
26 9749
27 9886
28 9933
29 10481
30 9828
31 10933
32 15544
33 4991
34 5861
35 9047
36 16539
37 12233
38 9809
39 9905
40 16190
41 9541
42 9808
43 16920
44 9927
45 9597
46 9698
47 16707
48 9099
49 9484
50 9709
51 15445
52 10247
53 9524
54 7482
55 14296
56 14547
57 7292
58 7218
59 15329
60 9727
61 7939
62 6707
63 15967
64 7630
65 7549
66 15045
67 16551
68 12217
69 9891
70 9815
71 15570
72 9486
73 5752
74 6872
75 10652
76 7259
77 15299
78 14994
79 9751
80 9871
81 9888
82 6737
83 6787
84 4754
85 4736
86 11874
87 12865
88 6746
89 9947
90 14406
91 9964
92 10139
93 14850
94 2706
95 11565
96 7225
97 17755
98 9836
99 9827
100 9938
101 14248
102 10033
103 7683
104 7535
105 9034
106 6933
107 7909
108 13682
109 6350
110 6305
111 7471
112 10130
113 10064
114 9902
115 9721
116 9147
117 6577
118 7078
119 12014
120 7537
121 31892
122 23473
123 18414
124 12657
125 9285
126 9748
127 13344
128 7608
129 6875
130 20835
131 6819
132 10325
133 9963
134 16723
135 9964
136 9584
137 10933
138 13380
139 2893
140 3887
141 11502
142 10321
143 10478
144 10508
145 15685
146 9873
147 7592
148 13855
149 15672
150 6730
151 7514
152 12448
153 6686
154 10651
155 9899
156 22273
157 14913
158 2341
159 6346
160 14734
161 35740
162 41713
163 46883
164 65423
165 1304
166 16770
167 13867
168 4719
169 4394
170 62566
171 50835
172 31852
173 26722
174 18771
175 0
176 0
177 0
178 20414
179 28844
180 22926
181 22451
182 0
183 6730
184 8533
185 5057
186 3935
187 6307
188 36391
189 22664
190 10096
191 5712
192 2500
193 7039
194 7390
195 7506
196 15424
197 11714
198 9350
199 27270
200 15965
201 5283
202 9813
203 20015
204 14514
205 12060
206 7233
207 7494
208 14936
209 7984
210 9981
211 10052
212 10308
213 9901
214 10497
215 12736
216 9917
217 7595
218 7015
219 12621
220 22911
221 28346
222 27418
223 7060
224 5080
225 9666
226 13010
227 7500
228 17725
229 6585
230 7755
231 5490
232 9683
233 9110
234 8740
235 8962
236 12677
237 6403
238 6149
239 14366
240 11799
241 7443
242 25654
243 15118
244 10566
245 9672
246 9951
247 9082
248 7087
249 7132
250 7172
251 20620
252 10411
253 10027
254 16902
255 9879
256 7247
257 7308
258 7177
259 7718
260 3946
261 4333
262 18945
263 7281
264 8754
265 12709
266 6727
267 16027
268 10603
269 17942
270 10273
271 7141
272 6614
273 12185
274 13640
275 7285
276 7143
277 17269
278 9388
279 10097
280 11240
281 7667
282 7220
283 15483
284 11129
285 7446
286 7535
287 19202
288 33546
289 24731
290 18363
291 13258
292 8072
293 5368
294 5238
295 9281
296 9409
297 6138
298 9205
299 11584
300 9187
301 14567
302 7947
303 10132
304 7319
305 7111
306 22577
307 9677
308 4836
309 7488
310 6708
311 2772
312 10376
313 10222
314 11682
315 9721
316 9434
317 28607
318 28351
319 24942
320 19011
321 14476
322 15183
323 10228
324 10108
325 22160
326 30078
327 22698
328 13444
329 7186
330 8736
331 10604
332 5958
333 8509
334 10486
335 14993
336 10007
337 7431
338 7256
339 25508
340 34096
341 34537
342 27640
343 19247
344 10485
345 10674
346 9207
347 10052
348 8570
349 5554
350 5175
351 4435
352 22121
353 6047
354 6359
355 15124
356 11193
357 11079
358 5208
359 10300
360 7295
361 7021
362 10051
363 10936
364 7294
365 15753
366 5182
367 9162
368 5227
369 9927
370 10145
371 14379
372 7589
373 18075
374 13625
375 6467
376 6390
377 9436
378 11784
379 9900
380 9815
381 14143
382 8300
383 6605
384 6339
385 20895
386 4344
387 6502
388 9739
389 11654
390 9340
391 9616
392 11607
393 3028
394 13522
395 8625
396 13599
397 9747
398 8121
399 12111
400 5284
401 5291
402 4594
403 9565
404 15307
405 9588
406 14399
407 5040
408 3903
409 7322
410 13786
411 10206
412 10155
413 16798
414 14587
415 26869
416 15525
417 9838
418 3938
419 7121
420 6607
421 6519
422 10096
423 9334
424 17351
425 9967
426 5435
427 10396
428 13482
429 10134
430 7288
431 7124
432 17914
433 8250
434 4292
435 5827
436 8444
437 6748
438 5970
439 13365
440 6310
441 3809
442 6038
443 14810
444 9388
445 11792
446 27083
447 27926
448 22372
449 22913
450 9943
451 3100
452 7232
453 7297
454 19131
455 14913
456 14093
457 8926
458 23793
459 26098
460 16577
461 7220
462 6487
463 7471
464 18806
465 6867
466 7372
467 25571
468 10162
469 10009
470 6089
471 5106
472 3261
473 4174
474 10049
475 10632
476 7414
477 17107
478 12885
479 9772
480 8194
481 7222
482 3731
483 3043
484 7409
485 11177
486 7362
487 15155
488 14050
489 4111
490 7033
491 4127
492 23645
493 10437
494 15616
495 6954
496 7202
497 15445
498 18714
499 16192
500 5331
501 4891
502 19144
503 4791
504 7746
505 20274
506 5923
507 2692
508 9100
509 16827
510 10327
511 16414
512 21712
513 30648
514 31335
515 22695
516 19957
517 10162
518 8969
519 7575
520 11918
521 7340
522 15277
523 10202
524 13608
525 6949
526 5040
527 3539
528 20761
529 8396
530 8429
531 7154
532 4840
533 4299
534 9024
535 11739
536 10216
537 7297
538 7420
539 7272
540 9896
541 9998
542 10366
543 9561
544 9532
545 12363
546 27245
547 20526
548 8425
549 16722
550 34119
551 14719
552 15367
553 10941
554 15816
555 16235
556 13394
557 5009
558 5479
559 5306
560 9292
561 7309
562 15310
563 11020
564 11356
565 7238
566 15480
567 8707
568 17612
569 12247
570 9936
571 7344
572 25564
573 6596
574 7802
575 7464
576 11252
577 14992
578 4938
579 19542
580 5970
581 4869
582 13979
583 6760
584 5796
585 14960
586 11418
587 10151
588 9672
589 16512
590 12165
591 11129
592 20365
593 9575
594 7604
595 15333
596 17983
597 12573
598 10210
599 10752
600 11868
601 8962
602 7005
603 5880
604 4891
605 7381
606 13040
607 6924
608 10420
609 7347
610 9743
611 9995
612 10221
613 18190
614 9808
615 8995
616 11770
617 4544
618 7462
619 7090
620 7367
621 7398
622 10403
623 10217
624 15679
625 11311
626 9408
627 13553
628 6170
629 5958
630 22932
631 10211
632 8492
633 8564
634 16302
635 6604
636 4650
637 7335
638 14753
639 8225
640 7465
641 15325
642 15813
643 9858
644 9982
645 13799
646 34275
647 26349
648 17210
649 7351
650 10312
651 3271
652 10780
653 22013
654 22684
655 11563
656 7441
657 4370
658 7393
659 7201
660 20673
661 6985
662 7086
663 13284
664 12759
665 9732
666 9188
667 46038
668 26377
669 19932
670 19293
671 11400
672 6643
673 7102
674 10104
675 34338
676 23726
677 23544
678 18928
679 13894
680 9688
681 7092
682 13265
683 7083
684 6884
685 13221
686 7134
687 9079
688 9849
689 9395
690 9826
691 6384
692 9594
693 22430
694 9666
695 13042
696 7269
697 9010
698 9713
699 9383
700 9644
701 7139
702 9618
703 14358
704 9502
705 17248
706 7122
707 6932
708 7062
709 19464
710 9729
711 9787
712 17124
713 6652
714 8348
715 8396
716 15040
717 8251
718 7379
719 7126
720 13046
721 6943
722 9968
723 10885
724 10564
725 12253
726 8622
727 15612
728 9725
729 7133
730 13855
731 14510
732 10522
733 10553
734 17929
735 16189
736 5243
737 11380
738 6117
739 7026
740 7085
741 7191
742 22699
743 10743
744 9457
745 12481
746 11364
747 6705
748 3831
749 17013
750 9846
751 8745
752 6390
753 17028
754 8497
755 7394
756 7183
757 11523
758 15568
759 9711
760 17630
761 9815
762 7161
763 7460
764 15389
765 12984
766 6893
767 14761
768 10196
769 11452
770 9741
771 6975
772 18228
773 8504
774 7353
775 7199
776 9978
777 14914
778 9843
779 15884
780 5577
781 4834
782 34407
783 28820
784 23856
785 18101
786 20182
787 9601
788 9890
789 9539
790 12288
791 10366
792 10123
793 17344
794 33395
795 28502
796 30446
797 19788
798 12084
799 5597
800 9719
801 16828
802 9976
803 9924
804 7008
805 7385
806 7293
807 15020
808 15441
809 12496
810 3608
811 7164
812 8484
813 7156
814 14517
815 8579
816 6884
817 14808
818 13326
819 5002
820 5130
821 9731
822 12182
823 9672
824 6810
825 13706
826 7214
827 26570
828 14288
829 9432
830 9907
831 9929
832 17299
833 10856
834 7246
835 7054
836 6626
837 19618
838 9817
839 5315
840 10760
841 5149
842 10042
843 9694
844 13851
845 9410
846 9717
847 9473
848 12868
849 6416
850 9987
851 15843
852 10951
853 6965
854 12997
855 17460
856 6835
857 9936
858 9983
859 12318
860 9803
861 9656
862 12287
863 7094
864 6953
865 14848
866 13238
867 8455
868 6976
869 10303
870 14048
871 10369
872 6690
873 12024
874 3552
875 3850
876 15554
877 12492
878 9908
879 10005
880 12366
881 10025
882 7093
883 15081
884 9945
885 6931
886 7277
887 15794
888 8482
889 10499
890 10005
891 14940
892 6619
893 6724
894 7295
895 11074
896 7048
897 10016
898 10014
899 10521
900 9932
901 10041
902 13541
903 8266
904 7059
905 6987
906 14074
907 3814
908 7666
909 12895
910 15367
911 10055
912 10125
913 16167
914 11770
915 9321
916 9430
917 13543
918 20742
919 22208
920 29806
921 16754
922 10214
923 10035
924 9993
925 12278
926 9163
927 9546
928 13147
929 7107
930 15064
931 10058
932 10393
933 8943
934 20547
935 9648
936 9474
937 6925
938 7811
939 14032
940 7922
941 5748
942 4114
943 10242
944 10752
945 9701
946 9784
947 13452
948 7215
949 21831
950 15203
951 10026
952 7209
953 24671
954 21827
955 13326
956 2164
957 3218
958 7688
959 8156
960 7063
961 7067
962 15186
963 8382
964 15048
965 9545
966 13447
967 9520
968 10006
969 17467
970 9786
971 8963
972 2432
973 4915
974 10231
975 6801
976 10175
977 15343
978 10106
979 10296
980 10808
981 7124
982 6603
983 10039
984 15126
985 6945
986 7272
987 28588
988 9712
989 10296
990 15358
991 6782
992 6950
993 18108
994 8417
995 7196
996 6975
997 15269
998 10805
999 9913