Test results:
no all malformed skipped:
0 212 0 0
1 213 0 0
2 214 0 0
3 212 0 0
4 213 0 0
5 214 0 0
6 213 0 0
7 213 0 0
8 213 0 0
9 214 0 0
10 213 0 0
11 214 0 0
12 212 0 0
13 213 0 0
14 213 0 0
15 213 0 0
16 213 0 0
17 214 0 0
18 213 0 0
19 213 0 0
20 214 0 0
21 213 0 0
22 213 0 0
23 213 0 0
24 212 0 0
25 213 0 0
26 213 0 0
27 213 0 0
28 212 0 0
29 214 0 0
30 212 0 0
31 213 0 0
32 213 0 0
33 214 0 0
34 213 0 0
35 213 0 0
36 214 0 0
37 213 0 0
38 214 0 0
39 213 0 0
40 213 0 0
41 214 0 0
42 213 0 0
43 213 0 0
44 214 0 0
45 213 0 0
46 213 0 0
47 214 0 0
48 213 0 0
49 214 0 0
50 213 0 0
51 213 0 0
52 214 0 0
53 213 0 0
54 213 0 0
55 213 0 0
56 213 0 0
57 212 0 0
58 213 0 0
59 213 0 0
60 214 0 0
61 213 0 0
62 214 0 0
63 213 0 0
64 213 0 0
65 213 0 0
66 213 0 0
67 212 0 0
68 214 0 0
69 212 0 0
70 214 0 0
71 213 0 0
72 213 0 0
73 214 0 0
74 213 0 0
75 213 0 0
76 214 0 0
77 213 0 0
78 213 0 0
79 214 0 0
80 213 0 0
81 213 0 0
82 214 0 0
83 213 0 0
84 213 0 0
85 214 0 0
86 213 0 0
87 213 0 0
88 213 0 0
89 213 0 0
90 212 0 0
91 213 0 0
92 213 0 0
93 213 0 0
94 213 0 0
95 214 0 0
96 213 0 0
97 213 0 0
98 214 0 0
99 213 0 0