Test results:
0 18076
1 11482
2 10919
3 10461
4 15207
5 10220
6 5887
7 4480
8 11685
9 8920
10 9549
11 10053
12 18225
13 11353
14 11336
15 11420
16 14818
17 9904
18 10752
19 10583
20 9595
21 9569
22 9767
23 8482
24 8895
25 4947
26 18969
27 6999
28 6034
29 4681
30 15396
31 21908
32 6287
33 24617
34 19201
35 7372
36 21138
37 5222
38 4598
39 4681
40 4951
41 5538
42 8448
43 4820
44 4945
45 7489
46 10031
47 15959
48 10901
49 18149
50 23083
51 13626
52 7575
53 8399
54 8155
55 15038
56 9434
57 14439
58 8266
59 13887
60 8209
61 6298
62 21626
63 8297
64 6283
65 7088
66 11933
67 15443
68 9671
69 9871
70 9634
71 10233
72 13547
73 9645
74 7567
75 7588
76 10369
77 15605
78 9772
79 17382
80 10862
81 7869
82 24785
83 13747
84 7949
85 7811
86 7220
87 15248
88 10490
89 10319
90 10571
91 13497
92 9816
93 9742
94 15981
95 9437
96 15217
97 10054
98 14570
99 7898
100 7891
101 7825
102 13121
103 7858
104 7463
105 4980
106 11234
107 14806
108 9480
109 9808
110 12405
111 9588
112 9598
113 18537
114 8904
115 8311
116 7362
117 21775
118 11104
119 9509
120 9596
121 15246
122 9590
123 9446
124 7204
125 8737
126 7148
127 15481
128 9576
129 12663
130 9947
131 9322
132 17259
133 10955
134 10594
135 9666
136 16102
137 9791
138 9640
139 9576
140 14261
141 9845
142 10711
143 7426
144 10284
145 16179
146 7950
147 31685
148 12058
149 11591
150 10544
151 16800
152 9598
153 7575
154 8709
155 20100
156 10384
157 10244
158 9767
159 13548
160 9643
161 9925
162 7218
163 7612
164 4307
165 4325
166 15481
167 11486
168 10119
169 9864
170 16457
171 9783
172 7116
173 7144
174 22260
175 9692
176 9769
177 9788
178 14274
179 11318
180 10297
181 10528
182 9933
183 8259
184 15425
185 17669
186 10494
187 9700
188 9834
189 15852
190 9483
191 9687
192 7133
193 13128
194 9648
195 9713
196 10625
197 10694
198 8517
199 7652
200 18283
201 12175
202 10407
203 10368
204 14066
205 10432
206 9985
207 7175
208 13182
209 7175
210 15909
211 10295
212 14981
213 11164
214 10380
215 10759
216 12070
217 7360
218 6923
219 15067
220 9870
221 9749
222 9767
223 16542
224 5941
225 9755
226 9993
227 12138
228 7072
229 7149
230 15762
231 14109
232 10027
233 10953
234 18675
235 12637
236 9769
237 7434
238 14580
239 16163
240 9756
241 7178
242 13384
243 15811
244 10068
245 9537
246 12347
247 7260
248 7804
249 15693
250 14843
251 7482
252 10362
253 19715
254 12382
255 7937
256 7735
257 9560
258 12009
259 9990
260 10087
261 12304
262 7338
263 7750
264 5653
265 4986
266 8405
267 10020
268 9362
269 14246
270 9839
271 7182
272 7215
273 10486
274 7406
275 7037
276 14605
277 22062
278 9949
279 10233
280 15878
281 8389
282 10760
283 11795
284 12772
285 6751
286 7175
287 24737
288 12244
289 10034
290 9918
291 14726
292 22941
293 10009
294 10125
295 13556
296 7181
297 7190
298 15590
299 14617
300 10367
301 7361
302 10020
303 12551
304 10751
305 9484
306 17970
307 8420
308 9743
309 9672
310 15618
311 7258
312 9710
313 11575
314 15414
315 15253
316 10146
317 7617
318 25130
319 13094
320 9651
321 10622
322 18517
323 11484
324 9711
325 9650
326 18706
327 8838
328 10638
329 12232
330 17676
331 11942
332 11108
333 12684
334 11172
335 9361
336 11313
337 10264
338 7147
339 7153
340 17495
341 11401
342 9768
343 9707
344 15678
345 12835
346 14860
347 9866
348 15825
349 7407
350 10258
351 10499
352 15843
353 9801
354 7211
355 6957
356 21417
357 9286
358 11610
359 6807
360 9090
361 4831
362 23585
363 12425
364 8079
365 8789
366 7936
367 23759
368 11296
369 9843
370 9825
371 14057
372 24053
373 7398
374 7578
375 19227
376 9694
377 9717
378 19905
379 12665
380 12681
381 12558
382 16511
383 9941
384 8854
385 16106
386 14660
387 11622
388 9758
389 9840
390 14512
391 9426
392 9807
393 18590
394 9054
395 15070
396 12596
397 14995
398 11015
399 7803
400 7693
401 21107
402 11246
403 6771
404 9774
405 14271
406 9328
407 7191
408 7106
409 10369
410 7169
411 18557
412 9325
413 14395
414 12143
415 11806
416 16622
417 12190
418 8347
419 8345
420 19634
421 9497
422 9723
423 6964
424 13638
425 9430
426 9433
427 9520
428 9665
429 7103
430 16740
431 17151
432 11916
433 11477
434 11144
435 16079
436 9296
437 9456
438 7211
439 23238
440 9857
441 9436
442 7426
443 10608
444 16516
445 9463
446 19210
447 11898
448 8610
449 28025
450 12929
451 10353
452 8797
453 8830
454 19859
455 11167
456 8666
457 10810
458 14381
459 10232
460 10716
461 14547
462 13469
463 7098
464 8402
465 11695
466 14328
467 11634
468 10937
469 10211
470 10963
471 7114
472 7610
473 21555
474 9458
475 9975
476 7118
477 14381
478 9466
479 9893
480 9339
481 10315
482 8024
483 7716
484 15082
485 10883
486 3751
487 8748
488 16077
489 9416
490 9583
491 7233
492 11992
493 14749
494 9535
495 9483
496 10877
497 7837
498 7665
499 15573
500 12131
501 7062
502 9465
503 17064
504 9991
505 10182
506 9620
507 13098
508 7302
509 16910
510 5280
511 11201
512 21252
513 9755
514 9954
515 11949
516 9684
517 4079
518 3257
519 15811
520 9957
521 10052
522 16061
523 10303
524 9057
525 9411
526 16149
527 7349
528 7648
529 16608
530 13176
531 12652
532 8034
533 5223
534 10111
535 12871
536 10276
537 7111
538 24694
539 12418
540 9560
541 7147
542 9683
543 11553
544 9502
545 7005
546 14872
547 8160
548 8694
549 10406
550 10610
551 8222
552 15943
553 16144
554 11903
555 7014
556 7223
557 17907
558 9757
559 9602
560 9462
561 9645
562 21822
563 4860
564 9012
565 8812
566 7658
567 15485
568 16491
569 8472
570 4927
571 3255
572 8825
573 9854
574 3204
575 3468
576 19473
577 9463
578 9010
579 9464
580 12193
581 9609
582 8776
583 6538
584 8335
585 6680
586 6412
587 21132
588 30769
589 24390
590 17037
591 9709
592 10092
593 9904
594 14133
595 7616
596 18758
597 8405
598 11903
599 7343
600 7572
601 7118
602 17359
603 9168
604 9264
605 10530
606 21154
607 3313
608 5084
609 14912
610 6983
611 19632
612 7345
613 4620
614 4462
615 5334
616 11785
617 12785
618 5484
619 14362
620 7515
621 7192
622 8997
623 20686
624 9212
625 9504
626 10978
627 8732
628 13318
629 7055
630 10206
631 9882
632 14058
633 10574
634 9786
635 9306
636 13444
637 7086
638 7272
639 9663
640 11211
641 7070
642 26678
643 16041
644 7539
645 15526
646 11177
647 17395
648 9665
649 11844
650 11314
651 11126
652 10108
653 7546
654 7067
655 14502
656 9392
657 15195
658 22027
659 15471
660 9493
661 9872
662 6805
663 11878
664 7782
665 7878
666 8399
667 12673
668 9227
669 9463
670 13532
671 9502
672 7077
673 7087
674 15026
675 9977
676 9987
677 10241
678 11324
679 10086
680 10371
681 16990
682 7504
683 7595
684 15625
685 15124
686 9914
687 9304
688 9671
689 12976
690 9656
691 9258
692 7104
693 9183
694 15042
695 10165
696 10835
697 8191
698 7653
699 7734
700 20605
701 10455
702 9264
703 9237
704 13693
705 11360
706 9539
707 7218
708 10147
709 7690
710 14966
711 10873
712 11716
713 10129
714 9663
715 16804
716 10374
717 7223
718 7207
719 12515
720 14605
721 9449
722 9520
723 13717
724 9533
725 9239
726 9278
727 9578
728 7080
729 7105
730 14882
731 10767
732 9994
733 9848
734 16129
735 9217
736 9335
737 7106
738 12073
739 14570
740 9224
741 7448
742 7342
743 15464
744 6606
745 12448
746 8706
747 8650
748 8774
749 21928
750 12021
751 7888
752 7695
753 15073
754 17033
755 10284
756 7254
757 9257
758 16350
759 9297
760 10299
761 7687
762 12310
763 8337
764 9221
765 9450
766 7484
767 15177
768 16743
769 9724
770 9272
771 7013
772 23255
773 7084
774 9602
775 7085
776 10976
777 15050
778 10303
779 9971
780 13204
781 4660
782 9148
783 14386
784 5469
785 4237
786 7251
787 20681
788 6081
789 6015
790 9328
791 11672
792 23772
793 9502
794 9447
795 10674
796 8154
797 7860
798 15044
799 11595
800 7247
801 4269
802 16945
803 11244
804 9453
805 9622
806 15001
807 7048
808 10092
809 9762
810 12217
811 7211
812 15563
813 10725
814 13315
815 10037
816 10720
817 6995
818 24615
819 9638
820 9429
821 12528
822 9742
823 9313
824 9309
825 15249
826 9527
827 7088
828 23147
829 12876
830 9810
831 9302
832 10748
833 11261
834 9356
835 9716
836 9603
837 10082
838 9624
839 9393
840 15679
841 9118
842 10237
843 9555
844 11120
845 7192
846 15409
847 14707
848 10488
849 11048
850 15483
851 10164
852 10456
853 10395
854 9664
855 7093
856 15591
857 13107
858 10755
859 9653
860 9320
861 12460
862 12062
863 13209
864 7383
865 7748
866 7243
867 17551
868 9576
869 9660
870 9587
871 11417
872 9786
873 7132
874 14210
875 15094
876 9917
877 9651
878 15022
879 10331
880 7814
881 6826
882 24816
883 7408
884 7828
885 14619
886 12977
887 9882
888 10367
889 17237
890 10838
891 11814
892 7860
893 2885
894 13270
895 7202
896 8178
897 7639
898 13925
899 7556
900 6968
901 6787
902 33607
903 25102
904 17859
905 10962
906 9901
907 7526
908 16017
909 7465
910 7468
911 7101
912 16245
913 10829
914 9878
915 11096
916 13856
917 7477
918 7994
919 7337
920 18348
921 6841
922 6634
923 19614
924 11095
925 10242
926 9796
927 19057
928 10207
929 9398
930 12046
931 15448
932 11793
933 11091
934 10076
935 14292
936 9989
937 10230
938 7141
939 9750
940 17874
941 4047
942 12011
943 8562
944 19647
945 16649
946 19442
947 17547
948 13405
949 14224
950 12915
951 8882
952 7833
953 4270
954 10081
955 4507
956 9605
957 4839
958 10054
959 9472
960 16162
961 4344
962 9403
963 7640
964 15633
965 17022
966 8430
967 9651
968 9630
969 15249
970 9262
971 7104
972 7092
973 13367
974 5414
975 5356
976 8202
977 14366
978 11371
979 11226
980 11372
981 9042
982 9166
983 8479
984 12937
985 7133
986 7400
987 9740
988 13996
989 9949
990 6721
991 4109
992 7082
993 15748
994 10174
995 17391
996 8974
997 7625
998 7700
999 18426
