%TF.GenerationSoftware,KiCad,Pcbnew,7.0.2*%
%TF.CreationDate,2023-08-10T20:25:35+02:00*%
%TF.ProjectId,PropellerClockPCB,50726f70-656c-46c6-9572-436c6f636b50,v1.0.0*%
%TF.SameCoordinates,Original*%
%TF.FileFunction,Drillmap*%
%TF.FilePolarity,Positive*%
%FSLAX45Y45*%
G04 Gerber Fmt 4.5, Leading zero omitted, Abs format (unit mm)*
G04 Created by KiCad (PCBNEW 7.0.2) date 2023-08-10 20:25:35*
%MOMM*%
%LPD*%
G01*
G04 APERTURE LIST*
%ADD10C,0.250000*%
%ADD11C,0.200000*%
G04 APERTURE END LIST*
D10*
X9375000Y-21160000D02*
X6625000Y-21160000D01*
X6625000Y-23910000D02*
X9375000Y-23910000D01*
X6625000Y-21160000D02*
X6625000Y-23910000D01*
X9375000Y-23910000D02*
X9375000Y-21160000D01*
D11*
X7900000Y-22435000D02*
X8100000Y-22635000D01*
X8100000Y-22435000D02*
X7900000Y-22635000D01*
X8100000Y-23150000D02*
X8100000Y-21920000D01*
X8100000Y-21920000D02*
G75*
G03*
X7900000Y-21920000I-100000J0D01*
G01*
X7900000Y-21920000D02*
X7900000Y-23150000D01*
X7900000Y-23150000D02*
G75*
G03*
X8100000Y-23150000I100000J0D01*
G01*
X6860119Y-24235024D02*
X6860119Y-24035024D01*
X6860119Y-24035024D02*
X6907738Y-24035024D01*
X6907738Y-24035024D02*
X6936309Y-24044548D01*
X6936309Y-24044548D02*
X6955357Y-24063595D01*
X6955357Y-24063595D02*
X6964881Y-24082643D01*
X6964881Y-24082643D02*
X6974405Y-24120738D01*
X6974405Y-24120738D02*
X6974405Y-24149309D01*
X6974405Y-24149309D02*
X6964881Y-24187405D01*
X6964881Y-24187405D02*
X6955357Y-24206452D01*
X6955357Y-24206452D02*
X6936309Y-24225500D01*
X6936309Y-24225500D02*
X6907738Y-24235024D01*
X6907738Y-24235024D02*
X6860119Y-24235024D01*
X7060119Y-24235024D02*
X7060119Y-24101690D01*
X7060119Y-24139786D02*
X7069643Y-24120738D01*
X7069643Y-24120738D02*
X7079167Y-24111214D01*
X7079167Y-24111214D02*
X7098214Y-24101690D01*
X7098214Y-24101690D02*
X7117262Y-24101690D01*
X7183928Y-24235024D02*
X7183928Y-24101690D01*
X7183928Y-24035024D02*
X7174405Y-24044548D01*
X7174405Y-24044548D02*
X7183928Y-24054071D01*
X7183928Y-24054071D02*
X7193452Y-24044548D01*
X7193452Y-24044548D02*
X7183928Y-24035024D01*
X7183928Y-24035024D02*
X7183928Y-24054071D01*
X7307738Y-24235024D02*
X7288690Y-24225500D01*
X7288690Y-24225500D02*
X7279167Y-24206452D01*
X7279167Y-24206452D02*
X7279167Y-24035024D01*
X7412500Y-24235024D02*
X7393452Y-24225500D01*
X7393452Y-24225500D02*
X7383928Y-24206452D01*
X7383928Y-24206452D02*
X7383928Y-24035024D01*
X7641071Y-24235024D02*
X7641071Y-24035024D01*
X7641071Y-24035024D02*
X7707738Y-24177881D01*
X7707738Y-24177881D02*
X7774405Y-24035024D01*
X7774405Y-24035024D02*
X7774405Y-24235024D01*
X7955357Y-24235024D02*
X7955357Y-24130262D01*
X7955357Y-24130262D02*
X7945833Y-24111214D01*
X7945833Y-24111214D02*
X7926786Y-24101690D01*
X7926786Y-24101690D02*
X7888690Y-24101690D01*
X7888690Y-24101690D02*
X7869643Y-24111214D01*
X7955357Y-24225500D02*
X7936309Y-24235024D01*
X7936309Y-24235024D02*
X7888690Y-24235024D01*
X7888690Y-24235024D02*
X7869643Y-24225500D01*
X7869643Y-24225500D02*
X7860119Y-24206452D01*
X7860119Y-24206452D02*
X7860119Y-24187405D01*
X7860119Y-24187405D02*
X7869643Y-24168357D01*
X7869643Y-24168357D02*
X7888690Y-24158833D01*
X7888690Y-24158833D02*
X7936309Y-24158833D01*
X7936309Y-24158833D02*
X7955357Y-24149309D01*
X8050595Y-24101690D02*
X8050595Y-24301690D01*
X8050595Y-24111214D02*
X8069643Y-24101690D01*
X8069643Y-24101690D02*
X8107738Y-24101690D01*
X8107738Y-24101690D02*
X8126786Y-24111214D01*
X8126786Y-24111214D02*
X8136309Y-24120738D01*
X8136309Y-24120738D02*
X8145833Y-24139786D01*
X8145833Y-24139786D02*
X8145833Y-24196928D01*
X8145833Y-24196928D02*
X8136309Y-24215976D01*
X8136309Y-24215976D02*
X8126786Y-24225500D01*
X8126786Y-24225500D02*
X8107738Y-24235024D01*
X8107738Y-24235024D02*
X8069643Y-24235024D01*
X8069643Y-24235024D02*
X8050595Y-24225500D01*
X8231548Y-24215976D02*
X8241071Y-24225500D01*
X8241071Y-24225500D02*
X8231548Y-24235024D01*
X8231548Y-24235024D02*
X8222024Y-24225500D01*
X8222024Y-24225500D02*
X8231548Y-24215976D01*
X8231548Y-24215976D02*
X8231548Y-24235024D01*
X8231548Y-24111214D02*
X8241071Y-24120738D01*
X8241071Y-24120738D02*
X8231548Y-24130262D01*
X8231548Y-24130262D02*
X8222024Y-24120738D01*
X8222024Y-24120738D02*
X8231548Y-24111214D01*
X8231548Y-24111214D02*
X8231548Y-24130262D01*
X6412500Y-24462500D02*
X6612500Y-24662500D01*
X6612500Y-24462500D02*
X6412500Y-24662500D01*
X6850595Y-24474071D02*
X6860119Y-24464548D01*
X6860119Y-24464548D02*
X6879167Y-24455024D01*
X6879167Y-24455024D02*
X6926786Y-24455024D01*
X6926786Y-24455024D02*
X6945833Y-24464548D01*
X6945833Y-24464548D02*
X6955357Y-24474071D01*
X6955357Y-24474071D02*
X6964881Y-24493119D01*
X6964881Y-24493119D02*
X6964881Y-24512167D01*
X6964881Y-24512167D02*
X6955357Y-24540738D01*
X6955357Y-24540738D02*
X6841071Y-24655024D01*
X6841071Y-24655024D02*
X6964881Y-24655024D01*
X7050595Y-24635976D02*
X7060119Y-24645500D01*
X7060119Y-24645500D02*
X7050595Y-24655024D01*
X7050595Y-24655024D02*
X7041071Y-24645500D01*
X7041071Y-24645500D02*
X7050595Y-24635976D01*
X7050595Y-24635976D02*
X7050595Y-24655024D01*
X7183928Y-24455024D02*
X7202976Y-24455024D01*
X7202976Y-24455024D02*
X7222024Y-24464548D01*
X7222024Y-24464548D02*
X7231548Y-24474071D01*
X7231548Y-24474071D02*
X7241071Y-24493119D01*
X7241071Y-24493119D02*
X7250595Y-24531214D01*
X7250595Y-24531214D02*
X7250595Y-24578833D01*
X7250595Y-24578833D02*
X7241071Y-24616928D01*
X7241071Y-24616928D02*
X7231548Y-24635976D01*
X7231548Y-24635976D02*
X7222024Y-24645500D01*
X7222024Y-24645500D02*
X7202976Y-24655024D01*
X7202976Y-24655024D02*
X7183928Y-24655024D01*
X7183928Y-24655024D02*
X7164881Y-24645500D01*
X7164881Y-24645500D02*
X7155357Y-24635976D01*
X7155357Y-24635976D02*
X7145833Y-24616928D01*
X7145833Y-24616928D02*
X7136309Y-24578833D01*
X7136309Y-24578833D02*
X7136309Y-24531214D01*
X7136309Y-24531214D02*
X7145833Y-24493119D01*
X7145833Y-24493119D02*
X7155357Y-24474071D01*
X7155357Y-24474071D02*
X7164881Y-24464548D01*
X7164881Y-24464548D02*
X7183928Y-24455024D01*
X7374405Y-24455024D02*
X7393452Y-24455024D01*
X7393452Y-24455024D02*
X7412500Y-24464548D01*
X7412500Y-24464548D02*
X7422024Y-24474071D01*
X7422024Y-24474071D02*
X7431548Y-24493119D01*
X7431548Y-24493119D02*
X7441071Y-24531214D01*
X7441071Y-24531214D02*
X7441071Y-24578833D01*
X7441071Y-24578833D02*
X7431548Y-24616928D01*
X7431548Y-24616928D02*
X7422024Y-24635976D01*
X7422024Y-24635976D02*
X7412500Y-24645500D01*
X7412500Y-24645500D02*
X7393452Y-24655024D01*
X7393452Y-24655024D02*
X7374405Y-24655024D01*
X7374405Y-24655024D02*
X7355357Y-24645500D01*
X7355357Y-24645500D02*
X7345833Y-24635976D01*
X7345833Y-24635976D02*
X7336309Y-24616928D01*
X7336309Y-24616928D02*
X7326786Y-24578833D01*
X7326786Y-24578833D02*
X7326786Y-24531214D01*
X7326786Y-24531214D02*
X7336309Y-24493119D01*
X7336309Y-24493119D02*
X7345833Y-24474071D01*
X7345833Y-24474071D02*
X7355357Y-24464548D01*
X7355357Y-24464548D02*
X7374405Y-24455024D01*
X7564881Y-24455024D02*
X7583929Y-24455024D01*
X7583929Y-24455024D02*
X7602976Y-24464548D01*
X7602976Y-24464548D02*
X7612500Y-24474071D01*
X7612500Y-24474071D02*
X7622024Y-24493119D01*
X7622024Y-24493119D02*
X7631548Y-24531214D01*
X7631548Y-24531214D02*
X7631548Y-24578833D01*
X7631548Y-24578833D02*
X7622024Y-24616928D01*
X7622024Y-24616928D02*
X7612500Y-24635976D01*
X7612500Y-24635976D02*
X7602976Y-24645500D01*
X7602976Y-24645500D02*
X7583929Y-24655024D01*
X7583929Y-24655024D02*
X7564881Y-24655024D01*
X7564881Y-24655024D02*
X7545833Y-24645500D01*
X7545833Y-24645500D02*
X7536309Y-24635976D01*
X7536309Y-24635976D02*
X7526786Y-24616928D01*
X7526786Y-24616928D02*
X7517262Y-24578833D01*
X7517262Y-24578833D02*
X7517262Y-24531214D01*
X7517262Y-24531214D02*
X7526786Y-24493119D01*
X7526786Y-24493119D02*
X7536309Y-24474071D01*
X7536309Y-24474071D02*
X7545833Y-24464548D01*
X7545833Y-24464548D02*
X7564881Y-24455024D01*
X7717262Y-24655024D02*
X7717262Y-24521690D01*
X7717262Y-24540738D02*
X7726786Y-24531214D01*
X7726786Y-24531214D02*
X7745833Y-24521690D01*
X7745833Y-24521690D02*
X7774405Y-24521690D01*
X7774405Y-24521690D02*
X7793452Y-24531214D01*
X7793452Y-24531214D02*
X7802976Y-24550262D01*
X7802976Y-24550262D02*
X7802976Y-24655024D01*
X7802976Y-24550262D02*
X7812500Y-24531214D01*
X7812500Y-24531214D02*
X7831548Y-24521690D01*
X7831548Y-24521690D02*
X7860119Y-24521690D01*
X7860119Y-24521690D02*
X7879167Y-24531214D01*
X7879167Y-24531214D02*
X7888690Y-24550262D01*
X7888690Y-24550262D02*
X7888690Y-24655024D01*
X7983929Y-24655024D02*
X7983929Y-24521690D01*
X7983929Y-24540738D02*
X7993452Y-24531214D01*
X7993452Y-24531214D02*
X8012500Y-24521690D01*
X8012500Y-24521690D02*
X8041071Y-24521690D01*
X8041071Y-24521690D02*
X8060119Y-24531214D01*
X8060119Y-24531214D02*
X8069643Y-24550262D01*
X8069643Y-24550262D02*
X8069643Y-24655024D01*
X8069643Y-24550262D02*
X8079167Y-24531214D01*
X8079167Y-24531214D02*
X8098214Y-24521690D01*
X8098214Y-24521690D02*
X8126786Y-24521690D01*
X8126786Y-24521690D02*
X8145833Y-24531214D01*
X8145833Y-24531214D02*
X8155357Y-24550262D01*
X8155357Y-24550262D02*
X8155357Y-24655024D01*
X8545833Y-24445500D02*
X8374405Y-24702643D01*
X8802976Y-24455024D02*
X8822024Y-24455024D01*
X8822024Y-24455024D02*
X8841072Y-24464548D01*
X8841072Y-24464548D02*
X8850595Y-24474071D01*
X8850595Y-24474071D02*
X8860119Y-24493119D01*
X8860119Y-24493119D02*
X8869643Y-24531214D01*
X8869643Y-24531214D02*
X8869643Y-24578833D01*
X8869643Y-24578833D02*
X8860119Y-24616928D01*
X8860119Y-24616928D02*
X8850595Y-24635976D01*
X8850595Y-24635976D02*
X8841072Y-24645500D01*
X8841072Y-24645500D02*
X8822024Y-24655024D01*
X8822024Y-24655024D02*
X8802976Y-24655024D01*
X8802976Y-24655024D02*
X8783929Y-24645500D01*
X8783929Y-24645500D02*
X8774405Y-24635976D01*
X8774405Y-24635976D02*
X8764881Y-24616928D01*
X8764881Y-24616928D02*
X8755357Y-24578833D01*
X8755357Y-24578833D02*
X8755357Y-24531214D01*
X8755357Y-24531214D02*
X8764881Y-24493119D01*
X8764881Y-24493119D02*
X8774405Y-24474071D01*
X8774405Y-24474071D02*
X8783929Y-24464548D01*
X8783929Y-24464548D02*
X8802976Y-24455024D01*
X8955357Y-24635976D02*
X8964881Y-24645500D01*
X8964881Y-24645500D02*
X8955357Y-24655024D01*
X8955357Y-24655024D02*
X8945834Y-24645500D01*
X8945834Y-24645500D02*
X8955357Y-24635976D01*
X8955357Y-24635976D02*
X8955357Y-24655024D01*
X9088691Y-24455024D02*
X9107738Y-24455024D01*
X9107738Y-24455024D02*
X9126786Y-24464548D01*
X9126786Y-24464548D02*
X9136310Y-24474071D01*
X9136310Y-24474071D02*
X9145834Y-24493119D01*
X9145834Y-24493119D02*
X9155357Y-24531214D01*
X9155357Y-24531214D02*
X9155357Y-24578833D01*
X9155357Y-24578833D02*
X9145834Y-24616928D01*
X9145834Y-24616928D02*
X9136310Y-24635976D01*
X9136310Y-24635976D02*
X9126786Y-24645500D01*
X9126786Y-24645500D02*
X9107738Y-24655024D01*
X9107738Y-24655024D02*
X9088691Y-24655024D01*
X9088691Y-24655024D02*
X9069643Y-24645500D01*
X9069643Y-24645500D02*
X9060119Y-24635976D01*
X9060119Y-24635976D02*
X9050595Y-24616928D01*
X9050595Y-24616928D02*
X9041072Y-24578833D01*
X9041072Y-24578833D02*
X9041072Y-24531214D01*
X9041072Y-24531214D02*
X9050595Y-24493119D01*
X9050595Y-24493119D02*
X9060119Y-24474071D01*
X9060119Y-24474071D02*
X9069643Y-24464548D01*
X9069643Y-24464548D02*
X9088691Y-24455024D01*
X9222024Y-24455024D02*
X9355357Y-24455024D01*
X9355357Y-24455024D02*
X9269643Y-24655024D01*
X9460119Y-24540738D02*
X9441072Y-24531214D01*
X9441072Y-24531214D02*
X9431548Y-24521690D01*
X9431548Y-24521690D02*
X9422024Y-24502643D01*
X9422024Y-24502643D02*
X9422024Y-24493119D01*
X9422024Y-24493119D02*
X9431548Y-24474071D01*
X9431548Y-24474071D02*
X9441072Y-24464548D01*
X9441072Y-24464548D02*
X9460119Y-24455024D01*
X9460119Y-24455024D02*
X9498215Y-24455024D01*
X9498215Y-24455024D02*
X9517262Y-24464548D01*
X9517262Y-24464548D02*
X9526786Y-24474071D01*
X9526786Y-24474071D02*
X9536310Y-24493119D01*
X9536310Y-24493119D02*
X9536310Y-24502643D01*
X9536310Y-24502643D02*
X9526786Y-24521690D01*
X9526786Y-24521690D02*
X9517262Y-24531214D01*
X9517262Y-24531214D02*
X9498215Y-24540738D01*
X9498215Y-24540738D02*
X9460119Y-24540738D01*
X9460119Y-24540738D02*
X9441072Y-24550262D01*
X9441072Y-24550262D02*
X9431548Y-24559786D01*
X9431548Y-24559786D02*
X9422024Y-24578833D01*
X9422024Y-24578833D02*
X9422024Y-24616928D01*
X9422024Y-24616928D02*
X9431548Y-24635976D01*
X9431548Y-24635976D02*
X9441072Y-24645500D01*
X9441072Y-24645500D02*
X9460119Y-24655024D01*
X9460119Y-24655024D02*
X9498215Y-24655024D01*
X9498215Y-24655024D02*
X9517262Y-24645500D01*
X9517262Y-24645500D02*
X9526786Y-24635976D01*
X9526786Y-24635976D02*
X9536310Y-24616928D01*
X9536310Y-24616928D02*
X9536310Y-24578833D01*
X9536310Y-24578833D02*
X9526786Y-24559786D01*
X9526786Y-24559786D02*
X9517262Y-24550262D01*
X9517262Y-24550262D02*
X9498215Y-24540738D01*
X9602976Y-24455024D02*
X9736310Y-24455024D01*
X9736310Y-24455024D02*
X9650595Y-24655024D01*
X9802976Y-24455024D02*
X9802976Y-24493119D01*
X9879167Y-24455024D02*
X9879167Y-24493119D01*
X10174405Y-24731214D02*
X10164881Y-24721690D01*
X10164881Y-24721690D02*
X10145834Y-24693119D01*
X10145834Y-24693119D02*
X10136310Y-24674071D01*
X10136310Y-24674071D02*
X10126786Y-24645500D01*
X10126786Y-24645500D02*
X10117262Y-24597881D01*
X10117262Y-24597881D02*
X10117262Y-24559786D01*
X10117262Y-24559786D02*
X10126786Y-24512167D01*
X10126786Y-24512167D02*
X10136310Y-24483595D01*
X10136310Y-24483595D02*
X10145834Y-24464548D01*
X10145834Y-24464548D02*
X10164881Y-24435976D01*
X10164881Y-24435976D02*
X10174405Y-24426452D01*
X10355357Y-24655024D02*
X10241072Y-24655024D01*
X10298215Y-24655024D02*
X10298215Y-24455024D01*
X10298215Y-24455024D02*
X10279167Y-24483595D01*
X10279167Y-24483595D02*
X10260119Y-24502643D01*
X10260119Y-24502643D02*
X10241072Y-24512167D01*
X10583929Y-24645500D02*
X10602977Y-24655024D01*
X10602977Y-24655024D02*
X10641072Y-24655024D01*
X10641072Y-24655024D02*
X10660119Y-24645500D01*
X10660119Y-24645500D02*
X10669643Y-24626452D01*
X10669643Y-24626452D02*
X10669643Y-24616928D01*
X10669643Y-24616928D02*
X10660119Y-24597881D01*
X10660119Y-24597881D02*
X10641072Y-24588357D01*
X10641072Y-24588357D02*
X10612500Y-24588357D01*
X10612500Y-24588357D02*
X10593453Y-24578833D01*
X10593453Y-24578833D02*
X10583929Y-24559786D01*
X10583929Y-24559786D02*
X10583929Y-24550262D01*
X10583929Y-24550262D02*
X10593453Y-24531214D01*
X10593453Y-24531214D02*
X10612500Y-24521690D01*
X10612500Y-24521690D02*
X10641072Y-24521690D01*
X10641072Y-24521690D02*
X10660119Y-24531214D01*
X10783929Y-24655024D02*
X10764881Y-24645500D01*
X10764881Y-24645500D02*
X10755358Y-24626452D01*
X10755358Y-24626452D02*
X10755358Y-24455024D01*
X10888691Y-24655024D02*
X10869643Y-24645500D01*
X10869643Y-24645500D02*
X10860119Y-24635976D01*
X10860119Y-24635976D02*
X10850596Y-24616928D01*
X10850596Y-24616928D02*
X10850596Y-24559786D01*
X10850596Y-24559786D02*
X10860119Y-24540738D01*
X10860119Y-24540738D02*
X10869643Y-24531214D01*
X10869643Y-24531214D02*
X10888691Y-24521690D01*
X10888691Y-24521690D02*
X10917262Y-24521690D01*
X10917262Y-24521690D02*
X10936310Y-24531214D01*
X10936310Y-24531214D02*
X10945834Y-24540738D01*
X10945834Y-24540738D02*
X10955358Y-24559786D01*
X10955358Y-24559786D02*
X10955358Y-24616928D01*
X10955358Y-24616928D02*
X10945834Y-24635976D01*
X10945834Y-24635976D02*
X10936310Y-24645500D01*
X10936310Y-24645500D02*
X10917262Y-24655024D01*
X10917262Y-24655024D02*
X10888691Y-24655024D01*
X11012500Y-24521690D02*
X11088691Y-24521690D01*
X11041072Y-24455024D02*
X11041072Y-24626452D01*
X11041072Y-24626452D02*
X11050596Y-24645500D01*
X11050596Y-24645500D02*
X11069643Y-24655024D01*
X11069643Y-24655024D02*
X11088691Y-24655024D01*
X11136310Y-24731214D02*
X11145834Y-24721690D01*
X11145834Y-24721690D02*
X11164881Y-24693119D01*
X11164881Y-24693119D02*
X11174405Y-24674071D01*
X11174405Y-24674071D02*
X11183929Y-24645500D01*
X11183929Y-24645500D02*
X11193453Y-24597881D01*
X11193453Y-24597881D02*
X11193453Y-24559786D01*
X11193453Y-24559786D02*
X11183929Y-24512167D01*
X11183929Y-24512167D02*
X11174405Y-24483595D01*
X11174405Y-24483595D02*
X11164881Y-24464548D01*
X11164881Y-24464548D02*
X11145834Y-24435976D01*
X11145834Y-24435976D02*
X11136310Y-24426452D01*
M02*
