%TF.GenerationSoftware,KiCad,Pcbnew,7.0.2*%
%TF.CreationDate,2023-08-10T20:20:58+02:00*%
%TF.ProjectId,PropellerClockPCB,50726f70-656c-46c6-9572-436c6f636b50,v1.0.0*%
%TF.SameCoordinates,Original*%
%TF.FileFunction,Copper,L2,Bot*%
%TF.FilePolarity,Positive*%
%FSLAX46Y46*%
G04 Gerber Fmt 4.6, Leading zero omitted, Abs format (unit mm)*
G04 Created by KiCad (PCBNEW 7.0.2) date 2023-08-10 20:20:58*
%MOMM*%
%LPD*%
G01*
G04 APERTURE LIST*
G04 Aperture macros list*
%AMRoundRect*
0 Rectangle with rounded corners*
0 $1 Rounding radius*
0 $2 $3 $4 $5 $6 $7 $8 $9 X,Y pos of 4 corners*
0 Add a 4 corners polygon primitive as box body*
4,1,4,$2,$3,$4,$5,$6,$7,$8,$9,$2,$3,0*
0 Add four circle primitives for the rounded corners*
1,1,$1+$1,$2,$3*
1,1,$1+$1,$4,$5*
1,1,$1+$1,$6,$7*
1,1,$1+$1,$8,$9*
0 Add four rect primitives between the rounded corners*
20,1,$1+$1,$2,$3,$4,$5,0*
20,1,$1+$1,$4,$5,$6,$7,0*
20,1,$1+$1,$6,$7,$8,$9,0*
20,1,$1+$1,$8,$9,$2,$3,0*%
G04 Aperture macros list end*
%TA.AperFunction,ComponentPad*%
%ADD10O,25.900000X4.400000*%
%TD*%
%TA.AperFunction,ComponentPad*%
%ADD11O,1.000000X1.700000*%
%TD*%
%TA.AperFunction,WasherPad*%
%ADD12C,1.200000*%
%TD*%
%TA.AperFunction,ComponentPad*%
%ADD13C,2.400000*%
%TD*%
%TA.AperFunction,ComponentPad*%
%ADD14R,2.400000X2.400000*%
%TD*%
%TA.AperFunction,ComponentPad*%
%ADD15C,2.000000*%
%TD*%
%TA.AperFunction,ComponentPad*%
%ADD16RoundRect,0.250000X-0.750000X-0.750000X0.750000X-0.750000X0.750000X0.750000X-0.750000X0.750000X0*%
%TD*%
G04 APERTURE END LIST*
D10*
%TO.P,H2,1,1*%
%TO.N,GND2*%
X160000000Y-124896000D03*
%TD*%
D11*
%TO.P,J3,6,Shield*%
%TO.N,GND2*%
X156250000Y-102360000D03*
X149000000Y-102360000D03*
D12*
%TO.P,J3,*%
%TO.N,*%
X155050000Y-105010000D03*
X150200000Y-105010000D03*
%TD*%
D13*
%TO.P,SW1,6,C*%
%TO.N,/BasePCB_+5V_Switched*%
X250000000Y-117296000D03*
%TO.P,SW1,5,B*%
%TO.N,/BasePCB_+5V*%
X243000000Y-117296000D03*
%TO.P,SW1,4,A*%
%TO.N,Net-(SW1A-A)*%
X236000000Y-117296000D03*
%TO.P,SW1,3,C*%
%TO.N,/BasePCB_+5V_Switched*%
X250000000Y-111296000D03*
%TO.P,SW1,2,B*%
%TO.N,/BasePCB_+5V*%
X243000000Y-111296000D03*
D14*
%TO.P,SW1,1,A*%
%TO.N,Net-(SW1A-A)*%
X236000000Y-111296000D03*
%TD*%
D15*
%TO.P,J6,3,Pin_3*%
%TO.N,GND2*%
X171000000Y-108296000D03*
%TO.P,J6,2,Pin_2*%
%TO.N,/BasePCB_+5V_Switched*%
X166500000Y-108296000D03*
D16*
%TO.P,J6,1,Pin_1*%
%TO.N,/BasePCB_+5V*%
X162000000Y-108296000D03*
%TD*%
%TA.AperFunction,Conductor*%
%TO.N,/BasePCB_+5V*%
G36*
X148265438Y-101116185D02*
G01*
X148311193Y-101168989D01*
X148321137Y-101238147D01*
X148292112Y-101301703D01*
X148283832Y-101310373D01*
X148236948Y-101354940D01*
X148120705Y-101521950D01*
X148081456Y-101613412D01*
X148040460Y-101708942D01*
X147999500Y-101908259D01*
X147999500Y-102760742D01*
X147999816Y-102763853D01*
X147999817Y-102763865D01*
X148014926Y-102912440D01*
X148045868Y-103011058D01*
X148075841Y-103106588D01*
X148174591Y-103284502D01*
X148307134Y-103438895D01*
X148468042Y-103563448D01*
X148650729Y-103653060D01*
X148847715Y-103704063D01*
X149050936Y-103714369D01*
X149050936Y-103714368D01*
X149050937Y-103714369D01*
X149252071Y-103683556D01*
X149334413Y-103653060D01*
X149442887Y-103612886D01*
X149615571Y-103505252D01*
X149763053Y-103365059D01*
X149879295Y-103198049D01*
X149959540Y-103011058D01*
X150000500Y-102811741D01*
X150000500Y-101959258D01*
X149985074Y-101807562D01*
X149924159Y-101613412D01*
X149825409Y-101435498D01*
X149710175Y-101301268D01*
X149681445Y-101237582D01*
X149691707Y-101168470D01*
X149737704Y-101115877D01*
X149804263Y-101096500D01*
X155448399Y-101096500D01*
X155515438Y-101116185D01*
X155561193Y-101168989D01*
X155571137Y-101238147D01*
X155542112Y-101301703D01*
X155533832Y-101310373D01*
X155486948Y-101354940D01*
X155370705Y-101521950D01*
X155331456Y-101613412D01*
X155290460Y-101708942D01*
X155249500Y-101908259D01*
X155249500Y-102760742D01*
X155249816Y-102763853D01*
X155249817Y-102763865D01*
X155264926Y-102912440D01*
X155295868Y-103011058D01*
X155325841Y-103106588D01*
X155424591Y-103284502D01*
X155557134Y-103438895D01*
X155718042Y-103563448D01*
X155900729Y-103653060D01*
X156097715Y-103704063D01*
X156300936Y-103714369D01*
X156300936Y-103714368D01*
X156300937Y-103714369D01*
X156502071Y-103683556D01*
X156584413Y-103653060D01*
X156692887Y-103612886D01*
X156865571Y-103505252D01*
X157013053Y-103365059D01*
X157129295Y-103198049D01*
X157209540Y-103011058D01*
X157250500Y-102811741D01*
X157250500Y-101959258D01*
X157235074Y-101807562D01*
X157174159Y-101613412D01*
X157075409Y-101435498D01*
X156960175Y-101301268D01*
X156931445Y-101237582D01*
X156941707Y-101168470D01*
X156987704Y-101115877D01*
X157054263Y-101096500D01*
X163870500Y-101096500D01*
X163937539Y-101116185D01*
X163983294Y-101168989D01*
X163994500Y-101220499D01*
X163994500Y-101220500D01*
X163994500Y-108295998D01*
X163994500Y-110101000D01*
X163994500Y-113922000D01*
X163994854Y-113925294D01*
X163994855Y-113925309D01*
X164005697Y-114026145D01*
X164006053Y-114029456D01*
X164006757Y-114032693D01*
X164006759Y-114032704D01*
X164016553Y-114077722D01*
X164017259Y-114080967D01*
X164018305Y-114084110D01*
X164018309Y-114084124D01*
X164051385Y-114183503D01*
X164129173Y-114304541D01*
X164129175Y-114304543D01*
X164174930Y-114357347D01*
X164283664Y-114451567D01*
X164414541Y-114511338D01*
X164481580Y-114531023D01*
X164481584Y-114531024D01*
X164624000Y-114551500D01*
X259575500Y-114551500D01*
X259642539Y-114571185D01*
X259688294Y-114623989D01*
X259699500Y-114675500D01*
X259699500Y-127871500D01*
X259679815Y-127938539D01*
X259627011Y-127984294D01*
X259575500Y-127995500D01*
X60424500Y-127995500D01*
X60357461Y-127975815D01*
X60311706Y-127923011D01*
X60300500Y-127871500D01*
X60300500Y-124896000D01*
X146544564Y-124896000D01*
X146544790Y-124899736D01*
X146564063Y-125218362D01*
X146564064Y-125218372D01*
X146564290Y-125222104D01*
X146564963Y-125225778D01*
X146564965Y-125225792D01*
X146622502Y-125539762D01*
X146622504Y-125539771D01*
X146623179Y-125543453D01*
X146720373Y-125855361D01*
X146854455Y-126153279D01*
X146856388Y-126156477D01*
X146856392Y-126156484D01*
X147021532Y-126429658D01*
X147021536Y-126429663D01*
X147023470Y-126432863D01*
X147224952Y-126690036D01*
X147455964Y-126921048D01*
X147713137Y-127122530D01*
X147992721Y-127291545D01*
X148290639Y-127425627D01*
X148602547Y-127522821D01*
X148923896Y-127581710D01*
X149168400Y-127596500D01*
X149170286Y-127596500D01*
X170829714Y-127596500D01*
X170831600Y-127596500D01*
X171076104Y-127581710D01*
X171397453Y-127522821D01*
X171709361Y-127425627D01*
X172007279Y-127291545D01*
X172286863Y-127122530D01*
X172544036Y-126921048D01*
X172775048Y-126690036D01*
X172976530Y-126432863D01*
X173145545Y-126153279D01*
X173279627Y-125855361D01*
X173376821Y-125543453D01*
X173435710Y-125222104D01*
X173455436Y-124896000D01*
X173435710Y-124569896D01*
X173376821Y-124248547D01*
X173279627Y-123936639D01*
X173145545Y-123638721D01*
X172976530Y-123359137D01*
X172775048Y-123101964D01*
X172544036Y-122870952D01*
X172286863Y-122669470D01*
X172283663Y-122667536D01*
X172283658Y-122667532D01*
X172010484Y-122502392D01*
X172010477Y-122502388D01*
X172007279Y-122500455D01*
X171709361Y-122366373D01*
X171397453Y-122269179D01*
X171393771Y-122268504D01*
X171393762Y-122268502D01*
X171079792Y-122210965D01*
X171079778Y-122210963D01*
X171076104Y-122210290D01*
X171072372Y-122210064D01*
X171072362Y-122210063D01*
X170833478Y-122195613D01*
X170833458Y-122195612D01*
X170831600Y-122195500D01*
X149168400Y-122195500D01*
X149166542Y-122195612D01*
X149166521Y-122195613D01*
X148927637Y-122210063D01*
X148927625Y-122210064D01*
X148923896Y-122210290D01*
X148920223Y-122210962D01*
X148920207Y-122210965D01*
X148606237Y-122268502D01*
X148606224Y-122268505D01*
X148602547Y-122269179D01*
X148598967Y-122270294D01*
X148598961Y-122270296D01*
X148294216Y-122365258D01*
X148294210Y-122365260D01*
X148290639Y-122366373D01*
X148287230Y-122367907D01*
X148287228Y-122367908D01*
X147996135Y-122498918D01*
X147996128Y-122498921D01*
X147992721Y-122500455D01*
X147989528Y-122502384D01*
X147989515Y-122502392D01*
X147716341Y-122667532D01*
X147716328Y-122667540D01*
X147713137Y-122669470D01*
X147710195Y-122671774D01*
X147710189Y-122671779D01*
X147458915Y-122868640D01*
X147455964Y-122870952D01*
X147453318Y-122873597D01*
X147453310Y-122873605D01*
X147227605Y-123099310D01*
X147227597Y-123099318D01*
X147224952Y-123101964D01*
X147222640Y-123104914D01*
X147222640Y-123104915D01*
X147025779Y-123356189D01*
X147025774Y-123356195D01*
X147023470Y-123359137D01*
X147021540Y-123362328D01*
X147021532Y-123362341D01*
X146856392Y-123635515D01*
X146856384Y-123635528D01*
X146854455Y-123638721D01*
X146720373Y-123936639D01*
X146623179Y-124248547D01*
X146622505Y-124252224D01*
X146622502Y-124252237D01*
X146564965Y-124566207D01*
X146564962Y-124566223D01*
X146564290Y-124569896D01*
X146564064Y-124573625D01*
X146564063Y-124573637D01*
X146544790Y-124892263D01*
X146544564Y-124896000D01*
X60300500Y-124896000D01*
X60300500Y-117295999D01*
X234294731Y-117295999D01*
X234313777Y-117550154D01*
X234370492Y-117798637D01*
X234463608Y-118035891D01*
X234590877Y-118256328D01*
X234591041Y-118256612D01*
X234749950Y-118455877D01*
X234936783Y-118629232D01*
X235147366Y-118772805D01*
X235376996Y-118883389D01*
X235620542Y-118958513D01*
X235872565Y-118996500D01*
X236127435Y-118996500D01*
X236379458Y-118958513D01*
X236623004Y-118883389D01*
X236852634Y-118772805D01*
X237063217Y-118629232D01*
X237250050Y-118455877D01*
X237408959Y-118256612D01*
X237536393Y-118035888D01*
X237629508Y-117798637D01*
X237686222Y-117550157D01*
X237705268Y-117296000D01*
X237705268Y-117295999D01*
X241295232Y-117295999D01*
X241314273Y-117550080D01*
X241370971Y-117798491D01*
X241464057Y-118035668D01*
X241591456Y-118256331D01*
X241633452Y-118308993D01*
X241633453Y-118308993D01*
X242397452Y-117544993D01*
X242407188Y-117574956D01*
X242495186Y-117713619D01*
X242614903Y-117826040D01*
X242749510Y-117900041D01*
X241986813Y-118662737D01*
X242147619Y-118772372D01*
X242377179Y-118882922D01*
X242620654Y-118958025D01*
X242872603Y-118996000D01*
X243127397Y-118996000D01*
X243379345Y-118958025D01*
X243622823Y-118882921D01*
X243852383Y-118772372D01*
X244013185Y-118662737D01*
X243247534Y-117897086D01*
X243315629Y-117870126D01*
X243448492Y-117773595D01*
X243553175Y-117647055D01*
X243601632Y-117544078D01*
X244366545Y-118308993D01*
X244366546Y-118308992D01*
X244408545Y-118256328D01*
X244535942Y-118035669D01*
X244629028Y-117798491D01*
X244685726Y-117550080D01*
X244704767Y-117295999D01*
X248294731Y-117295999D01*
X248313777Y-117550154D01*
X248370492Y-117798637D01*
X248463608Y-118035891D01*
X248590877Y-118256328D01*
X248591041Y-118256612D01*
X248749950Y-118455877D01*
X248936783Y-118629232D01*
X249147366Y-118772805D01*
X249376996Y-118883389D01*
X249620542Y-118958513D01*
X249872565Y-118996500D01*
X250127435Y-118996500D01*
X250379458Y-118958513D01*
X250623004Y-118883389D01*
X250852634Y-118772805D01*
X251063217Y-118629232D01*
X251250050Y-118455877D01*
X251408959Y-118256612D01*
X251536393Y-118035888D01*
X251629508Y-117798637D01*
X251686222Y-117550157D01*
X251705268Y-117296000D01*
X251686222Y-117041843D01*
X251629508Y-116793363D01*
X251536393Y-116556112D01*
X251408959Y-116335388D01*
X251250050Y-116136123D01*
X251063217Y-115962768D01*
X250852634Y-115819195D01*
X250623004Y-115708611D01*
X250379458Y-115633487D01*
X250127435Y-115595500D01*
X249872565Y-115595500D01*
X249620542Y-115633487D01*
X249376996Y-115708611D01*
X249147366Y-115819195D01*
X249146731Y-115819628D01*
X248936781Y-115962769D01*
X248749949Y-116136122D01*
X248749950Y-116136123D01*
X248632815Y-116283006D01*
X248591038Y-116335392D01*
X248463608Y-116556108D01*
X248370492Y-116793362D01*
X248313777Y-117041845D01*
X248294731Y-117295999D01*
X244704767Y-117295999D01*
X244685726Y-117041919D01*
X244629028Y-116793508D01*
X244535942Y-116556330D01*
X244408545Y-116335671D01*
X244366546Y-116283005D01*
X243602546Y-117047004D01*
X243592812Y-117017044D01*
X243504814Y-116878381D01*
X243385097Y-116765960D01*
X243250489Y-116691958D01*
X244013185Y-115929261D01*
X243852379Y-115819625D01*
X243622823Y-115709078D01*
X243379345Y-115633974D01*
X243127397Y-115596000D01*
X242872603Y-115596000D01*
X242620654Y-115633974D01*
X242377179Y-115709077D01*
X242147615Y-115819628D01*
X241986813Y-115929261D01*
X242752465Y-116694913D01*
X242684371Y-116721874D01*
X242551508Y-116818405D01*
X242446825Y-116944945D01*
X242398368Y-117047921D01*
X241633453Y-116283006D01*
X241591453Y-116335673D01*
X241464057Y-116556331D01*
X241370971Y-116793508D01*
X241314273Y-117041919D01*
X241295232Y-117295999D01*
X237705268Y-117295999D01*
X237686222Y-117041843D01*
X237629508Y-116793363D01*
X237536393Y-116556112D01*
X237408959Y-116335388D01*
X237250050Y-116136123D01*
X237063217Y-115962768D01*
X236852634Y-115819195D01*
X236623004Y-115708611D01*
X236379458Y-115633487D01*
X236127435Y-115595500D01*
X235872565Y-115595500D01*
X235620542Y-115633487D01*
X235376996Y-115708611D01*
X235147366Y-115819195D01*
X235146731Y-115819628D01*
X234936781Y-115962769D01*
X234749950Y-116136122D01*
X234749950Y-116136123D01*
X234632815Y-116283006D01*
X234591038Y-116335392D01*
X234463608Y-116556108D01*
X234370492Y-116793362D01*
X234313777Y-117041845D01*
X234294731Y-117295999D01*
X60300500Y-117295999D01*
X60300500Y-108046000D01*
X160500000Y-108046000D01*
X161650393Y-108046000D01*
X161590762Y-108163031D01*
X161569702Y-108296000D01*
X161590762Y-108428969D01*
X161650393Y-108546000D01*
X160500001Y-108546000D01*
X160500001Y-109092829D01*
X160500321Y-109099111D01*
X160510493Y-109198695D01*
X160565642Y-109365122D01*
X160657683Y-109514345D01*
X160781654Y-109638316D01*
X160930877Y-109730357D01*
X161097303Y-109785506D01*
X161196890Y-109795680D01*
X161203168Y-109795999D01*
X161749999Y-109795999D01*
X161750000Y-109795998D01*
X161750000Y-108645607D01*
X161867031Y-108705238D01*
X161966549Y-108721000D01*
X162033451Y-108721000D01*
X162132969Y-108705238D01*
X162250000Y-108645607D01*
X162250000Y-109795999D01*
X162796829Y-109795999D01*
X162803111Y-109795678D01*
X162902695Y-109785506D01*
X163069122Y-109730357D01*
X163218345Y-109638316D01*
X163342316Y-109514345D01*
X163434357Y-109365122D01*
X163489506Y-109198696D01*
X163499680Y-109099109D01*
X163500000Y-109092831D01*
X163500000Y-108546000D01*
X162349607Y-108546000D01*
X162409238Y-108428969D01*
X162430298Y-108296000D01*
X162409238Y-108163031D01*
X162349607Y-108046000D01*
X163499999Y-108046000D01*
X163499999Y-107499170D01*
X163499678Y-107492888D01*
X163489506Y-107393304D01*
X163434357Y-107226877D01*
X163342316Y-107077654D01*
X163218345Y-106953683D01*
X163069122Y-106861642D01*
X162902696Y-106806493D01*
X162803109Y-106796319D01*
X162796832Y-106796000D01*
X162250000Y-106796000D01*
X162250000Y-107946392D01*
X162132969Y-107886762D01*
X162033451Y-107871000D01*
X161966549Y-107871000D01*
X161867031Y-107886762D01*
X161750000Y-107946392D01*
X161750000Y-106796000D01*
X161203171Y-106796000D01*
X161196888Y-106796321D01*
X161097304Y-106806493D01*
X160930877Y-106861642D01*
X160781654Y-106953683D01*
X160657683Y-107077654D01*
X160565642Y-107226877D01*
X160510493Y-107393303D01*
X160500319Y-107492890D01*
X160500000Y-107499168D01*
X160500000Y-108046000D01*
X60300500Y-108046000D01*
X60300500Y-105010000D01*
X149094785Y-105010000D01*
X149113602Y-105213083D01*
X149169418Y-105409251D01*
X149260324Y-105591818D01*
X149383236Y-105754580D01*
X149533958Y-105891981D01*
X149707361Y-105999347D01*
X149707363Y-105999348D01*
X149897544Y-106073024D01*
X150098024Y-106110500D01*
X150098026Y-106110500D01*
X150301974Y-106110500D01*
X150301976Y-106110500D01*
X150502456Y-106073024D01*
X150692637Y-105999348D01*
X150866041Y-105891981D01*
X151016764Y-105754579D01*
X151139673Y-105591821D01*
X151139673Y-105591819D01*
X151139675Y-105591818D01*
X151185313Y-105500161D01*
X151230582Y-105409250D01*
X151286397Y-105213083D01*
X151305215Y-105010000D01*
X153944785Y-105010000D01*
X153963602Y-105213083D01*
X154019418Y-105409251D01*
X154110324Y-105591818D01*
X154233236Y-105754580D01*
X154383958Y-105891981D01*
X154557361Y-105999347D01*
X154557363Y-105999348D01*
X154747544Y-106073024D01*
X154948024Y-106110500D01*
X154948026Y-106110500D01*
X155151974Y-106110500D01*
X155151976Y-106110500D01*
X155352456Y-106073024D01*
X155542637Y-105999348D01*
X155716041Y-105891981D01*
X155866764Y-105754579D01*
X155989673Y-105591821D01*
X155989673Y-105591819D01*
X155989675Y-105591818D01*
X156035313Y-105500161D01*
X156080582Y-105409250D01*
X156136397Y-105213083D01*
X156155215Y-105010000D01*
X156136397Y-104806917D01*
X156080582Y-104610750D01*
X156080209Y-104610001D01*
X155989675Y-104428181D01*
X155866763Y-104265419D01*
X155716041Y-104128018D01*
X155542638Y-104020652D01*
X155352457Y-103946976D01*
X155285629Y-103934484D01*
X155151976Y-103909500D01*
X154948024Y-103909500D01*
X154847783Y-103928238D01*
X154747542Y-103946976D01*
X154557361Y-104020652D01*
X154383958Y-104128018D01*
X154233236Y-104265419D01*
X154110324Y-104428181D01*
X154019418Y-104610748D01*
X153963602Y-104806916D01*
X153944785Y-105010000D01*
X151305215Y-105010000D01*
X151286397Y-104806917D01*
X151230582Y-104610750D01*
X151230209Y-104610001D01*
X151139675Y-104428181D01*
X151016763Y-104265419D01*
X150866041Y-104128018D01*
X150692638Y-104020652D01*
X150502457Y-103946976D01*
X150435629Y-103934484D01*
X150301976Y-103909500D01*
X150098024Y-103909500D01*
X149997783Y-103928238D01*
X149897542Y-103946976D01*
X149707361Y-104020652D01*
X149533958Y-104128018D01*
X149383236Y-104265419D01*
X149260324Y-104428181D01*
X149169418Y-104610748D01*
X149113602Y-104806916D01*
X149094785Y-105010000D01*
X60300500Y-105010000D01*
X60300500Y-101220500D01*
X60320185Y-101153461D01*
X60372989Y-101107706D01*
X60424500Y-101096500D01*
X148198399Y-101096500D01*
X148265438Y-101116185D01*
G37*
%TD.AperFunction*%
%TD*%
%TA.AperFunction,Conductor*%
%TO.N,/BasePCB_+5V_Switched*%
G36*
X259642539Y-101116185D02*
G01*
X259688294Y-101168989D01*
X259699500Y-101220500D01*
X259699500Y-113922000D01*
X259679815Y-113989039D01*
X259627011Y-114034794D01*
X259575500Y-114046000D01*
X164624000Y-114046000D01*
X164556961Y-114026315D01*
X164511206Y-113973511D01*
X164500000Y-113922000D01*
X164500000Y-112540578D01*
X234299500Y-112540578D01*
X234299501Y-112543872D01*
X234305909Y-112603483D01*
X234356204Y-112738331D01*
X234442454Y-112853546D01*
X234557669Y-112939796D01*
X234692517Y-112990091D01*
X234752127Y-112996500D01*
X237247872Y-112996499D01*
X237307483Y-112990091D01*
X237442331Y-112939796D01*
X237557546Y-112853546D01*
X237643796Y-112738331D01*
X237694091Y-112603483D01*
X237700500Y-112543873D01*
X237700499Y-111295999D01*
X241294731Y-111295999D01*
X241313777Y-111550154D01*
X241370492Y-111798637D01*
X241463608Y-112035891D01*
X241590877Y-112256328D01*
X241591041Y-112256612D01*
X241749950Y-112455877D01*
X241936783Y-112629232D01*
X242147366Y-112772805D01*
X242376996Y-112883389D01*
X242620542Y-112958513D01*
X242872565Y-112996500D01*
X243127435Y-112996500D01*
X243379458Y-112958513D01*
X243623004Y-112883389D01*
X243852634Y-112772805D01*
X244063217Y-112629232D01*
X244250050Y-112455877D01*
X244408959Y-112256612D01*
X244536393Y-112035888D01*
X244629508Y-111798637D01*
X244686222Y-111550157D01*
X244705268Y-111296000D01*
X248295232Y-111296000D01*
X248314273Y-111550080D01*
X248370971Y-111798491D01*
X248464057Y-112035668D01*
X248591456Y-112256331D01*
X248633452Y-112308993D01*
X248633453Y-112308993D01*
X249397452Y-111544993D01*
X249407188Y-111574956D01*
X249495186Y-111713619D01*
X249614903Y-111826040D01*
X249749510Y-111900041D01*
X248986813Y-112662737D01*
X249147619Y-112772372D01*
X249377179Y-112882922D01*
X249620654Y-112958025D01*
X249872603Y-112996000D01*
X250127397Y-112996000D01*
X250379345Y-112958025D01*
X250622823Y-112882921D01*
X250852383Y-112772372D01*
X251013185Y-112662737D01*
X250247534Y-111897086D01*
X250315629Y-111870126D01*
X250448492Y-111773595D01*
X250553175Y-111647055D01*
X250601631Y-111544079D01*
X251366545Y-112308993D01*
X251366546Y-112308992D01*
X251408545Y-112256328D01*
X251535942Y-112035669D01*
X251629028Y-111798491D01*
X251685726Y-111550080D01*
X251704767Y-111296000D01*
X251685726Y-111041919D01*
X251629028Y-110793508D01*
X251535942Y-110556330D01*
X251408545Y-110335671D01*
X251366546Y-110283005D01*
X250602546Y-111047004D01*
X250592812Y-111017044D01*
X250504814Y-110878381D01*
X250385097Y-110765960D01*
X250250489Y-110691958D01*
X251013185Y-109929261D01*
X250852379Y-109819625D01*
X250622823Y-109709078D01*
X250379345Y-109633974D01*
X250127397Y-109596000D01*
X249872603Y-109596000D01*
X249620654Y-109633974D01*
X249377179Y-109709077D01*
X249147615Y-109819628D01*
X248986813Y-109929261D01*
X249752465Y-110694913D01*
X249684371Y-110721874D01*
X249551508Y-110818405D01*
X249446825Y-110944945D01*
X249398368Y-111047920D01*
X248633453Y-110283006D01*
X248591453Y-110335673D01*
X248464057Y-110556331D01*
X248370971Y-110793508D01*
X248314273Y-111041919D01*
X248295232Y-111296000D01*
X244705268Y-111296000D01*
X244686222Y-111041843D01*
X244629508Y-110793363D01*
X244536393Y-110556112D01*
X244408959Y-110335388D01*
X244250050Y-110136123D01*
X244063217Y-109962768D01*
X243852634Y-109819195D01*
X243623004Y-109708611D01*
X243379458Y-109633487D01*
X243127435Y-109595500D01*
X242872565Y-109595500D01*
X242620542Y-109633487D01*
X242376996Y-109708611D01*
X242147366Y-109819195D01*
X242096802Y-109853669D01*
X241936781Y-109962769D01*
X241844786Y-110048128D01*
X241749950Y-110136123D01*
X241632815Y-110283006D01*
X241591038Y-110335392D01*
X241463608Y-110556108D01*
X241370492Y-110793362D01*
X241313777Y-111041845D01*
X241294731Y-111295999D01*
X237700499Y-111295999D01*
X237700499Y-110048128D01*
X237694091Y-109988517D01*
X237643796Y-109853669D01*
X237557546Y-109738454D01*
X237442331Y-109652204D01*
X237307483Y-109601909D01*
X237307483Y-109601908D01*
X237251166Y-109595854D01*
X237251165Y-109595853D01*
X237247873Y-109595500D01*
X237244550Y-109595500D01*
X234755439Y-109595500D01*
X234755420Y-109595500D01*
X234752128Y-109595501D01*
X234748848Y-109595853D01*
X234748840Y-109595854D01*
X234692515Y-109601909D01*
X234557669Y-109652204D01*
X234442454Y-109738454D01*
X234356204Y-109853668D01*
X234305910Y-109988515D01*
X234305909Y-109988517D01*
X234299500Y-110048127D01*
X234299500Y-110051448D01*
X234299500Y-110051449D01*
X234299500Y-112540560D01*
X234299500Y-112540578D01*
X164500000Y-112540578D01*
X164500000Y-108295999D01*
X164994858Y-108295999D01*
X165015386Y-108543732D01*
X165076413Y-108784721D01*
X165176268Y-109012370D01*
X165276563Y-109165882D01*
X165276564Y-109165882D01*
X166080195Y-108362251D01*
X166090762Y-108428969D01*
X166151882Y-108548923D01*
X166247077Y-108644118D01*
X166367031Y-108705238D01*
X166433747Y-108715804D01*
X165629942Y-109519609D01*
X165629942Y-109519610D01*
X165676766Y-109556055D01*
X165895393Y-109674368D01*
X166130506Y-109755083D01*
X166375707Y-109796000D01*
X166624293Y-109796000D01*
X166869493Y-109755083D01*
X167104606Y-109674368D01*
X167323233Y-109556053D01*
X167370056Y-109519609D01*
X166566251Y-108715804D01*
X166632969Y-108705238D01*
X166752923Y-108644118D01*
X166848118Y-108548923D01*
X166909238Y-108428969D01*
X166919804Y-108362251D01*
X167723434Y-109165882D01*
X167823730Y-109012369D01*
X167923586Y-108784721D01*
X167984613Y-108543732D01*
X168005141Y-108296000D01*
X169494356Y-108296000D01*
X169514891Y-108543816D01*
X169514891Y-108543819D01*
X169514892Y-108543821D01*
X169575937Y-108784881D01*
X169620960Y-108887523D01*
X169675825Y-109012604D01*
X169675827Y-109012607D01*
X169811836Y-109220785D01*
X169980256Y-109403738D01*
X169980259Y-109403740D01*
X170176485Y-109556470D01*
X170176487Y-109556471D01*
X170176491Y-109556474D01*
X170395190Y-109674828D01*
X170630386Y-109755571D01*
X170875665Y-109796500D01*
X171124335Y-109796500D01*
X171369614Y-109755571D01*
X171604810Y-109674828D01*
X171823509Y-109556474D01*
X172019744Y-109403738D01*
X172188164Y-109220785D01*
X172324173Y-109012607D01*
X172424063Y-108784881D01*
X172485108Y-108543821D01*
X172505643Y-108296000D01*
X172485108Y-108048179D01*
X172424063Y-107807119D01*
X172324173Y-107579393D01*
X172188164Y-107371215D01*
X172019744Y-107188262D01*
X171997612Y-107171036D01*
X171823514Y-107035529D01*
X171823510Y-107035526D01*
X171823509Y-107035526D01*
X171604810Y-106917172D01*
X171604806Y-106917170D01*
X171604805Y-106917170D01*
X171369615Y-106836429D01*
X171124335Y-106795500D01*
X170875665Y-106795500D01*
X170630384Y-106836429D01*
X170395194Y-106917170D01*
X170176485Y-107035529D01*
X169980259Y-107188259D01*
X169811837Y-107371214D01*
X169675825Y-107579395D01*
X169575938Y-107807117D01*
X169514891Y-108048183D01*
X169494356Y-108296000D01*
X168005141Y-108296000D01*
X168005141Y-108295999D01*
X167984613Y-108048267D01*
X167923586Y-107807278D01*
X167823730Y-107579630D01*
X167723434Y-107426116D01*
X166919804Y-108229746D01*
X166909238Y-108163031D01*
X166848118Y-108043077D01*
X166752923Y-107947882D01*
X166632969Y-107886762D01*
X166566252Y-107876195D01*
X167370057Y-107072390D01*
X167370056Y-107072388D01*
X167323235Y-107035947D01*
X167104606Y-106917631D01*
X166869493Y-106836916D01*
X166624293Y-106796000D01*
X166375707Y-106796000D01*
X166130506Y-106836916D01*
X165895393Y-106917631D01*
X165676764Y-107035946D01*
X165629942Y-107072388D01*
X165629942Y-107072390D01*
X166433748Y-107876195D01*
X166367031Y-107886762D01*
X166247077Y-107947882D01*
X166151882Y-108043077D01*
X166090762Y-108163031D01*
X166080195Y-108229747D01*
X165276564Y-107426116D01*
X165176266Y-107579634D01*
X165076413Y-107807278D01*
X165015386Y-108048267D01*
X164994858Y-108295999D01*
X164500000Y-108295999D01*
X164500000Y-101220500D01*
X164519685Y-101153461D01*
X164572489Y-101107706D01*
X164624000Y-101096500D01*
X259575500Y-101096500D01*
X259642539Y-101116185D01*
G37*
%TD.AperFunction*%
%TD*%
M02*
