(footprint "USB_Micro-B_SHOU-HAN_MICRO-XNJ-ZB-078" (version 20221018) (generator pcbnew)
  (layer "F.Cu")
  (descr "XKB Connectivity, USB Micro-B, right-angle, SMT, https://datasheet.lcsc.com/lcsc/2206091745_XKB-Connectivity-U254-051T-4BH83-F1S_C397452.pdf")
  (tags "USB Micro-B Receptacle SMD")
  (attr smd)
  (fp_text reference "REF**" (at 0 4.1 180) (layer "F.SilkS")
      (effects (font (size 1 1) (thickness 0.15)))
    (tstamp 2ee4e5c1-8a09-4239-878c-1961f27a273b)
  )
  (fp_text value "USB_Micro-B_SHOU-HAN_MICRO-XNJ-ZB-078" (at 0 4) (layer "F.Fab")
      (effects (font (size 1 1) (thickness 0.15)))
    (tstamp 65bcbf1a-192d-47ca-864c-3a7da7198a80)
  )
  (fp_text user "${REFERENCE}" (at 0 -0.68 180 unlocked) (layer "F.Fab")
      (effects (font (size 1 1) (thickness 0.15)))
    (tstamp 29df116f-cb65-418d-b0f7-09824d2e25ec)
  )
  (fp_line (start -3.85 1.45) (end -3.85 -0.4)
    (stroke (width 0.12) (type solid)) (layer "F.SilkS") (tstamp 0d3dbfe4-7c3f-4f63-af28-1a9da30d9f0b))
  (fp_line (start 0.9 3.325) (end 1.3 2.875)
    (stroke (width 0.12) (type solid)) (layer "F.SilkS") (tstamp c895a53e-e800-4141-a2bf-9f290b3649bb))
  (fp_line (start 1.3 2.875) (end 1.7 3.325)
    (stroke (width 0.12) (type solid)) (layer "F.SilkS") (tstamp b1c49a8c-8655-4e91-96ec-1cf5239e7534))
  (fp_line (start 1.7 3.325) (end 0.9 3.325)
    (stroke (width 0.12) (type solid)) (layer "F.SilkS") (tstamp 23e56340-ce23-4348-b56e-3b8f112fe8e0))
  (fp_line (start 3.85 1.45) (end 3.85 -0.4)
    (stroke (width 0.12) (type solid)) (layer "F.SilkS") (tstamp f8ebe8c5-b1f0-46cc-a0e8-2316db7915b3))
  (fp_line (start -4.65 -4.04) (end -4.65 2.65)
    (stroke (width 0.05) (type solid)) (layer "F.CrtYd") (tstamp 289da737-d19a-446b-a04a-8663ec97632d))
  (fp_line (start 4.65 -4.04) (end -4.65 -4.04)
    (stroke (width 0.05) (type solid)) (layer "F.CrtYd") (tstamp 06f2fcf4-4a12-4235-bb7e-067a6f21f24e))
  (fp_line (start 4.65 -4.04) (end 4.65 2.65)
    (stroke (width 0.05) (type solid)) (layer "F.CrtYd") (tstamp ed61c117-f7cc-4ccf-a765-551136012bc9))
  (fp_line (start 4.65 2.65) (end -4.65 2.65)
    (stroke (width 0.05) (type solid)) (layer "F.CrtYd") (tstamp e5afaf9b-9d55-41da-aac3-bbd556db0774))
  (fp_line (start 1.3 1.04) (end 1 1.54)
    (stroke (width 0.1) (type solid)) (layer "F.Fab") (tstamp 85cd977f-9887-4348-967d-95cc45a4361e))
  (fp_line (start 1.6 1.54) (end 1.3 1.04)
    (stroke (width 0.1) (type solid)) (layer "F.Fab") (tstamp 40c1c509-30f0-40e3-af2d-45cd42f6d024))
  (fp_rect (start 3.75 1.53) (end -3.75 -3.53)
    (stroke (width 0.1) (type default)) (fill none) (layer "F.Fab") (tstamp 96e183a1-64a9-4cdc-825d-1f519eea0ddf))
  (pad "" np_thru_hole circle (at -2.425 1.27 180) (size 1.2 1.2) (drill 0.7) (layers "F&B.Cu" "*.Mask") (tstamp 59283ca7-13cc-4ebf-8067-905503a61136))
  (pad "" np_thru_hole circle (at 2.425 1.27 180) (size 1.2 1.2) (drill 0.7) (layers "F&B.Cu" "*.Mask") (tstamp b65c8a49-8b8e-46e6-bc47-6d47248a9a96))
  (pad "1" smd rect (at 1.3 1.425 180) (size 0.4 1.69) (layers "F.Cu" "F.Paste" "F.Mask") (tstamp b89fb75f-2e0d-4e9e-9382-0a042858cd8a))
  (pad "2" smd rect (at 0.65 1.425 180) (size 0.4 1.69) (layers "F.Cu" "F.Paste" "F.Mask") (tstamp e4c73d6c-8673-42c3-8298-035272d014fe))
  (pad "3" smd rect (at 0 1.425 180) (size 0.4 1.69) (layers "F.Cu" "F.Paste" "F.Mask") (tstamp 12f88356-523b-4719-816b-6e1f2c771e57))
  (pad "4" smd rect (at -0.65 1.425 180) (size 0.4 1.69) (layers "F.Cu" "F.Paste" "F.Mask") (tstamp 2d9fbacb-58e2-4f50-9e2a-7db7ab7af05b))
  (pad "5" smd rect (at -1.3 1.425 180) (size 0.4 1.69) (layers "F.Cu" "F.Paste" "F.Mask") (tstamp cc446331-c6a1-40ae-9262-2967d0aec6be))
  (pad "6" thru_hole oval (at -3.625 -1.38 180) (size 1 1.7) (drill oval 0.5 1.2) (layers "*.Cu" "*.Mask") (tstamp ed5379de-71af-4540-9146-f9f88938f968))
  (pad "6" smd rect (at -2.1 -1.38 180) (size 1.4 1.9) (layers "F.Cu" "F.Paste" "F.Mask") (tstamp 7f752c6e-a86a-41b2-999c-a0148df8f193))
  (pad "6" smd rect (at 2.1 -1.38 180) (size 1.4 1.9) (layers "F.Cu" "F.Paste" "F.Mask") (tstamp 5f091db5-9c63-4a6b-8288-76858457472a))
  (pad "6" thru_hole oval (at 3.625 -1.38 180) (size 1 1.7) (drill oval 0.5 1.2) (layers "*.Cu" "*.Mask") (tstamp cc82b8ad-801a-4f35-85cd-b8698f276902))
  (model "${KICAD6_3DMODEL_DIR}/Connector_USB.3dshapes/USB_Micro-B_XKB_U254-051T-4BH83-F1S.wrl"
    (offset (xyz 0 0 0))
    (scale (xyz 1 1 1))
    (rotate (xyz 0 0 0))
  )
)
