%TF.GenerationSoftware,KiCad,Pcbnew,7.0.2*%
%TF.CreationDate,2023-08-10T20:20:58+02:00*%
%TF.ProjectId,PropellerClockPCB,50726f70-656c-46c6-9572-436c6f636b50,v1.0.0*%
%TF.SameCoordinates,Original*%
%TF.FileFunction,Copper,L1,Top*%
%TF.FilePolarity,Positive*%
%FSLAX46Y46*%
G04 Gerber Fmt 4.6, Leading zero omitted, Abs format (unit mm)*
G04 Created by KiCad (PCBNEW 7.0.2) date 2023-08-10 20:20:58*
%MOMM*%
%LPD*%
G01*
G04 APERTURE LIST*
G04 Aperture macros list*
%AMRoundRect*
0 Rectangle with rounded corners*
0 $1 Rounding radius*
0 $2 $3 $4 $5 $6 $7 $8 $9 X,Y pos of 4 corners*
0 Add a 4 corners polygon primitive as box body*
4,1,4,$2,$3,$4,$5,$6,$7,$8,$9,$2,$3,0*
0 Add four circle primitives for the rounded corners*
1,1,$1+$1,$2,$3*
1,1,$1+$1,$4,$5*
1,1,$1+$1,$6,$7*
1,1,$1+$1,$8,$9*
0 Add four rect primitives between the rounded corners*
20,1,$1+$1,$2,$3,$4,$5,0*
20,1,$1+$1,$4,$5,$6,$7,0*
20,1,$1+$1,$6,$7,$8,$9,0*
20,1,$1+$1,$8,$9,$2,$3,0*%
G04 Aperture macros list end*
%TA.AperFunction,ComponentPad*%
%ADD10O,25.900000X4.400000*%
%TD*%
%TA.AperFunction,ComponentPad*%
%ADD11O,1.000000X1.700000*%
%TD*%
%TA.AperFunction,SMDPad,CuDef*%
%ADD12R,1.400000X1.900000*%
%TD*%
%TA.AperFunction,SMDPad,CuDef*%
%ADD13R,0.400000X1.690000*%
%TD*%
%TA.AperFunction,WasherPad*%
%ADD14C,1.200000*%
%TD*%
%TA.AperFunction,SMDPad,CuDef*%
%ADD15RoundRect,0.250000X0.262500X0.450000X-0.262500X0.450000X-0.262500X-0.450000X0.262500X-0.450000X0*%
%TD*%
%TA.AperFunction,ComponentPad*%
%ADD16C,2.400000*%
%TD*%
%TA.AperFunction,ComponentPad*%
%ADD17R,2.400000X2.400000*%
%TD*%
%TA.AperFunction,ComponentPad*%
%ADD18C,2.000000*%
%TD*%
%TA.AperFunction,ComponentPad*%
%ADD19RoundRect,0.250000X-0.750000X-0.750000X0.750000X-0.750000X0.750000X0.750000X-0.750000X0.750000X0*%
%TD*%
%TA.AperFunction,Conductor*%
%ADD20C,0.250000*%
%TD*%
G04 APERTURE END LIST*
D10*
%TO.P,H2,1,1*%
%TO.N,GND2*%
X160000000Y-124896000D03*
%TD*%
D11*
%TO.P,J3,6,Shield*%
%TO.N,GND2*%
X156250000Y-102360000D03*
D12*
X154725000Y-102360000D03*
X150525000Y-102360000D03*
D11*
X149000000Y-102360000D03*
D13*
%TO.P,J3,5,GND*%
X151325000Y-105165000D03*
%TO.P,J3,4,ID*%
%TO.N,Net-(J3-ID)*%
X151975000Y-105165000D03*
%TO.P,J3,3,D+*%
%TO.N,Net-(J3-D+)*%
X152625000Y-105165000D03*
%TO.P,J3,2,D-*%
%TO.N,Net-(J3-D-)*%
X153275000Y-105165000D03*
%TO.P,J3,1,VBUS*%
%TO.N,/BasePCB_+5V*%
X153925000Y-105165000D03*
D14*
%TO.P,J3,*%
%TO.N,*%
X155050000Y-105010000D03*
X150200000Y-105010000D03*
%TD*%
D15*
%TO.P,R20,2*%
%TO.N,GND2*%
X151625000Y-109340000D03*
%TO.P,R20,1*%
%TO.N,Net-(J3-D-)*%
X153450000Y-109340000D03*
%TD*%
D16*
%TO.P,SW1,6,C*%
%TO.N,/BasePCB_+5V_Switched*%
X250000000Y-117296000D03*
%TO.P,SW1,5,B*%
%TO.N,/BasePCB_+5V*%
X243000000Y-117296000D03*
%TO.P,SW1,4,A*%
%TO.N,Net-(SW1A-A)*%
X236000000Y-117296000D03*
%TO.P,SW1,3,C*%
%TO.N,/BasePCB_+5V_Switched*%
X250000000Y-111296000D03*
%TO.P,SW1,2,B*%
%TO.N,/BasePCB_+5V*%
X243000000Y-111296000D03*
D17*
%TO.P,SW1,1,A*%
%TO.N,Net-(SW1A-A)*%
X236000000Y-111296000D03*
%TD*%
D18*
%TO.P,J6,3,Pin_3*%
%TO.N,GND2*%
X171000000Y-108296000D03*
%TO.P,J6,2,Pin_2*%
%TO.N,/BasePCB_+5V_Switched*%
X166500000Y-108296000D03*
D19*
%TO.P,J6,1,Pin_1*%
%TO.N,/BasePCB_+5V*%
X162000000Y-108296000D03*
%TD*%
D20*
%TO.N,/BasePCB_+5V*%
X153925000Y-106890000D02*
X153925000Y-105405000D01*
X155331000Y-108296000D02*
X153925000Y-106890000D01*
X162000000Y-108296000D02*
X155331000Y-108296000D01*
%TO.N,GND2*%
X151625000Y-107600000D02*
X151625000Y-109340000D01*
X151325000Y-107100000D02*
X151225000Y-107200000D01*
X151225000Y-107200000D02*
X151625000Y-107600000D01*
X151325000Y-105165000D02*
X151325000Y-107100000D01*
%TO.N,Net-(J3-D-)*%
X153450000Y-109340000D02*
X153275000Y-109165000D01*
X153275000Y-109165000D02*
X153275000Y-105405000D01*
%TO.N,/BasePCB_+5V_Switched*%
X250000000Y-117296000D02*
X250000000Y-111296000D01*
%TO.N,/BasePCB_+5V*%
X243000000Y-111296000D02*
X243000000Y-117296000D01*
%TO.N,Net-(SW1A-A)*%
X236000000Y-117296000D02*
X236000000Y-111296000D01*
%TD*%
%TA.AperFunction,Conductor*%
%TO.N,GND2*%
G36*
X148266164Y-101116185D02*
G01*
X148311919Y-101168989D01*
X148321863Y-101238147D01*
X148292838Y-101301703D01*
X148284557Y-101310374D01*
X148237330Y-101355266D01*
X148121144Y-101522194D01*
X148040940Y-101709092D01*
X148000000Y-101908311D01*
X148000000Y-102110000D01*
X148750000Y-102110000D01*
X148750000Y-102610000D01*
X148000000Y-102610000D01*
X148000000Y-102757570D01*
X148000317Y-102763835D01*
X148015419Y-102912339D01*
X148076303Y-103106389D01*
X148175003Y-103284214D01*
X148307479Y-103438531D01*
X148468307Y-103563021D01*
X148650902Y-103652587D01*
X148750000Y-103678244D01*
X148750000Y-102734624D01*
X148764505Y-102807545D01*
X148819760Y-102890240D01*
X148902455Y-102945495D01*
X149000000Y-102964898D01*
X149097545Y-102945495D01*
X149180240Y-102890240D01*
X149235495Y-102807545D01*
X149250000Y-102734624D01*
X149250000Y-103683366D01*
X149251943Y-103683069D01*
X149347231Y-103647778D01*
X149416934Y-103642954D01*
X149464609Y-103664792D01*
X149582911Y-103753352D01*
X149692934Y-103794389D01*
X149748868Y-103836261D01*
X149773285Y-103901725D01*
X149758433Y-103969998D01*
X149714879Y-104015998D01*
X149533956Y-104128020D01*
X149383236Y-104265419D01*
X149260324Y-104428181D01*
X149169418Y-104610748D01*
X149113602Y-104806916D01*
X149094785Y-105010000D01*
X149113602Y-105213083D01*
X149169418Y-105409251D01*
X149260324Y-105591818D01*
X149383236Y-105754580D01*
X149533958Y-105891981D01*
X149707361Y-105999347D01*
X149707363Y-105999348D01*
X149897544Y-106073024D01*
X150098024Y-106110500D01*
X150098026Y-106110500D01*
X150301974Y-106110500D01*
X150301976Y-106110500D01*
X150502456Y-106073024D01*
X150502461Y-106073022D01*
X150505013Y-106072545D01*
X150574528Y-106079576D01*
X150629206Y-106123074D01*
X150643980Y-106151100D01*
X150681647Y-106252088D01*
X150767811Y-106367188D01*
X150882910Y-106453352D01*
X151017628Y-106503599D01*
X151073867Y-106509645D01*
X151080482Y-106510000D01*
X151125000Y-106510000D01*
X151125000Y-106349434D01*
X151144685Y-106282395D01*
X151197489Y-106236640D01*
X151266647Y-106226696D01*
X151330203Y-106255721D01*
X151348262Y-106275118D01*
X151417454Y-106367546D01*
X151475311Y-106410857D01*
X151517181Y-106466788D01*
X151524972Y-106509972D01*
X151525000Y-106510000D01*
X151569518Y-106510000D01*
X151576130Y-106509645D01*
X151634398Y-106503381D01*
X151660909Y-106503380D01*
X151667514Y-106504090D01*
X151667517Y-106504091D01*
X151727127Y-106510500D01*
X152222872Y-106510499D01*
X152282483Y-106504091D01*
X152282484Y-106504090D01*
X152286749Y-106503632D01*
X152313259Y-106503633D01*
X152317516Y-106504090D01*
X152317517Y-106504091D01*
X152377127Y-106510500D01*
X152525500Y-106510499D01*
X152592539Y-106530183D01*
X152638294Y-106582987D01*
X152649500Y-106634499D01*
X152649500Y-108291976D01*
X152629815Y-108359015D01*
X152577011Y-108404770D01*
X152507853Y-108414714D01*
X152444297Y-108385689D01*
X152437819Y-108379657D01*
X152355845Y-108297683D01*
X152206622Y-108205642D01*
X152040196Y-108150493D01*
X151940609Y-108140319D01*
X151934332Y-108140000D01*
X151875000Y-108140000D01*
X151875000Y-110539999D01*
X151934329Y-110539999D01*
X151940611Y-110539678D01*
X152040195Y-110529506D01*
X152206622Y-110474357D01*
X152355844Y-110382316D01*
X152449464Y-110288696D01*
X152510787Y-110255210D01*
X152580478Y-110260194D01*
X152624825Y-110288693D01*
X152718448Y-110382316D01*
X152718845Y-110382713D01*
X152793504Y-110428763D01*
X152868166Y-110474814D01*
X152979517Y-110511712D01*
X153034702Y-110529999D01*
X153134358Y-110540180D01*
X153134359Y-110540180D01*
X153137491Y-110540500D01*
X153762508Y-110540499D01*
X153865297Y-110529999D01*
X154031834Y-110474814D01*
X154181156Y-110382712D01*
X154305212Y-110258656D01*
X154397314Y-110109334D01*
X154452499Y-109942797D01*
X154463000Y-109840009D01*
X154462999Y-108839992D01*
X154452499Y-108737203D01*
X154401431Y-108583093D01*
X154399030Y-108513267D01*
X154434762Y-108453225D01*
X154497282Y-108422032D01*
X154566741Y-108429592D01*
X154606819Y-108456410D01*
X154830196Y-108679787D01*
X154843096Y-108695888D01*
X154845213Y-108697876D01*
X154845214Y-108697877D01*
X154887198Y-108737303D01*
X154894223Y-108743900D01*
X154897020Y-108746611D01*
X154916529Y-108766120D01*
X154919709Y-108768587D01*
X154928571Y-108776155D01*
X154960417Y-108806061D01*
X154960418Y-108806062D01*
X154977970Y-108815711D01*
X154994238Y-108826397D01*
X155010064Y-108838673D01*
X155050146Y-108856017D01*
X155060633Y-108861155D01*
X155098907Y-108882197D01*
X155107410Y-108884379D01*
X155118308Y-108887178D01*
X155136713Y-108893478D01*
X155155104Y-108901437D01*
X155198250Y-108908270D01*
X155209668Y-108910635D01*
X155251981Y-108921500D01*
X155272016Y-108921500D01*
X155291415Y-108923027D01*
X155311196Y-108926160D01*
X155354674Y-108922050D01*
X155366344Y-108921500D01*
X160375501Y-108921500D01*
X160442540Y-108941185D01*
X160488295Y-108993989D01*
X160499501Y-109045500D01*
X160499501Y-109096008D01*
X160499820Y-109099140D01*
X160499821Y-109099141D01*
X160510000Y-109198796D01*
X160565186Y-109365334D01*
X160657288Y-109514657D01*
X160781342Y-109638711D01*
X160781344Y-109638712D01*
X160930666Y-109730814D01*
X161005375Y-109755570D01*
X161097202Y-109785999D01*
X161196858Y-109796180D01*
X161196859Y-109796180D01*
X161199991Y-109796500D01*
X162800008Y-109796499D01*
X162902797Y-109785999D01*
X163069334Y-109730814D01*
X163218656Y-109638712D01*
X163342712Y-109514656D01*
X163434814Y-109365334D01*
X163489999Y-109198797D01*
X163500500Y-109096009D01*
X163500499Y-108296000D01*
X164994356Y-108296000D01*
X165014891Y-108543816D01*
X165014891Y-108543819D01*
X165014892Y-108543821D01*
X165075937Y-108784881D01*
X165108159Y-108858339D01*
X165175825Y-109012604D01*
X165175827Y-109012607D01*
X165311836Y-109220785D01*
X165480256Y-109403738D01*
X165480259Y-109403740D01*
X165676485Y-109556470D01*
X165676487Y-109556471D01*
X165676491Y-109556474D01*
X165895190Y-109674828D01*
X166130386Y-109755571D01*
X166375665Y-109796500D01*
X166624335Y-109796500D01*
X166869614Y-109755571D01*
X167104810Y-109674828D01*
X167323509Y-109556474D01*
X167519744Y-109403738D01*
X167688164Y-109220785D01*
X167824173Y-109012607D01*
X167924063Y-108784881D01*
X167985108Y-108543821D01*
X168005643Y-108296000D01*
X168005643Y-108295999D01*
X169494858Y-108295999D01*
X169515386Y-108543732D01*
X169576413Y-108784721D01*
X169676268Y-109012370D01*
X169776563Y-109165882D01*
X169776564Y-109165882D01*
X170580195Y-108362251D01*
X170590762Y-108428969D01*
X170651882Y-108548923D01*
X170747077Y-108644118D01*
X170867031Y-108705238D01*
X170933747Y-108715804D01*
X170129942Y-109519609D01*
X170129942Y-109519610D01*
X170176766Y-109556055D01*
X170395393Y-109674368D01*
X170630506Y-109755083D01*
X170875707Y-109796000D01*
X171124293Y-109796000D01*
X171369493Y-109755083D01*
X171604606Y-109674368D01*
X171823233Y-109556053D01*
X171870056Y-109519609D01*
X171066251Y-108715804D01*
X171132969Y-108705238D01*
X171252923Y-108644118D01*
X171348118Y-108548923D01*
X171409238Y-108428969D01*
X171419804Y-108362252D01*
X172223434Y-109165882D01*
X172323730Y-109012369D01*
X172423586Y-108784721D01*
X172484613Y-108543732D01*
X172505141Y-108295999D01*
X172484613Y-108048267D01*
X172423586Y-107807278D01*
X172323730Y-107579630D01*
X172223434Y-107426116D01*
X171419804Y-108229747D01*
X171409238Y-108163031D01*
X171348118Y-108043077D01*
X171252923Y-107947882D01*
X171132969Y-107886762D01*
X171066252Y-107876195D01*
X171870057Y-107072390D01*
X171870056Y-107072388D01*
X171823235Y-107035947D01*
X171604606Y-106917631D01*
X171369493Y-106836916D01*
X171124293Y-106796000D01*
X170875707Y-106796000D01*
X170630506Y-106836916D01*
X170395393Y-106917631D01*
X170176764Y-107035946D01*
X170129942Y-107072388D01*
X170129942Y-107072390D01*
X170933748Y-107876195D01*
X170867031Y-107886762D01*
X170747077Y-107947882D01*
X170651882Y-108043077D01*
X170590762Y-108163031D01*
X170580195Y-108229746D01*
X169776564Y-107426116D01*
X169676266Y-107579634D01*
X169576413Y-107807278D01*
X169515386Y-108048267D01*
X169494858Y-108295999D01*
X168005643Y-108295999D01*
X167985108Y-108048179D01*
X167924063Y-107807119D01*
X167824173Y-107579393D01*
X167688164Y-107371215D01*
X167519744Y-107188262D01*
X167497612Y-107171036D01*
X167323514Y-107035529D01*
X167323510Y-107035526D01*
X167323509Y-107035526D01*
X167104810Y-106917172D01*
X167104806Y-106917170D01*
X167104805Y-106917170D01*
X166869615Y-106836429D01*
X166624335Y-106795500D01*
X166375665Y-106795500D01*
X166130384Y-106836429D01*
X165895194Y-106917170D01*
X165895190Y-106917171D01*
X165895190Y-106917172D01*
X165807710Y-106964513D01*
X165676485Y-107035529D01*
X165480259Y-107188259D01*
X165311837Y-107371214D01*
X165175825Y-107579395D01*
X165075938Y-107807117D01*
X165014891Y-108048183D01*
X164994356Y-108296000D01*
X163500499Y-108296000D01*
X163500499Y-107495992D01*
X163489999Y-107393203D01*
X163434814Y-107226666D01*
X163342712Y-107077344D01*
X163342711Y-107077342D01*
X163218657Y-106953288D01*
X163069334Y-106861186D01*
X162902797Y-106806000D01*
X162803141Y-106795819D01*
X162803122Y-106795818D01*
X162800009Y-106795500D01*
X162796860Y-106795500D01*
X161203140Y-106795500D01*
X161203120Y-106795500D01*
X161199992Y-106795501D01*
X161196860Y-106795820D01*
X161196858Y-106795821D01*
X161097203Y-106806000D01*
X160930665Y-106861186D01*
X160781342Y-106953288D01*
X160657288Y-107077342D01*
X160565186Y-107226665D01*
X160510000Y-107393202D01*
X160499819Y-107492858D01*
X160499817Y-107492878D01*
X160499500Y-107495991D01*
X160499500Y-107499139D01*
X160499500Y-107546500D01*
X160479815Y-107613539D01*
X160427011Y-107659294D01*
X160375500Y-107670500D01*
X155641453Y-107670500D01*
X155574414Y-107650815D01*
X155553772Y-107634181D01*
X154586819Y-106667227D01*
X154553334Y-106605904D01*
X154550500Y-106579546D01*
X154550500Y-106318042D01*
X154564660Y-106269817D01*
X154562565Y-106269036D01*
X154568796Y-106252331D01*
X154606518Y-106151192D01*
X154648388Y-106095260D01*
X154713852Y-106070843D01*
X154745484Y-106072638D01*
X154747539Y-106073022D01*
X154747544Y-106073024D01*
X154948024Y-106110500D01*
X154948026Y-106110500D01*
X155151974Y-106110500D01*
X155151976Y-106110500D01*
X155352456Y-106073024D01*
X155542637Y-105999348D01*
X155716041Y-105891981D01*
X155866764Y-105754579D01*
X155989673Y-105591821D01*
X155989673Y-105591819D01*
X155989675Y-105591818D01*
X156035313Y-105500161D01*
X156080582Y-105409250D01*
X156136397Y-105213083D01*
X156155215Y-105010000D01*
X156136397Y-104806917D01*
X156080582Y-104610750D01*
X156080209Y-104610001D01*
X155989675Y-104428181D01*
X155866763Y-104265419D01*
X155716041Y-104128018D01*
X155535121Y-104015998D01*
X155488485Y-103963970D01*
X155477381Y-103894988D01*
X155505334Y-103830954D01*
X155557065Y-103794389D01*
X155667088Y-103753352D01*
X155780199Y-103668678D01*
X155845663Y-103644261D01*
X155887903Y-103652488D01*
X155888696Y-103649427D01*
X156000000Y-103678244D01*
X156000000Y-102734624D01*
X156014505Y-102807545D01*
X156069760Y-102890240D01*
X156152455Y-102945495D01*
X156250000Y-102964898D01*
X156347545Y-102945495D01*
X156430240Y-102890240D01*
X156485495Y-102807545D01*
X156500000Y-102734624D01*
X156500000Y-103683366D01*
X156501947Y-103683068D01*
X156692663Y-103612436D01*
X156865263Y-103504854D01*
X157012669Y-103364733D01*
X157128855Y-103197805D01*
X157209059Y-103010907D01*
X157250000Y-102811688D01*
X157250000Y-102610000D01*
X156500000Y-102610000D01*
X156500000Y-102110000D01*
X157250000Y-102110000D01*
X157250000Y-101962429D01*
X157249682Y-101956164D01*
X157234580Y-101807660D01*
X157173696Y-101613610D01*
X157074996Y-101435785D01*
X156959519Y-101301270D01*
X156930787Y-101237581D01*
X156941049Y-101168469D01*
X156987047Y-101115877D01*
X157053605Y-101096500D01*
X259575500Y-101096500D01*
X259642539Y-101116185D01*
X259688294Y-101168989D01*
X259699500Y-101220500D01*
X259699500Y-127871500D01*
X259679815Y-127938539D01*
X259627011Y-127984294D01*
X259575500Y-127995500D01*
X60424500Y-127995500D01*
X60357461Y-127975815D01*
X60311706Y-127923011D01*
X60300500Y-127871500D01*
X60300500Y-125146000D01*
X146560187Y-125146000D01*
X146564560Y-125218302D01*
X146565462Y-125225732D01*
X146622990Y-125539651D01*
X146624778Y-125546907D01*
X146719729Y-125851613D01*
X146722374Y-125858589D01*
X146853362Y-126149631D01*
X146856836Y-126156251D01*
X147021945Y-126429373D01*
X147026191Y-126435525D01*
X147223015Y-126686752D01*
X147227980Y-126692357D01*
X147453642Y-126918019D01*
X147459247Y-126922984D01*
X147710474Y-127119808D01*
X147716626Y-127124054D01*
X147989748Y-127289163D01*
X147996368Y-127292637D01*
X148287410Y-127423625D01*
X148294386Y-127426270D01*
X148599092Y-127521221D01*
X148606348Y-127523009D01*
X148920267Y-127580537D01*
X148927697Y-127581439D01*
X149166536Y-127595886D01*
X149170301Y-127596000D01*
X159750000Y-127596000D01*
X159750000Y-126096000D01*
X160250000Y-126096000D01*
X160250000Y-127596000D01*
X170829699Y-127596000D01*
X170833463Y-127595886D01*
X171072302Y-127581439D01*
X171079732Y-127580537D01*
X171393651Y-127523009D01*
X171400907Y-127521221D01*
X171705613Y-127426270D01*
X171712589Y-127423625D01*
X172003631Y-127292637D01*
X172010251Y-127289163D01*
X172283373Y-127124054D01*
X172289525Y-127119808D01*
X172540752Y-126922984D01*
X172546357Y-126918019D01*
X172772019Y-126692357D01*
X172776984Y-126686752D01*
X172973808Y-126435525D01*
X172978054Y-126429373D01*
X173143163Y-126156251D01*
X173146637Y-126149631D01*
X173277625Y-125858589D01*
X173280270Y-125851613D01*
X173375221Y-125546907D01*
X173377009Y-125539651D01*
X173434537Y-125225732D01*
X173435439Y-125218302D01*
X173439813Y-125146000D01*
X171924053Y-125146000D01*
X171950000Y-125007196D01*
X171950000Y-124784804D01*
X171924053Y-124646000D01*
X173439812Y-124646000D01*
X173439812Y-124645999D01*
X173435439Y-124573697D01*
X173434537Y-124566267D01*
X173377009Y-124252348D01*
X173375221Y-124245092D01*
X173280270Y-123940386D01*
X173277625Y-123933410D01*
X173146637Y-123642368D01*
X173143163Y-123635748D01*
X172978054Y-123362626D01*
X172973808Y-123356474D01*
X172776984Y-123105247D01*
X172772019Y-123099642D01*
X172546357Y-122873980D01*
X172540752Y-122869015D01*
X172289525Y-122672191D01*
X172283373Y-122667945D01*
X172010251Y-122502836D01*
X172003631Y-122499362D01*
X171712589Y-122368374D01*
X171705613Y-122365729D01*
X171400907Y-122270778D01*
X171393651Y-122268990D01*
X171079732Y-122211462D01*
X171072302Y-122210560D01*
X170833463Y-122196113D01*
X170829699Y-122196000D01*
X160250000Y-122196000D01*
X160250000Y-123696000D01*
X159750000Y-123696000D01*
X159750000Y-122196000D01*
X149170301Y-122196000D01*
X149166536Y-122196113D01*
X148927697Y-122210560D01*
X148920267Y-122211462D01*
X148606348Y-122268990D01*
X148599092Y-122270778D01*
X148294386Y-122365729D01*
X148287410Y-122368374D01*
X147996368Y-122499362D01*
X147989748Y-122502836D01*
X147716626Y-122667945D01*
X147710474Y-122672191D01*
X147459247Y-122869015D01*
X147453642Y-122873980D01*
X147227980Y-123099642D01*
X147223015Y-123105247D01*
X147026191Y-123356474D01*
X147021945Y-123362626D01*
X146856836Y-123635748D01*
X146853362Y-123642368D01*
X146722374Y-123933410D01*
X146719729Y-123940386D01*
X146624778Y-124245092D01*
X146622990Y-124252348D01*
X146565462Y-124566267D01*
X146564560Y-124573697D01*
X146560187Y-124645999D01*
X146560188Y-124646000D01*
X148075947Y-124646000D01*
X148050000Y-124784804D01*
X148050000Y-125007196D01*
X148075947Y-125146000D01*
X146560187Y-125146000D01*
X60300500Y-125146000D01*
X60300500Y-117295999D01*
X234294731Y-117295999D01*
X234313777Y-117550154D01*
X234370492Y-117798637D01*
X234463608Y-118035891D01*
X234591038Y-118256607D01*
X234591041Y-118256612D01*
X234749950Y-118455877D01*
X234936783Y-118629232D01*
X235147366Y-118772805D01*
X235376996Y-118883389D01*
X235620542Y-118958513D01*
X235872565Y-118996500D01*
X236127435Y-118996500D01*
X236379458Y-118958513D01*
X236623004Y-118883389D01*
X236852634Y-118772805D01*
X237063217Y-118629232D01*
X237250050Y-118455877D01*
X237408959Y-118256612D01*
X237536393Y-118035888D01*
X237629508Y-117798637D01*
X237686222Y-117550157D01*
X237705268Y-117296000D01*
X237705268Y-117295999D01*
X241294731Y-117295999D01*
X241313777Y-117550154D01*
X241370492Y-117798637D01*
X241463608Y-118035891D01*
X241591038Y-118256607D01*
X241591041Y-118256612D01*
X241749950Y-118455877D01*
X241936783Y-118629232D01*
X242147366Y-118772805D01*
X242376996Y-118883389D01*
X242620542Y-118958513D01*
X242872565Y-118996500D01*
X243127435Y-118996500D01*
X243379458Y-118958513D01*
X243623004Y-118883389D01*
X243852634Y-118772805D01*
X244063217Y-118629232D01*
X244250050Y-118455877D01*
X244408959Y-118256612D01*
X244536393Y-118035888D01*
X244629508Y-117798637D01*
X244686222Y-117550157D01*
X244705268Y-117296000D01*
X244705268Y-117295999D01*
X248294731Y-117295999D01*
X248313777Y-117550154D01*
X248370492Y-117798637D01*
X248463608Y-118035891D01*
X248591038Y-118256607D01*
X248591041Y-118256612D01*
X248749950Y-118455877D01*
X248936783Y-118629232D01*
X249147366Y-118772805D01*
X249376996Y-118883389D01*
X249620542Y-118958513D01*
X249872565Y-118996500D01*
X250127435Y-118996500D01*
X250379458Y-118958513D01*
X250623004Y-118883389D01*
X250852634Y-118772805D01*
X251063217Y-118629232D01*
X251250050Y-118455877D01*
X251408959Y-118256612D01*
X251536393Y-118035888D01*
X251629508Y-117798637D01*
X251686222Y-117550157D01*
X251705268Y-117296000D01*
X251686222Y-117041843D01*
X251629508Y-116793363D01*
X251536393Y-116556112D01*
X251408959Y-116335388D01*
X251250050Y-116136123D01*
X251063217Y-115962768D01*
X250852634Y-115819195D01*
X250852633Y-115819194D01*
X250852631Y-115819193D01*
X250695698Y-115743618D01*
X250643838Y-115696795D01*
X250625500Y-115631898D01*
X250625500Y-112960100D01*
X250645185Y-112893061D01*
X250695698Y-112848380D01*
X250852634Y-112772805D01*
X251063217Y-112629232D01*
X251250050Y-112455877D01*
X251408959Y-112256612D01*
X251536393Y-112035888D01*
X251629508Y-111798637D01*
X251686222Y-111550157D01*
X251705268Y-111296000D01*
X251686222Y-111041843D01*
X251629508Y-110793363D01*
X251536393Y-110556112D01*
X251527379Y-110540500D01*
X251436281Y-110382711D01*
X251408959Y-110335388D01*
X251250050Y-110136123D01*
X251063217Y-109962768D01*
X250852634Y-109819195D01*
X250623004Y-109708611D01*
X250379458Y-109633487D01*
X250127435Y-109595500D01*
X249872565Y-109595500D01*
X249620542Y-109633487D01*
X249376996Y-109708611D01*
X249147366Y-109819195D01*
X249096802Y-109853669D01*
X248936781Y-109962769D01*
X248844786Y-110048128D01*
X248749950Y-110136123D01*
X248651007Y-110260194D01*
X248591038Y-110335392D01*
X248463608Y-110556108D01*
X248370492Y-110793362D01*
X248313777Y-111041845D01*
X248294731Y-111295999D01*
X248313777Y-111550154D01*
X248370492Y-111798637D01*
X248463608Y-112035891D01*
X248591038Y-112256607D01*
X248591041Y-112256612D01*
X248749950Y-112455877D01*
X248936783Y-112629232D01*
X249147366Y-112772805D01*
X249304301Y-112848380D01*
X249356161Y-112895202D01*
X249374500Y-112960100D01*
X249374500Y-115631898D01*
X249354815Y-115698937D01*
X249304302Y-115743618D01*
X249147368Y-115819193D01*
X248936781Y-115962769D01*
X248749950Y-116136123D01*
X248591038Y-116335392D01*
X248463608Y-116556108D01*
X248370492Y-116793362D01*
X248313777Y-117041845D01*
X248294731Y-117295999D01*
X244705268Y-117295999D01*
X244686222Y-117041843D01*
X244629508Y-116793363D01*
X244536393Y-116556112D01*
X244408959Y-116335388D01*
X244250050Y-116136123D01*
X244063217Y-115962768D01*
X243852634Y-115819195D01*
X243852633Y-115819194D01*
X243852631Y-115819193D01*
X243695698Y-115743618D01*
X243643838Y-115696795D01*
X243625500Y-115631898D01*
X243625500Y-112960096D01*
X243645184Y-112893061D01*
X243695693Y-112848382D01*
X243852634Y-112772805D01*
X244063217Y-112629232D01*
X244250050Y-112455877D01*
X244408959Y-112256612D01*
X244536393Y-112035888D01*
X244629508Y-111798637D01*
X244686222Y-111550157D01*
X244705268Y-111296000D01*
X244686222Y-111041843D01*
X244629508Y-110793363D01*
X244536393Y-110556112D01*
X244527379Y-110540500D01*
X244436281Y-110382711D01*
X244408959Y-110335388D01*
X244250050Y-110136123D01*
X244063217Y-109962768D01*
X243852634Y-109819195D01*
X243623004Y-109708611D01*
X243379458Y-109633487D01*
X243127435Y-109595500D01*
X242872565Y-109595500D01*
X242620542Y-109633487D01*
X242376996Y-109708611D01*
X242147366Y-109819195D01*
X242096802Y-109853669D01*
X241936781Y-109962769D01*
X241844786Y-110048128D01*
X241749950Y-110136123D01*
X241651007Y-110260194D01*
X241591038Y-110335392D01*
X241463608Y-110556108D01*
X241370492Y-110793362D01*
X241313777Y-111041845D01*
X241294731Y-111295999D01*
X241313777Y-111550154D01*
X241370492Y-111798637D01*
X241463608Y-112035891D01*
X241591038Y-112256607D01*
X241591041Y-112256612D01*
X241749950Y-112455877D01*
X241936783Y-112629232D01*
X242147366Y-112772805D01*
X242147369Y-112772806D01*
X242147370Y-112772807D01*
X242304300Y-112848380D01*
X242356160Y-112895202D01*
X242374499Y-112960100D01*
X242374500Y-115631898D01*
X242354815Y-115698937D01*
X242304302Y-115743618D01*
X242147368Y-115819193D01*
X241936781Y-115962769D01*
X241749950Y-116136123D01*
X241591038Y-116335392D01*
X241463608Y-116556108D01*
X241370492Y-116793362D01*
X241313777Y-117041845D01*
X241294731Y-117295999D01*
X237705268Y-117295999D01*
X237686222Y-117041843D01*
X237629508Y-116793363D01*
X237536393Y-116556112D01*
X237408959Y-116335388D01*
X237250050Y-116136123D01*
X237063217Y-115962768D01*
X236852634Y-115819195D01*
X236852633Y-115819194D01*
X236852631Y-115819193D01*
X236695698Y-115743618D01*
X236643838Y-115696795D01*
X236625500Y-115631898D01*
X236625500Y-113120499D01*
X236645185Y-113053460D01*
X236697989Y-113007705D01*
X236749500Y-112996499D01*
X237244561Y-112996499D01*
X237247872Y-112996499D01*
X237307483Y-112990091D01*
X237442331Y-112939796D01*
X237557546Y-112853546D01*
X237643796Y-112738331D01*
X237694091Y-112603483D01*
X237700500Y-112543873D01*
X237700499Y-110048128D01*
X237694091Y-109988517D01*
X237643796Y-109853669D01*
X237557546Y-109738454D01*
X237442331Y-109652204D01*
X237307483Y-109601909D01*
X237247873Y-109595500D01*
X237244550Y-109595500D01*
X234755439Y-109595500D01*
X234755420Y-109595500D01*
X234752128Y-109595501D01*
X234748848Y-109595853D01*
X234748840Y-109595854D01*
X234692515Y-109601909D01*
X234557669Y-109652204D01*
X234442454Y-109738454D01*
X234356204Y-109853668D01*
X234305910Y-109988515D01*
X234305909Y-109988517D01*
X234299500Y-110048127D01*
X234299500Y-110051448D01*
X234299500Y-110051449D01*
X234299500Y-112540560D01*
X234299500Y-112540578D01*
X234299501Y-112543872D01*
X234305909Y-112603483D01*
X234356204Y-112738331D01*
X234442454Y-112853546D01*
X234557669Y-112939796D01*
X234692517Y-112990091D01*
X234752127Y-112996500D01*
X235250500Y-112996499D01*
X235317539Y-113016183D01*
X235363294Y-113068987D01*
X235374500Y-113120499D01*
X235374500Y-115631898D01*
X235354815Y-115698937D01*
X235304302Y-115743618D01*
X235147368Y-115819193D01*
X234936781Y-115962769D01*
X234749950Y-116136123D01*
X234591038Y-116335392D01*
X234463608Y-116556108D01*
X234370492Y-116793362D01*
X234313777Y-117041845D01*
X234294731Y-117295999D01*
X60300500Y-117295999D01*
X60300500Y-109590000D01*
X150612501Y-109590000D01*
X150612501Y-109836829D01*
X150612821Y-109843111D01*
X150622993Y-109942695D01*
X150678142Y-110109122D01*
X150770183Y-110258345D01*
X150894154Y-110382316D01*
X151043377Y-110474357D01*
X151209803Y-110529506D01*
X151309391Y-110539680D01*
X151315667Y-110539999D01*
X151374999Y-110539998D01*
X151375000Y-110539998D01*
X151375000Y-109590000D01*
X150612501Y-109590000D01*
X60300500Y-109590000D01*
X60300500Y-109090000D01*
X150612500Y-109090000D01*
X151375000Y-109090000D01*
X151375000Y-108140000D01*
X151374999Y-108139999D01*
X151315671Y-108140000D01*
X151309388Y-108140321D01*
X151209804Y-108150493D01*
X151043377Y-108205642D01*
X150894154Y-108297683D01*
X150770183Y-108421654D01*
X150678142Y-108570877D01*
X150622993Y-108737303D01*
X150612819Y-108836890D01*
X150612500Y-108843168D01*
X150612500Y-109090000D01*
X60300500Y-109090000D01*
X60300500Y-101220500D01*
X60320185Y-101153461D01*
X60372989Y-101107706D01*
X60424500Y-101096500D01*
X148199125Y-101096500D01*
X148266164Y-101116185D01*
G37*
%TD.AperFunction*%
%TA.AperFunction,Conductor*%
G36*
X153496727Y-101116185D02*
G01*
X153542482Y-101168989D01*
X153552426Y-101238147D01*
X153545870Y-101263833D01*
X153531400Y-101302626D01*
X153525354Y-101358867D01*
X153525000Y-101365481D01*
X153525000Y-102110000D01*
X156000000Y-102110000D01*
X156000000Y-102610000D01*
X153525000Y-102610000D01*
X153525000Y-103354518D01*
X153525354Y-103361132D01*
X153531400Y-103417371D01*
X153581647Y-103552089D01*
X153633845Y-103621816D01*
X153658262Y-103687281D01*
X153643410Y-103755554D01*
X153594005Y-103804959D01*
X153527945Y-103819949D01*
X153526159Y-103819853D01*
X153522873Y-103819500D01*
X153519563Y-103819500D01*
X153030439Y-103819500D01*
X153030420Y-103819500D01*
X153027128Y-103819501D01*
X153023851Y-103819853D01*
X153023837Y-103819854D01*
X152963253Y-103826367D01*
X152936747Y-103826367D01*
X152876168Y-103819854D01*
X152876163Y-103819853D01*
X152872873Y-103819500D01*
X152869550Y-103819500D01*
X152380439Y-103819500D01*
X152380420Y-103819500D01*
X152377128Y-103819501D01*
X152373851Y-103819853D01*
X152373837Y-103819854D01*
X152313253Y-103826367D01*
X152286747Y-103826367D01*
X152226168Y-103819854D01*
X152226163Y-103819853D01*
X152222873Y-103819500D01*
X152219550Y-103819500D01*
X151730455Y-103819500D01*
X151730436Y-103819500D01*
X151727128Y-103819501D01*
X151723828Y-103819855D01*
X151722053Y-103819951D01*
X151654056Y-103803879D01*
X151605543Y-103753598D01*
X151591915Y-103685070D01*
X151616154Y-103621817D01*
X151668352Y-103552088D01*
X151718599Y-103417371D01*
X151724645Y-103361132D01*
X151725000Y-103354518D01*
X151725000Y-102610000D01*
X149250000Y-102610000D01*
X149250000Y-102110000D01*
X151725000Y-102110000D01*
X151725000Y-101365481D01*
X151724645Y-101358867D01*
X151718599Y-101302626D01*
X151704130Y-101263833D01*
X151699146Y-101194142D01*
X151732631Y-101132818D01*
X151793954Y-101099334D01*
X151820312Y-101096500D01*
X153429688Y-101096500D01*
X153496727Y-101116185D01*
G37*
%TD.AperFunction*%
%TD*%
M02*
