M48
; DRILL file {KiCad 7.0.2} date Thu Aug 10 20:25:34 2023
; FORMAT={-:-/ absolute / inch / decimal}
; #@! TF.CreationDate,2023-08-10T20:25:34+02:00
; #@! TF.GenerationSoftware,Kicad,Pcbnew,7.0.2
; #@! TF.FileFunction,Plated,1,2,PTH
FMAT,2
INCH
; #@! TA.AperFunction,Plated,PTH,ComponentDrill
T1C0.0787
%
G90
G05
T1
G00X3.1496Y-9.1142
M15
G01X3.1496Y-8.6299
M16
G05
T0
M30
