(footprint "Optical_Switch_ITR8102" (version 20221018) (generator pcbnew)
  (layer "F.Cu")
  (attr through_hole)
  (fp_text reference "REF**" (at 0 -4 unlocked) (layer "F.SilkS")
      (effects (font (size 1 1) (thickness 0.1)))
    (tstamp 82f50657-64da-490e-a109-08f23cf28c67)
  )
  (fp_text value "Optical_Switch_ITR8102" (at 0 4 unlocked) (layer "F.Fab")
      (effects (font (size 1 1) (thickness 0.15)))
    (tstamp 7e4ce3ae-dc6e-4e8a-8b5e-bfa11fd21c08)
  )
  (fp_text user "${REFERENCE}" (at 0 2 unlocked) (layer "F.Fab")
      (effects (font (size 1 1) (thickness 0.15)))
    (tstamp 5e6eb674-0373-4019-b50b-893b318283f2)
  )
  (fp_line (start -6 -3) (end -6 3)
    (stroke (width 0.1) (type default)) (layer "F.SilkS") (tstamp b14f62b8-6e5f-414f-bca3-01b86d59a3e8))
  (fp_line (start -5.5 -3) (end -5.5 3)
    (stroke (width 0.1) (type default)) (layer "F.SilkS") (tstamp 1428390c-45ae-4aa9-a544-b6723d38f3d5))
  (fp_line (start -1.5 -3) (end -1.5 3)
    (stroke (width 0.1) (type default)) (layer "F.SilkS") (tstamp 050076ca-296c-4455-b72e-dee221c5e27e))
  (fp_line (start -1 0) (end 1 0)
    (stroke (width 0.1) (type default)) (layer "F.SilkS") (tstamp bdce5ce0-f4ae-422e-a986-2bf48fe54ebe))
  (fp_line (start 1 0) (end 0 -1)
    (stroke (width 0.1) (type default)) (layer "F.SilkS") (tstamp ab044630-472a-4815-8b20-6dce73a140fd))
  (fp_line (start 1 0) (end 0 1)
    (stroke (width 0.1) (type default)) (layer "F.SilkS") (tstamp bcd81373-4ed9-4b30-aefc-5385d9e656d8))
  (fp_line (start 1.5 -3) (end 1.5 3)
    (stroke (width 0.1) (type default)) (layer "F.SilkS") (tstamp 10288cd6-1c8d-42ac-9755-14181e160489))
  (fp_line (start 6 -3) (end 6 3)
    (stroke (width 0.1) (type default)) (layer "F.SilkS") (tstamp afd26427-2c1a-409c-a303-e1e0bca1ccd6))
  (fp_rect (start -12 -3) (end 12 3)
    (stroke (width 0.1) (type default)) (fill none) (layer "F.SilkS") (tstamp 4d06c6e8-1f0d-488d-911b-21115c784995))
  (pad "" np_thru_hole circle (at -9.5 0) (size 5 5) (drill 3.3) (layers "F&B.Cu" "*.Mask") (tstamp 558be7c7-d3b1-44c8-8eb3-89a43730cd37))
  (pad "" np_thru_hole circle (at 9.5 0) (size 5 5) (drill 3.3) (layers "F&B.Cu" "*.Mask") (tstamp cf357c0e-6ed2-416c-8f5a-87a0f66deddf))
  (pad "1" thru_hole rect (at -4.05 -1.27) (size 1.524 1.524) (drill 0.762) (layers "*.Cu" "*.Mask") (tstamp 1c480cee-502d-4bc4-a195-ed60483a0366))
  (pad "2" thru_hole circle (at -4.05 1.27) (size 1.524 1.524) (drill 0.762) (layers "*.Cu" "*.Mask") (tstamp 36e3d174-4925-4870-8472-200bb651795a))
  (pad "3" thru_hole circle (at 4.05 1.27) (size 1.524 1.524) (drill 0.762) (layers "*.Cu" "*.Mask") (tstamp d00a26b9-48a6-4660-8d95-2904ac936d4b))
  (pad "4" thru_hole circle (at 4.05 -1.27) (size 1.524 1.524) (drill 0.762) (layers "*.Cu" "*.Mask") (tstamp f8086ae1-8d28-4e21-85fc-f949d5af69bb))
)
