(footprint "Cutout_21.5mm_2.4mm" (version 20221018) (generator pcbnew)
  (layer "F.Cu")
  (attr through_hole)
  (fp_text reference "REF**" (at 0 -3 unlocked) (layer "F.SilkS")
      (effects (font (size 1 1) (thickness 0.1)))
    (tstamp fe68acee-1fd4-46e7-891d-9ea0a39a3ae0)
  )
  (fp_text value "Cutout_21.5mm_2.4mm" (at 0 3.5 unlocked) (layer "F.Fab")
      (effects (font (size 1 1) (thickness 0.15)))
    (tstamp b2a649d6-d0f9-4c95-a45e-0e7aad848bec)
  )
  (fp_text user "${REFERENCE}" (at 0 0 unlocked) (layer "F.Fab")
      (effects (font (size 1 1) (thickness 0.15)))
    (tstamp 88f370a2-913e-4b19-997f-5bace5239630)
  )
  (pad "1" thru_hole oval (at 0 0) (size 25.9 4.4) (drill oval 23.9 2.4) (layers "*.Cu" "*.Mask") (tstamp 3c635e39-3280-4c32-aa69-a9de525ab03f))
)
