%TF.GenerationSoftware,KiCad,Pcbnew,7.0.2*%
%TF.CreationDate,2023-08-10T20:22:54+02:00*%
%TF.ProjectId,PropellerClockPCB,50726f70-656c-46c6-9572-436c6f636b50,v1.0.0*%
%TF.SameCoordinates,Original*%
%TF.FileFunction,Copper,L2,Bot*%
%TF.FilePolarity,Positive*%
%FSLAX46Y46*%
G04 Gerber Fmt 4.6, Leading zero omitted, Abs format (unit mm)*
G04 Created by KiCad (PCBNEW 7.0.2) date 2023-08-10 20:22:54*
%MOMM*%
%LPD*%
G01*
G04 APERTURE LIST*
G04 Aperture macros list*
%AMRoundRect*
0 Rectangle with rounded corners*
0 $1 Rounding radius*
0 $2 $3 $4 $5 $6 $7 $8 $9 X,Y pos of 4 corners*
0 Add a 4 corners polygon primitive as box body*
4,1,4,$2,$3,$4,$5,$6,$7,$8,$9,$2,$3,0*
0 Add four circle primitives for the rounded corners*
1,1,$1+$1,$2,$3*
1,1,$1+$1,$4,$5*
1,1,$1+$1,$6,$7*
1,1,$1+$1,$8,$9*
0 Add four rect primitives between the rounded corners*
20,1,$1+$1,$2,$3,$4,$5,0*
20,1,$1+$1,$4,$5,$6,$7,0*
20,1,$1+$1,$6,$7,$8,$9,0*
20,1,$1+$1,$8,$9,$2,$3,0*%
G04 Aperture macros list end*
%TA.AperFunction,ComponentPad*%
%ADD10RoundRect,0.250000X0.750000X0.750000X-0.750000X0.750000X-0.750000X-0.750000X0.750000X-0.750000X0*%
%TD*%
%TA.AperFunction,ComponentPad*%
%ADD11C,2.000000*%
%TD*%
%TA.AperFunction,ComponentPad*%
%ADD12O,16.300000X4.000000*%
%TD*%
%TA.AperFunction,ComponentPad*%
%ADD13RoundRect,0.250000X-0.750000X0.750000X-0.750000X-0.750000X0.750000X-0.750000X0.750000X0.750000X0*%
%TD*%
%TA.AperFunction,ComponentPad*%
%ADD14R,2.200000X2.200000*%
%TD*%
%TA.AperFunction,ComponentPad*%
%ADD15O,2.200000X2.200000*%
%TD*%
%TA.AperFunction,ComponentPad*%
%ADD16RoundRect,0.250001X0.799999X-0.799999X0.799999X0.799999X-0.799999X0.799999X-0.799999X-0.799999X0*%
%TD*%
%TA.AperFunction,SMDPad,CuDef*%
%ADD17R,2.900000X20.500000*%
%TD*%
%TA.AperFunction,Conductor*%
%ADD18C,0.800000*%
%TD*%
G04 APERTURE END LIST*
D10*
%TO.P,J4,1,Pin_1*%
%TO.N,MotorPCB_+5V*%
X206825000Y-227250000D03*
D11*
%TO.P,J4,2,Pin_2*%
%TO.N,GND1*%
X202325000Y-227250000D03*
%TD*%
D12*
%TO.P,H4,1,1*%
%TO.N,GND1*%
X231445000Y-222200000D03*
%TD*%
D13*
%TO.P,J5,1,Pin_1*%
%TO.N,MotorPCB_+5V*%
X299545000Y-217750000D03*
D11*
%TO.P,J5,2,Pin_2*%
%TO.N,/MotorPCB_+5V_Switched*%
X299545000Y-222250000D03*
%TO.P,J5,3,Pin_3*%
%TO.N,GND1*%
X299545000Y-226750000D03*
%TD*%
D10*
%TO.P,J2,1,Pin_1*%
%TO.N,Net-(D21-K)*%
X206825000Y-217240000D03*
D11*
%TO.P,J2,2,Pin_2*%
%TO.N,GND1*%
X202325000Y-217240000D03*
%TD*%
D14*
%TO.P,D21,1,K*%
%TO.N,Net-(D21-K)*%
X216295000Y-217170000D03*
D15*
%TO.P,D21,2,A*%
%TO.N,/MotorPCB_+5V_Switched*%
X216295000Y-227330000D03*
%TD*%
D16*
%TO.P,H12,1,1*%
%TO.N,GND1*%
X211328000Y-222885000D03*
%TD*%
D17*
%TO.P,H5,1,1*%
%TO.N,GND1*%
X317545000Y-222250000D03*
%TD*%
D18*
%TO.N,Net-(D21-K)*%
X206895000Y-217170000D02*
X206825000Y-217240000D01*
X216295000Y-217170000D02*
X206895000Y-217170000D01*
%TD*%
%TA.AperFunction,Conductor*%
%TO.N,GND1*%
G36*
X317587539Y-208820185D02*
G01*
X317633294Y-208872989D01*
X317644500Y-208924500D01*
X317644500Y-211376000D01*
X317624815Y-211443039D01*
X317572011Y-211488794D01*
X317520500Y-211500000D01*
X316050482Y-211500000D01*
X316043867Y-211500354D01*
X315987628Y-211506400D01*
X315852910Y-211556647D01*
X315737811Y-211642811D01*
X315651647Y-211757910D01*
X315601400Y-211892628D01*
X315595354Y-211948867D01*
X315595000Y-211955481D01*
X315595000Y-219946447D01*
X317545000Y-221896447D01*
X317810872Y-222162318D01*
X317844357Y-222223641D01*
X317839373Y-222293332D01*
X317810872Y-222337680D01*
X315595000Y-224553552D01*
X315595000Y-232544518D01*
X315595354Y-232551132D01*
X315601400Y-232607371D01*
X315651647Y-232742089D01*
X315737811Y-232857188D01*
X315852910Y-232943352D01*
X315987628Y-232993599D01*
X316043867Y-232999645D01*
X316050482Y-233000000D01*
X317520500Y-233000000D01*
X317587539Y-233019685D01*
X317633294Y-233072489D01*
X317644500Y-233124000D01*
X317644500Y-235575500D01*
X317624815Y-235642539D01*
X317572011Y-235688294D01*
X317520500Y-235699500D01*
X183419000Y-235699500D01*
X183351961Y-235679815D01*
X183306206Y-235627011D01*
X183295000Y-235575500D01*
X183295000Y-227250000D01*
X200819858Y-227250000D01*
X200840386Y-227497732D01*
X200901413Y-227738721D01*
X201001268Y-227966370D01*
X201101563Y-228119882D01*
X201101564Y-228119882D01*
X201905195Y-227316251D01*
X201915762Y-227382969D01*
X201976882Y-227502923D01*
X202072077Y-227598118D01*
X202192031Y-227659238D01*
X202258747Y-227669804D01*
X201454942Y-228473609D01*
X201454942Y-228473610D01*
X201501766Y-228510055D01*
X201720393Y-228628368D01*
X201955506Y-228709083D01*
X202200707Y-228750000D01*
X202449293Y-228750000D01*
X202694493Y-228709083D01*
X202929606Y-228628368D01*
X203148233Y-228510053D01*
X203195056Y-228473609D01*
X202391251Y-227669804D01*
X202457969Y-227659238D01*
X202577923Y-227598118D01*
X202673118Y-227502923D01*
X202734238Y-227382969D01*
X202744804Y-227316252D01*
X203548434Y-228119882D01*
X203596130Y-228046878D01*
X205324500Y-228046878D01*
X205324501Y-228050008D01*
X205324820Y-228053140D01*
X205324821Y-228053141D01*
X205335000Y-228152796D01*
X205390186Y-228319334D01*
X205482288Y-228468657D01*
X205606342Y-228592711D01*
X205606344Y-228592712D01*
X205755666Y-228684814D01*
X205867016Y-228721712D01*
X205922202Y-228739999D01*
X206021858Y-228750180D01*
X206021859Y-228750180D01*
X206024991Y-228750500D01*
X207625008Y-228750499D01*
X207727797Y-228739999D01*
X207894334Y-228684814D01*
X208043656Y-228592712D01*
X208167712Y-228468656D01*
X208259814Y-228319334D01*
X208314999Y-228152797D01*
X208325500Y-228050009D01*
X208325500Y-227330000D01*
X214689551Y-227330000D01*
X214709317Y-227581149D01*
X214768126Y-227826110D01*
X214816330Y-227942485D01*
X214864534Y-228058859D01*
X214996164Y-228273659D01*
X215159776Y-228465224D01*
X215351341Y-228628836D01*
X215566141Y-228760466D01*
X215798889Y-228856873D01*
X216043852Y-228915683D01*
X216295000Y-228935449D01*
X216546148Y-228915683D01*
X216791111Y-228856873D01*
X217023859Y-228760466D01*
X217238659Y-228628836D01*
X217430224Y-228465224D01*
X217593836Y-228273659D01*
X217725466Y-228058859D01*
X217821873Y-227826111D01*
X217880683Y-227581148D01*
X217900449Y-227330000D01*
X217880683Y-227078852D01*
X217821873Y-226833889D01*
X217787125Y-226749999D01*
X298039858Y-226749999D01*
X298060386Y-226997732D01*
X298121413Y-227238721D01*
X298221268Y-227466370D01*
X298321563Y-227619882D01*
X298321564Y-227619882D01*
X299125195Y-226816251D01*
X299135762Y-226882969D01*
X299196882Y-227002923D01*
X299292077Y-227098118D01*
X299412031Y-227159238D01*
X299478747Y-227169804D01*
X298674942Y-227973609D01*
X298674942Y-227973610D01*
X298721766Y-228010055D01*
X298940393Y-228128368D01*
X299175506Y-228209083D01*
X299420707Y-228250000D01*
X299669293Y-228250000D01*
X299914493Y-228209083D01*
X300149606Y-228128368D01*
X300368233Y-228010053D01*
X300415056Y-227973609D01*
X299611251Y-227169804D01*
X299677969Y-227159238D01*
X299797923Y-227098118D01*
X299893118Y-227002923D01*
X299954238Y-226882969D01*
X299964804Y-226816252D01*
X300768434Y-227619882D01*
X300868730Y-227466369D01*
X300968586Y-227238721D01*
X301029613Y-226997732D01*
X301050141Y-226750000D01*
X301029613Y-226502267D01*
X300968586Y-226261278D01*
X300868730Y-226033630D01*
X300768434Y-225880116D01*
X299964804Y-226683746D01*
X299954238Y-226617031D01*
X299893118Y-226497077D01*
X299797923Y-226401882D01*
X299677969Y-226340762D01*
X299611250Y-226330194D01*
X300415056Y-225526389D01*
X300415056Y-225526387D01*
X300368235Y-225489947D01*
X300149606Y-225371631D01*
X299914493Y-225290916D01*
X299669293Y-225250000D01*
X299420707Y-225250000D01*
X299175506Y-225290916D01*
X298940393Y-225371631D01*
X298721764Y-225489946D01*
X298674942Y-225526388D01*
X298674941Y-225526389D01*
X299478748Y-226330195D01*
X299412031Y-226340762D01*
X299292077Y-226401882D01*
X299196882Y-226497077D01*
X299135762Y-226617031D01*
X299125195Y-226683747D01*
X298321564Y-225880116D01*
X298221266Y-226033634D01*
X298121413Y-226261278D01*
X298060386Y-226502267D01*
X298039858Y-226749999D01*
X217787125Y-226749999D01*
X217725466Y-226601141D01*
X217593836Y-226386341D01*
X217430224Y-226194776D01*
X217238659Y-226031164D01*
X217023859Y-225899534D01*
X216907484Y-225851330D01*
X216791110Y-225803126D01*
X216546149Y-225744317D01*
X216295000Y-225724551D01*
X216043850Y-225744317D01*
X215798889Y-225803126D01*
X215566139Y-225899535D01*
X215351342Y-226031163D01*
X215159776Y-226194776D01*
X214996163Y-226386342D01*
X214864535Y-226601139D01*
X214768126Y-226833889D01*
X214709317Y-227078850D01*
X214689551Y-227330000D01*
X208325500Y-227330000D01*
X208325499Y-226449992D01*
X208314999Y-226347203D01*
X208259814Y-226180666D01*
X208202592Y-226087895D01*
X208167711Y-226031342D01*
X208043657Y-225907288D01*
X207894334Y-225815186D01*
X207727797Y-225760000D01*
X207628141Y-225749819D01*
X207628122Y-225749818D01*
X207625009Y-225749500D01*
X207621860Y-225749500D01*
X206028140Y-225749500D01*
X206028120Y-225749500D01*
X206024992Y-225749501D01*
X206021860Y-225749820D01*
X206021858Y-225749821D01*
X205922203Y-225760000D01*
X205755665Y-225815186D01*
X205606342Y-225907288D01*
X205482288Y-226031342D01*
X205390186Y-226180665D01*
X205335000Y-226347202D01*
X205324819Y-226446858D01*
X205324817Y-226446878D01*
X205324500Y-226449991D01*
X205324500Y-226453138D01*
X205324500Y-226453139D01*
X205324500Y-228046859D01*
X205324500Y-228046878D01*
X203596130Y-228046878D01*
X203648730Y-227966369D01*
X203748586Y-227738721D01*
X203809613Y-227497732D01*
X203830141Y-227249999D01*
X203809613Y-227002267D01*
X203748586Y-226761278D01*
X203648730Y-226533630D01*
X203548434Y-226380116D01*
X202744804Y-227183747D01*
X202734238Y-227117031D01*
X202673118Y-226997077D01*
X202577923Y-226901882D01*
X202457969Y-226840762D01*
X202391250Y-226830194D01*
X203195056Y-226026389D01*
X203195056Y-226026387D01*
X203148235Y-225989947D01*
X202929606Y-225871631D01*
X202694493Y-225790916D01*
X202449293Y-225750000D01*
X202200707Y-225750000D01*
X201955506Y-225790916D01*
X201720393Y-225871631D01*
X201501764Y-225989946D01*
X201454942Y-226026388D01*
X201454941Y-226026389D01*
X202258748Y-226830195D01*
X202192031Y-226840762D01*
X202072077Y-226901882D01*
X201976882Y-226997077D01*
X201915762Y-227117031D01*
X201905195Y-227183748D01*
X201101564Y-226380116D01*
X201001266Y-226533634D01*
X200901413Y-226761278D01*
X200840386Y-227002267D01*
X200819858Y-227250000D01*
X183295000Y-227250000D01*
X183295000Y-223731830D01*
X209778000Y-223731830D01*
X209778319Y-223738108D01*
X209788493Y-223837695D01*
X209843642Y-224004121D01*
X209935683Y-224153344D01*
X210059655Y-224277316D01*
X210208878Y-224369357D01*
X210375304Y-224424506D01*
X210474891Y-224434680D01*
X210481169Y-224435000D01*
X211078000Y-224435000D01*
X211078000Y-223376683D01*
X211106819Y-223394209D01*
X211252404Y-223435000D01*
X211365622Y-223435000D01*
X211477783Y-223419584D01*
X211578000Y-223376053D01*
X211578000Y-224435000D01*
X212174831Y-224435000D01*
X212181108Y-224434680D01*
X212280695Y-224424506D01*
X212447121Y-224369357D01*
X212596344Y-224277316D01*
X212720316Y-224153344D01*
X212812357Y-224004121D01*
X212867506Y-223837695D01*
X212877680Y-223738108D01*
X212878000Y-223731830D01*
X212878000Y-223135000D01*
X211822852Y-223135000D01*
X211871559Y-222997953D01*
X211881877Y-222847114D01*
X211851116Y-222699085D01*
X211817910Y-222635000D01*
X212878000Y-222635000D01*
X212878000Y-222450000D01*
X222806712Y-222450000D01*
X222833936Y-222665504D01*
X222835397Y-222673162D01*
X222911689Y-222970297D01*
X222914092Y-222977692D01*
X223027024Y-223262928D01*
X223030337Y-223269967D01*
X223178123Y-223538789D01*
X223182305Y-223545379D01*
X223362614Y-223793554D01*
X223367576Y-223799552D01*
X223577584Y-224023187D01*
X223583245Y-224028503D01*
X223819628Y-224224057D01*
X223825924Y-224228631D01*
X224084948Y-224393012D01*
X224091759Y-224396756D01*
X224369342Y-224527377D01*
X224376573Y-224530240D01*
X224668336Y-224625040D01*
X224675875Y-224626976D01*
X224977220Y-224684461D01*
X224984940Y-224685435D01*
X225214469Y-224699876D01*
X225218393Y-224700000D01*
X231195000Y-224700000D01*
X231195000Y-223200000D01*
X231695000Y-223200000D01*
X231695000Y-224700000D01*
X237671607Y-224700000D01*
X237675530Y-224699876D01*
X237905059Y-224685435D01*
X237912779Y-224684461D01*
X238214124Y-224626976D01*
X238221663Y-224625040D01*
X238513426Y-224530240D01*
X238520657Y-224527377D01*
X238798240Y-224396756D01*
X238805051Y-224393012D01*
X239064075Y-224228631D01*
X239070371Y-224224057D01*
X239306754Y-224028503D01*
X239312415Y-224023187D01*
X239522423Y-223799552D01*
X239527385Y-223793554D01*
X239707694Y-223545379D01*
X239711876Y-223538789D01*
X239859662Y-223269967D01*
X239862975Y-223262928D01*
X239975907Y-222977692D01*
X239978310Y-222970297D01*
X240054602Y-222673162D01*
X240056063Y-222665504D01*
X240083288Y-222450000D01*
X238563246Y-222450000D01*
X238588566Y-222352209D01*
X238593749Y-222250000D01*
X298039356Y-222250000D01*
X298059891Y-222497816D01*
X298059891Y-222497819D01*
X298059892Y-222497821D01*
X298120937Y-222738881D01*
X298135485Y-222772047D01*
X298220825Y-222966604D01*
X298220827Y-222966607D01*
X298356836Y-223174785D01*
X298525256Y-223357738D01*
X298525259Y-223357740D01*
X298721485Y-223510470D01*
X298721487Y-223510471D01*
X298721491Y-223510474D01*
X298940190Y-223628828D01*
X299175386Y-223709571D01*
X299420665Y-223750500D01*
X299669335Y-223750500D01*
X299914614Y-223709571D01*
X300149810Y-223628828D01*
X300368509Y-223510474D01*
X300564744Y-223357738D01*
X300733164Y-223174785D01*
X300869173Y-222966607D01*
X300969063Y-222738881D01*
X301030108Y-222497821D01*
X301050643Y-222250000D01*
X301030108Y-222002179D01*
X300969063Y-221761119D01*
X300869173Y-221533393D01*
X300733164Y-221325215D01*
X300564744Y-221142262D01*
X300542612Y-221125036D01*
X300368514Y-220989529D01*
X300368510Y-220989526D01*
X300368509Y-220989526D01*
X300149810Y-220871172D01*
X300149806Y-220871170D01*
X300149805Y-220871170D01*
X299914615Y-220790429D01*
X299669335Y-220749500D01*
X299420665Y-220749500D01*
X299175384Y-220790429D01*
X298940194Y-220871170D01*
X298721485Y-220989529D01*
X298525259Y-221142259D01*
X298525256Y-221142261D01*
X298525256Y-221142262D01*
X298457910Y-221215419D01*
X298356837Y-221325214D01*
X298220825Y-221533395D01*
X298135974Y-221726837D01*
X298120937Y-221761119D01*
X298086667Y-221896447D01*
X298059891Y-222002183D01*
X298039356Y-222250000D01*
X238593749Y-222250000D01*
X238598867Y-222149090D01*
X238568367Y-221950000D01*
X240083288Y-221950000D01*
X240083287Y-221949999D01*
X240056063Y-221734495D01*
X240054602Y-221726837D01*
X239978310Y-221429702D01*
X239975907Y-221422307D01*
X239862975Y-221137071D01*
X239859662Y-221130032D01*
X239711876Y-220861210D01*
X239707694Y-220854620D01*
X239561610Y-220653552D01*
X315595000Y-220653552D01*
X315595000Y-223846447D01*
X317191447Y-222250000D01*
X317191447Y-222249998D01*
X315595000Y-220653552D01*
X239561610Y-220653552D01*
X239527385Y-220606445D01*
X239522423Y-220600447D01*
X239312415Y-220376812D01*
X239306754Y-220371496D01*
X239070371Y-220175942D01*
X239064075Y-220171368D01*
X238805051Y-220006987D01*
X238798240Y-220003243D01*
X238520657Y-219872622D01*
X238513426Y-219869759D01*
X238221663Y-219774959D01*
X238214124Y-219773023D01*
X237912779Y-219715538D01*
X237905059Y-219714564D01*
X237675530Y-219700123D01*
X237671607Y-219700000D01*
X231695000Y-219700000D01*
X231695000Y-221200000D01*
X231195000Y-221200000D01*
X231195000Y-219700000D01*
X225218393Y-219700000D01*
X225214469Y-219700123D01*
X224984940Y-219714564D01*
X224977220Y-219715538D01*
X224675875Y-219773023D01*
X224668336Y-219774959D01*
X224376573Y-219869759D01*
X224369342Y-219872622D01*
X224091759Y-220003243D01*
X224084948Y-220006987D01*
X223825924Y-220171368D01*
X223819628Y-220175942D01*
X223583245Y-220371496D01*
X223577584Y-220376812D01*
X223367576Y-220600447D01*
X223362614Y-220606445D01*
X223182305Y-220854620D01*
X223178123Y-220861210D01*
X223030337Y-221130032D01*
X223027024Y-221137071D01*
X222914092Y-221422307D01*
X222911689Y-221429702D01*
X222835397Y-221726837D01*
X222833936Y-221734495D01*
X222806712Y-221949999D01*
X222806712Y-221950000D01*
X224326754Y-221950000D01*
X224301434Y-222047791D01*
X224291133Y-222250910D01*
X224321633Y-222450000D01*
X222806712Y-222450000D01*
X212878000Y-222450000D01*
X212878000Y-222038169D01*
X212877680Y-222031891D01*
X212867506Y-221932304D01*
X212812357Y-221765878D01*
X212720316Y-221616655D01*
X212596344Y-221492683D01*
X212447121Y-221400642D01*
X212280695Y-221345493D01*
X212181108Y-221335319D01*
X212174831Y-221335000D01*
X211578000Y-221335000D01*
X211578000Y-222393316D01*
X211549181Y-222375791D01*
X211403596Y-222335000D01*
X211290378Y-222335000D01*
X211178217Y-222350416D01*
X211078000Y-222393946D01*
X211078000Y-221335000D01*
X210481169Y-221335000D01*
X210474891Y-221335319D01*
X210375304Y-221345493D01*
X210208878Y-221400642D01*
X210059655Y-221492683D01*
X209935683Y-221616655D01*
X209843642Y-221765878D01*
X209788493Y-221932304D01*
X209778319Y-222031891D01*
X209778000Y-222038169D01*
X209778000Y-222635000D01*
X210833148Y-222635000D01*
X210784441Y-222772047D01*
X210774123Y-222922886D01*
X210804884Y-223070915D01*
X210838090Y-223135000D01*
X209778000Y-223135000D01*
X209778000Y-223731830D01*
X183295000Y-223731830D01*
X183295000Y-217239999D01*
X200819858Y-217239999D01*
X200840386Y-217487732D01*
X200901413Y-217728721D01*
X201001268Y-217956370D01*
X201101563Y-218109882D01*
X201101564Y-218109882D01*
X201905195Y-217306250D01*
X201915762Y-217372969D01*
X201976882Y-217492923D01*
X202072077Y-217588118D01*
X202192031Y-217649238D01*
X202258747Y-217659804D01*
X201454942Y-218463609D01*
X201454942Y-218463610D01*
X201501766Y-218500055D01*
X201720393Y-218618368D01*
X201955506Y-218699083D01*
X202200707Y-218740000D01*
X202449293Y-218740000D01*
X202694493Y-218699083D01*
X202929606Y-218618368D01*
X203148233Y-218500053D01*
X203195056Y-218463609D01*
X202391251Y-217659804D01*
X202457969Y-217649238D01*
X202577923Y-217588118D01*
X202673118Y-217492923D01*
X202734238Y-217372969D01*
X202744804Y-217306252D01*
X203548434Y-218109882D01*
X203596130Y-218036878D01*
X205324500Y-218036878D01*
X205324501Y-218040008D01*
X205324820Y-218043140D01*
X205324821Y-218043141D01*
X205335000Y-218142796D01*
X205390186Y-218309334D01*
X205482288Y-218458657D01*
X205606342Y-218582711D01*
X205606344Y-218582712D01*
X205755666Y-218674814D01*
X205867016Y-218711712D01*
X205922202Y-218729999D01*
X206021858Y-218740180D01*
X206021859Y-218740180D01*
X206024991Y-218740500D01*
X207625008Y-218740499D01*
X207727797Y-218729999D01*
X207894334Y-218674814D01*
X208043656Y-218582712D01*
X208167712Y-218458656D01*
X208259814Y-218309334D01*
X208310790Y-218155496D01*
X208350564Y-218098051D01*
X208415080Y-218071228D01*
X208428497Y-218070500D01*
X214570501Y-218070500D01*
X214637540Y-218090185D01*
X214683295Y-218142989D01*
X214694501Y-218194500D01*
X214694501Y-218317872D01*
X214700909Y-218377483D01*
X214751204Y-218512331D01*
X214837454Y-218627546D01*
X214952669Y-218713796D01*
X215087517Y-218764091D01*
X215147127Y-218770500D01*
X217442872Y-218770499D01*
X217502483Y-218764091D01*
X217637331Y-218713796D01*
X217752546Y-218627546D01*
X217812934Y-218546878D01*
X298044500Y-218546878D01*
X298044501Y-218550008D01*
X298044820Y-218553140D01*
X298044821Y-218553141D01*
X298055000Y-218652796D01*
X298110186Y-218819334D01*
X298202288Y-218968657D01*
X298326342Y-219092711D01*
X298326344Y-219092712D01*
X298475666Y-219184814D01*
X298587016Y-219221712D01*
X298642202Y-219239999D01*
X298741858Y-219250180D01*
X298741859Y-219250180D01*
X298744991Y-219250500D01*
X300345008Y-219250499D01*
X300447797Y-219239999D01*
X300614334Y-219184814D01*
X300763656Y-219092712D01*
X300887712Y-218968656D01*
X300979814Y-218819334D01*
X301034999Y-218652797D01*
X301045500Y-218550009D01*
X301045499Y-216949992D01*
X301034999Y-216847203D01*
X300979814Y-216680666D01*
X300887712Y-216531344D01*
X300887711Y-216531342D01*
X300763657Y-216407288D01*
X300614334Y-216315186D01*
X300447797Y-216260000D01*
X300348141Y-216249819D01*
X300348122Y-216249818D01*
X300345009Y-216249500D01*
X300341860Y-216249500D01*
X298748140Y-216249500D01*
X298748120Y-216249500D01*
X298744992Y-216249501D01*
X298741860Y-216249820D01*
X298741858Y-216249821D01*
X298642203Y-216260000D01*
X298475665Y-216315186D01*
X298326342Y-216407288D01*
X298202288Y-216531342D01*
X298110186Y-216680665D01*
X298055000Y-216847202D01*
X298044819Y-216946858D01*
X298044817Y-216946878D01*
X298044500Y-216949991D01*
X298044500Y-216953138D01*
X298044500Y-216953139D01*
X298044500Y-218546859D01*
X298044500Y-218546878D01*
X217812934Y-218546878D01*
X217838796Y-218512331D01*
X217889091Y-218377483D01*
X217895500Y-218317873D01*
X217895499Y-216022128D01*
X217889091Y-215962517D01*
X217838796Y-215827669D01*
X217752546Y-215712454D01*
X217637331Y-215626204D01*
X217502483Y-215575909D01*
X217442873Y-215569500D01*
X217439550Y-215569500D01*
X215150439Y-215569500D01*
X215150420Y-215569500D01*
X215147128Y-215569501D01*
X215143848Y-215569853D01*
X215143840Y-215569854D01*
X215087515Y-215575909D01*
X214952669Y-215626204D01*
X214837454Y-215712454D01*
X214751204Y-215827668D01*
X214700910Y-215962515D01*
X214700909Y-215962517D01*
X214694500Y-216022127D01*
X214694500Y-216025448D01*
X214694500Y-216025449D01*
X214694500Y-216145500D01*
X214674815Y-216212539D01*
X214622011Y-216258294D01*
X214570500Y-216269500D01*
X208382105Y-216269500D01*
X208315066Y-216249815D01*
X208269311Y-216197011D01*
X208264399Y-216184504D01*
X208259814Y-216170666D01*
X208167712Y-216021344D01*
X208167711Y-216021342D01*
X208043657Y-215897288D01*
X207894334Y-215805186D01*
X207727797Y-215750000D01*
X207628141Y-215739819D01*
X207628122Y-215739818D01*
X207625009Y-215739500D01*
X207621860Y-215739500D01*
X206028140Y-215739500D01*
X206028120Y-215739500D01*
X206024992Y-215739501D01*
X206021860Y-215739820D01*
X206021858Y-215739821D01*
X205922203Y-215750000D01*
X205755665Y-215805186D01*
X205606342Y-215897288D01*
X205482288Y-216021342D01*
X205390186Y-216170665D01*
X205335000Y-216337202D01*
X205324819Y-216436858D01*
X205324817Y-216436878D01*
X205324500Y-216439991D01*
X205324500Y-216443138D01*
X205324500Y-216443139D01*
X205324500Y-218036859D01*
X205324500Y-218036878D01*
X203596130Y-218036878D01*
X203648730Y-217956369D01*
X203748586Y-217728721D01*
X203809613Y-217487732D01*
X203830141Y-217240000D01*
X203809613Y-216992267D01*
X203748586Y-216751278D01*
X203648730Y-216523630D01*
X203548434Y-216370116D01*
X202744804Y-217173747D01*
X202734238Y-217107031D01*
X202673118Y-216987077D01*
X202577923Y-216891882D01*
X202457969Y-216830762D01*
X202391250Y-216820194D01*
X203195056Y-216016389D01*
X203195056Y-216016387D01*
X203148235Y-215979947D01*
X202929606Y-215861631D01*
X202694493Y-215780916D01*
X202449293Y-215740000D01*
X202200707Y-215740000D01*
X201955506Y-215780916D01*
X201720393Y-215861631D01*
X201501764Y-215979946D01*
X201454942Y-216016388D01*
X201454941Y-216016389D01*
X202258748Y-216820195D01*
X202192031Y-216830762D01*
X202072077Y-216891882D01*
X201976882Y-216987077D01*
X201915762Y-217107031D01*
X201905195Y-217173748D01*
X201101564Y-216370116D01*
X201001266Y-216523634D01*
X200901413Y-216751278D01*
X200840386Y-216992267D01*
X200819858Y-217239999D01*
X183295000Y-217239999D01*
X183295000Y-208924500D01*
X183314685Y-208857461D01*
X183367489Y-208811706D01*
X183419000Y-208800500D01*
X317520500Y-208800500D01*
X317587539Y-208820185D01*
G37*
%TD.AperFunction*%
%TD*%
M02*
