%TF.GenerationSoftware,KiCad,Pcbnew,7.0.2*%
%TF.CreationDate,2023-08-10T20:20:56+02:00*%
%TF.ProjectId,PropellerClockPCB,50726f70-656c-46c6-9572-436c6f636b50,v1.0.0*%
%TF.SameCoordinates,Original*%
%TF.FileFunction,Drillmap*%
%TF.FilePolarity,Positive*%
%FSLAX45Y45*%
G04 Gerber Fmt 4.5, Leading zero omitted, Abs format (unit mm)*
G04 Created by KiCad (PCBNEW 7.0.2) date 2023-08-10 20:20:56*
%MOMM*%
%LPD*%
G01*
G04 APERTURE LIST*
%ADD10C,0.250000*%
%ADD11C,0.200000*%
%ADD12C,0.070000*%
G04 APERTURE END LIST*
D10*
X6000000Y-10079600D02*
X6000000Y-12829600D01*
X6000000Y-12829600D02*
X26000000Y-12829600D01*
X26000000Y-10079600D02*
X6000000Y-10079600D01*
X26000000Y-12829600D02*
X26000000Y-10079600D01*
D11*
D12*
X14985000Y-10466000D02*
X15055000Y-10536000D01*
X15055000Y-10466000D02*
X14985000Y-10536000D01*
X15470000Y-10466000D02*
X15540000Y-10536000D01*
X15540000Y-10466000D02*
X15470000Y-10536000D01*
D11*
X6235119Y-13154624D02*
X6235119Y-12954624D01*
X6235119Y-12954624D02*
X6282738Y-12954624D01*
X6282738Y-12954624D02*
X6311309Y-12964148D01*
X6311309Y-12964148D02*
X6330357Y-12983195D01*
X6330357Y-12983195D02*
X6339881Y-13002243D01*
X6339881Y-13002243D02*
X6349405Y-13040338D01*
X6349405Y-13040338D02*
X6349405Y-13068909D01*
X6349405Y-13068909D02*
X6339881Y-13107005D01*
X6339881Y-13107005D02*
X6330357Y-13126052D01*
X6330357Y-13126052D02*
X6311309Y-13145100D01*
X6311309Y-13145100D02*
X6282738Y-13154624D01*
X6282738Y-13154624D02*
X6235119Y-13154624D01*
X6435119Y-13154624D02*
X6435119Y-13021290D01*
X6435119Y-13059386D02*
X6444643Y-13040338D01*
X6444643Y-13040338D02*
X6454167Y-13030814D01*
X6454167Y-13030814D02*
X6473214Y-13021290D01*
X6473214Y-13021290D02*
X6492262Y-13021290D01*
X6558928Y-13154624D02*
X6558928Y-13021290D01*
X6558928Y-12954624D02*
X6549405Y-12964148D01*
X6549405Y-12964148D02*
X6558928Y-12973671D01*
X6558928Y-12973671D02*
X6568452Y-12964148D01*
X6568452Y-12964148D02*
X6558928Y-12954624D01*
X6558928Y-12954624D02*
X6558928Y-12973671D01*
X6682738Y-13154624D02*
X6663690Y-13145100D01*
X6663690Y-13145100D02*
X6654167Y-13126052D01*
X6654167Y-13126052D02*
X6654167Y-12954624D01*
X6787500Y-13154624D02*
X6768452Y-13145100D01*
X6768452Y-13145100D02*
X6758928Y-13126052D01*
X6758928Y-13126052D02*
X6758928Y-12954624D01*
X7016071Y-13154624D02*
X7016071Y-12954624D01*
X7016071Y-12954624D02*
X7082738Y-13097481D01*
X7082738Y-13097481D02*
X7149405Y-12954624D01*
X7149405Y-12954624D02*
X7149405Y-13154624D01*
X7330357Y-13154624D02*
X7330357Y-13049862D01*
X7330357Y-13049862D02*
X7320833Y-13030814D01*
X7320833Y-13030814D02*
X7301786Y-13021290D01*
X7301786Y-13021290D02*
X7263690Y-13021290D01*
X7263690Y-13021290D02*
X7244643Y-13030814D01*
X7330357Y-13145100D02*
X7311309Y-13154624D01*
X7311309Y-13154624D02*
X7263690Y-13154624D01*
X7263690Y-13154624D02*
X7244643Y-13145100D01*
X7244643Y-13145100D02*
X7235119Y-13126052D01*
X7235119Y-13126052D02*
X7235119Y-13107005D01*
X7235119Y-13107005D02*
X7244643Y-13087957D01*
X7244643Y-13087957D02*
X7263690Y-13078433D01*
X7263690Y-13078433D02*
X7311309Y-13078433D01*
X7311309Y-13078433D02*
X7330357Y-13068909D01*
X7425595Y-13021290D02*
X7425595Y-13221290D01*
X7425595Y-13030814D02*
X7444643Y-13021290D01*
X7444643Y-13021290D02*
X7482738Y-13021290D01*
X7482738Y-13021290D02*
X7501786Y-13030814D01*
X7501786Y-13030814D02*
X7511309Y-13040338D01*
X7511309Y-13040338D02*
X7520833Y-13059386D01*
X7520833Y-13059386D02*
X7520833Y-13116528D01*
X7520833Y-13116528D02*
X7511309Y-13135576D01*
X7511309Y-13135576D02*
X7501786Y-13145100D01*
X7501786Y-13145100D02*
X7482738Y-13154624D01*
X7482738Y-13154624D02*
X7444643Y-13154624D01*
X7444643Y-13154624D02*
X7425595Y-13145100D01*
X7606548Y-13135576D02*
X7616071Y-13145100D01*
X7616071Y-13145100D02*
X7606548Y-13154624D01*
X7606548Y-13154624D02*
X7597024Y-13145100D01*
X7597024Y-13145100D02*
X7606548Y-13135576D01*
X7606548Y-13135576D02*
X7606548Y-13154624D01*
X7606548Y-13030814D02*
X7616071Y-13040338D01*
X7616071Y-13040338D02*
X7606548Y-13049862D01*
X7606548Y-13049862D02*
X7597024Y-13040338D01*
X7597024Y-13040338D02*
X7606548Y-13030814D01*
X7606548Y-13030814D02*
X7606548Y-13049862D01*
D12*
X5917500Y-13447100D02*
X5987500Y-13517100D01*
X5987500Y-13447100D02*
X5917500Y-13517100D01*
D11*
X6273214Y-13374624D02*
X6292262Y-13374624D01*
X6292262Y-13374624D02*
X6311309Y-13384148D01*
X6311309Y-13384148D02*
X6320833Y-13393671D01*
X6320833Y-13393671D02*
X6330357Y-13412719D01*
X6330357Y-13412719D02*
X6339881Y-13450814D01*
X6339881Y-13450814D02*
X6339881Y-13498433D01*
X6339881Y-13498433D02*
X6330357Y-13536528D01*
X6330357Y-13536528D02*
X6320833Y-13555576D01*
X6320833Y-13555576D02*
X6311309Y-13565100D01*
X6311309Y-13565100D02*
X6292262Y-13574624D01*
X6292262Y-13574624D02*
X6273214Y-13574624D01*
X6273214Y-13574624D02*
X6254167Y-13565100D01*
X6254167Y-13565100D02*
X6244643Y-13555576D01*
X6244643Y-13555576D02*
X6235119Y-13536528D01*
X6235119Y-13536528D02*
X6225595Y-13498433D01*
X6225595Y-13498433D02*
X6225595Y-13450814D01*
X6225595Y-13450814D02*
X6235119Y-13412719D01*
X6235119Y-13412719D02*
X6244643Y-13393671D01*
X6244643Y-13393671D02*
X6254167Y-13384148D01*
X6254167Y-13384148D02*
X6273214Y-13374624D01*
X6425595Y-13555576D02*
X6435119Y-13565100D01*
X6435119Y-13565100D02*
X6425595Y-13574624D01*
X6425595Y-13574624D02*
X6416071Y-13565100D01*
X6416071Y-13565100D02*
X6425595Y-13555576D01*
X6425595Y-13555576D02*
X6425595Y-13574624D01*
X6501786Y-13374624D02*
X6635119Y-13374624D01*
X6635119Y-13374624D02*
X6549405Y-13574624D01*
X6749405Y-13374624D02*
X6768452Y-13374624D01*
X6768452Y-13374624D02*
X6787500Y-13384148D01*
X6787500Y-13384148D02*
X6797024Y-13393671D01*
X6797024Y-13393671D02*
X6806548Y-13412719D01*
X6806548Y-13412719D02*
X6816071Y-13450814D01*
X6816071Y-13450814D02*
X6816071Y-13498433D01*
X6816071Y-13498433D02*
X6806548Y-13536528D01*
X6806548Y-13536528D02*
X6797024Y-13555576D01*
X6797024Y-13555576D02*
X6787500Y-13565100D01*
X6787500Y-13565100D02*
X6768452Y-13574624D01*
X6768452Y-13574624D02*
X6749405Y-13574624D01*
X6749405Y-13574624D02*
X6730357Y-13565100D01*
X6730357Y-13565100D02*
X6720833Y-13555576D01*
X6720833Y-13555576D02*
X6711309Y-13536528D01*
X6711309Y-13536528D02*
X6701786Y-13498433D01*
X6701786Y-13498433D02*
X6701786Y-13450814D01*
X6701786Y-13450814D02*
X6711309Y-13412719D01*
X6711309Y-13412719D02*
X6720833Y-13393671D01*
X6720833Y-13393671D02*
X6730357Y-13384148D01*
X6730357Y-13384148D02*
X6749405Y-13374624D01*
X6939881Y-13374624D02*
X6958929Y-13374624D01*
X6958929Y-13374624D02*
X6977976Y-13384148D01*
X6977976Y-13384148D02*
X6987500Y-13393671D01*
X6987500Y-13393671D02*
X6997024Y-13412719D01*
X6997024Y-13412719D02*
X7006548Y-13450814D01*
X7006548Y-13450814D02*
X7006548Y-13498433D01*
X7006548Y-13498433D02*
X6997024Y-13536528D01*
X6997024Y-13536528D02*
X6987500Y-13555576D01*
X6987500Y-13555576D02*
X6977976Y-13565100D01*
X6977976Y-13565100D02*
X6958929Y-13574624D01*
X6958929Y-13574624D02*
X6939881Y-13574624D01*
X6939881Y-13574624D02*
X6920833Y-13565100D01*
X6920833Y-13565100D02*
X6911309Y-13555576D01*
X6911309Y-13555576D02*
X6901786Y-13536528D01*
X6901786Y-13536528D02*
X6892262Y-13498433D01*
X6892262Y-13498433D02*
X6892262Y-13450814D01*
X6892262Y-13450814D02*
X6901786Y-13412719D01*
X6901786Y-13412719D02*
X6911309Y-13393671D01*
X6911309Y-13393671D02*
X6920833Y-13384148D01*
X6920833Y-13384148D02*
X6939881Y-13374624D01*
X7092262Y-13574624D02*
X7092262Y-13441290D01*
X7092262Y-13460338D02*
X7101786Y-13450814D01*
X7101786Y-13450814D02*
X7120833Y-13441290D01*
X7120833Y-13441290D02*
X7149405Y-13441290D01*
X7149405Y-13441290D02*
X7168452Y-13450814D01*
X7168452Y-13450814D02*
X7177976Y-13469862D01*
X7177976Y-13469862D02*
X7177976Y-13574624D01*
X7177976Y-13469862D02*
X7187500Y-13450814D01*
X7187500Y-13450814D02*
X7206548Y-13441290D01*
X7206548Y-13441290D02*
X7235119Y-13441290D01*
X7235119Y-13441290D02*
X7254167Y-13450814D01*
X7254167Y-13450814D02*
X7263690Y-13469862D01*
X7263690Y-13469862D02*
X7263690Y-13574624D01*
X7358929Y-13574624D02*
X7358929Y-13441290D01*
X7358929Y-13460338D02*
X7368452Y-13450814D01*
X7368452Y-13450814D02*
X7387500Y-13441290D01*
X7387500Y-13441290D02*
X7416071Y-13441290D01*
X7416071Y-13441290D02*
X7435119Y-13450814D01*
X7435119Y-13450814D02*
X7444643Y-13469862D01*
X7444643Y-13469862D02*
X7444643Y-13574624D01*
X7444643Y-13469862D02*
X7454167Y-13450814D01*
X7454167Y-13450814D02*
X7473214Y-13441290D01*
X7473214Y-13441290D02*
X7501786Y-13441290D01*
X7501786Y-13441290D02*
X7520833Y-13450814D01*
X7520833Y-13450814D02*
X7530357Y-13469862D01*
X7530357Y-13469862D02*
X7530357Y-13574624D01*
X7920833Y-13365100D02*
X7749405Y-13622243D01*
X8177976Y-13374624D02*
X8197024Y-13374624D01*
X8197024Y-13374624D02*
X8216072Y-13384148D01*
X8216072Y-13384148D02*
X8225595Y-13393671D01*
X8225595Y-13393671D02*
X8235119Y-13412719D01*
X8235119Y-13412719D02*
X8244643Y-13450814D01*
X8244643Y-13450814D02*
X8244643Y-13498433D01*
X8244643Y-13498433D02*
X8235119Y-13536528D01*
X8235119Y-13536528D02*
X8225595Y-13555576D01*
X8225595Y-13555576D02*
X8216072Y-13565100D01*
X8216072Y-13565100D02*
X8197024Y-13574624D01*
X8197024Y-13574624D02*
X8177976Y-13574624D01*
X8177976Y-13574624D02*
X8158929Y-13565100D01*
X8158929Y-13565100D02*
X8149405Y-13555576D01*
X8149405Y-13555576D02*
X8139881Y-13536528D01*
X8139881Y-13536528D02*
X8130357Y-13498433D01*
X8130357Y-13498433D02*
X8130357Y-13450814D01*
X8130357Y-13450814D02*
X8139881Y-13412719D01*
X8139881Y-13412719D02*
X8149405Y-13393671D01*
X8149405Y-13393671D02*
X8158929Y-13384148D01*
X8158929Y-13384148D02*
X8177976Y-13374624D01*
X8330357Y-13555576D02*
X8339881Y-13565100D01*
X8339881Y-13565100D02*
X8330357Y-13574624D01*
X8330357Y-13574624D02*
X8320833Y-13565100D01*
X8320833Y-13565100D02*
X8330357Y-13555576D01*
X8330357Y-13555576D02*
X8330357Y-13574624D01*
X8463691Y-13374624D02*
X8482738Y-13374624D01*
X8482738Y-13374624D02*
X8501786Y-13384148D01*
X8501786Y-13384148D02*
X8511310Y-13393671D01*
X8511310Y-13393671D02*
X8520834Y-13412719D01*
X8520834Y-13412719D02*
X8530357Y-13450814D01*
X8530357Y-13450814D02*
X8530357Y-13498433D01*
X8530357Y-13498433D02*
X8520834Y-13536528D01*
X8520834Y-13536528D02*
X8511310Y-13555576D01*
X8511310Y-13555576D02*
X8501786Y-13565100D01*
X8501786Y-13565100D02*
X8482738Y-13574624D01*
X8482738Y-13574624D02*
X8463691Y-13574624D01*
X8463691Y-13574624D02*
X8444643Y-13565100D01*
X8444643Y-13565100D02*
X8435119Y-13555576D01*
X8435119Y-13555576D02*
X8425595Y-13536528D01*
X8425595Y-13536528D02*
X8416072Y-13498433D01*
X8416072Y-13498433D02*
X8416072Y-13450814D01*
X8416072Y-13450814D02*
X8425595Y-13412719D01*
X8425595Y-13412719D02*
X8435119Y-13393671D01*
X8435119Y-13393671D02*
X8444643Y-13384148D01*
X8444643Y-13384148D02*
X8463691Y-13374624D01*
X8606548Y-13393671D02*
X8616072Y-13384148D01*
X8616072Y-13384148D02*
X8635119Y-13374624D01*
X8635119Y-13374624D02*
X8682738Y-13374624D01*
X8682738Y-13374624D02*
X8701786Y-13384148D01*
X8701786Y-13384148D02*
X8711310Y-13393671D01*
X8711310Y-13393671D02*
X8720834Y-13412719D01*
X8720834Y-13412719D02*
X8720834Y-13431767D01*
X8720834Y-13431767D02*
X8711310Y-13460338D01*
X8711310Y-13460338D02*
X8597024Y-13574624D01*
X8597024Y-13574624D02*
X8720834Y-13574624D01*
X8787500Y-13374624D02*
X8920834Y-13374624D01*
X8920834Y-13374624D02*
X8835119Y-13574624D01*
X9082738Y-13374624D02*
X9044643Y-13374624D01*
X9044643Y-13374624D02*
X9025595Y-13384148D01*
X9025595Y-13384148D02*
X9016072Y-13393671D01*
X9016072Y-13393671D02*
X8997024Y-13422243D01*
X8997024Y-13422243D02*
X8987500Y-13460338D01*
X8987500Y-13460338D02*
X8987500Y-13536528D01*
X8987500Y-13536528D02*
X8997024Y-13555576D01*
X8997024Y-13555576D02*
X9006548Y-13565100D01*
X9006548Y-13565100D02*
X9025595Y-13574624D01*
X9025595Y-13574624D02*
X9063691Y-13574624D01*
X9063691Y-13574624D02*
X9082738Y-13565100D01*
X9082738Y-13565100D02*
X9092262Y-13555576D01*
X9092262Y-13555576D02*
X9101786Y-13536528D01*
X9101786Y-13536528D02*
X9101786Y-13488909D01*
X9101786Y-13488909D02*
X9092262Y-13469862D01*
X9092262Y-13469862D02*
X9082738Y-13460338D01*
X9082738Y-13460338D02*
X9063691Y-13450814D01*
X9063691Y-13450814D02*
X9025595Y-13450814D01*
X9025595Y-13450814D02*
X9006548Y-13460338D01*
X9006548Y-13460338D02*
X8997024Y-13469862D01*
X8997024Y-13469862D02*
X8987500Y-13488909D01*
X9177976Y-13374624D02*
X9177976Y-13412719D01*
X9254167Y-13374624D02*
X9254167Y-13412719D01*
X9549405Y-13650814D02*
X9539881Y-13641290D01*
X9539881Y-13641290D02*
X9520834Y-13612719D01*
X9520834Y-13612719D02*
X9511310Y-13593671D01*
X9511310Y-13593671D02*
X9501786Y-13565100D01*
X9501786Y-13565100D02*
X9492262Y-13517481D01*
X9492262Y-13517481D02*
X9492262Y-13479386D01*
X9492262Y-13479386D02*
X9501786Y-13431767D01*
X9501786Y-13431767D02*
X9511310Y-13403195D01*
X9511310Y-13403195D02*
X9520834Y-13384148D01*
X9520834Y-13384148D02*
X9539881Y-13355576D01*
X9539881Y-13355576D02*
X9549405Y-13346052D01*
X9616072Y-13393671D02*
X9625596Y-13384148D01*
X9625596Y-13384148D02*
X9644643Y-13374624D01*
X9644643Y-13374624D02*
X9692262Y-13374624D01*
X9692262Y-13374624D02*
X9711310Y-13384148D01*
X9711310Y-13384148D02*
X9720834Y-13393671D01*
X9720834Y-13393671D02*
X9730357Y-13412719D01*
X9730357Y-13412719D02*
X9730357Y-13431767D01*
X9730357Y-13431767D02*
X9720834Y-13460338D01*
X9720834Y-13460338D02*
X9606548Y-13574624D01*
X9606548Y-13574624D02*
X9730357Y-13574624D01*
X9968453Y-13574624D02*
X9968453Y-13374624D01*
X10054167Y-13574624D02*
X10054167Y-13469862D01*
X10054167Y-13469862D02*
X10044643Y-13450814D01*
X10044643Y-13450814D02*
X10025596Y-13441290D01*
X10025596Y-13441290D02*
X9997024Y-13441290D01*
X9997024Y-13441290D02*
X9977977Y-13450814D01*
X9977977Y-13450814D02*
X9968453Y-13460338D01*
X10177977Y-13574624D02*
X10158929Y-13565100D01*
X10158929Y-13565100D02*
X10149405Y-13555576D01*
X10149405Y-13555576D02*
X10139881Y-13536528D01*
X10139881Y-13536528D02*
X10139881Y-13479386D01*
X10139881Y-13479386D02*
X10149405Y-13460338D01*
X10149405Y-13460338D02*
X10158929Y-13450814D01*
X10158929Y-13450814D02*
X10177977Y-13441290D01*
X10177977Y-13441290D02*
X10206548Y-13441290D01*
X10206548Y-13441290D02*
X10225596Y-13450814D01*
X10225596Y-13450814D02*
X10235119Y-13460338D01*
X10235119Y-13460338D02*
X10244643Y-13479386D01*
X10244643Y-13479386D02*
X10244643Y-13536528D01*
X10244643Y-13536528D02*
X10235119Y-13555576D01*
X10235119Y-13555576D02*
X10225596Y-13565100D01*
X10225596Y-13565100D02*
X10206548Y-13574624D01*
X10206548Y-13574624D02*
X10177977Y-13574624D01*
X10358929Y-13574624D02*
X10339881Y-13565100D01*
X10339881Y-13565100D02*
X10330358Y-13546052D01*
X10330358Y-13546052D02*
X10330358Y-13374624D01*
X10511310Y-13565100D02*
X10492262Y-13574624D01*
X10492262Y-13574624D02*
X10454167Y-13574624D01*
X10454167Y-13574624D02*
X10435119Y-13565100D01*
X10435119Y-13565100D02*
X10425596Y-13546052D01*
X10425596Y-13546052D02*
X10425596Y-13469862D01*
X10425596Y-13469862D02*
X10435119Y-13450814D01*
X10435119Y-13450814D02*
X10454167Y-13441290D01*
X10454167Y-13441290D02*
X10492262Y-13441290D01*
X10492262Y-13441290D02*
X10511310Y-13450814D01*
X10511310Y-13450814D02*
X10520834Y-13469862D01*
X10520834Y-13469862D02*
X10520834Y-13488909D01*
X10520834Y-13488909D02*
X10425596Y-13507957D01*
X10597024Y-13565100D02*
X10616072Y-13574624D01*
X10616072Y-13574624D02*
X10654167Y-13574624D01*
X10654167Y-13574624D02*
X10673215Y-13565100D01*
X10673215Y-13565100D02*
X10682739Y-13546052D01*
X10682739Y-13546052D02*
X10682739Y-13536528D01*
X10682739Y-13536528D02*
X10673215Y-13517481D01*
X10673215Y-13517481D02*
X10654167Y-13507957D01*
X10654167Y-13507957D02*
X10625596Y-13507957D01*
X10625596Y-13507957D02*
X10606548Y-13498433D01*
X10606548Y-13498433D02*
X10597024Y-13479386D01*
X10597024Y-13479386D02*
X10597024Y-13469862D01*
X10597024Y-13469862D02*
X10606548Y-13450814D01*
X10606548Y-13450814D02*
X10625596Y-13441290D01*
X10625596Y-13441290D02*
X10654167Y-13441290D01*
X10654167Y-13441290D02*
X10673215Y-13450814D01*
X10749405Y-13650814D02*
X10758929Y-13641290D01*
X10758929Y-13641290D02*
X10777977Y-13612719D01*
X10777977Y-13612719D02*
X10787500Y-13593671D01*
X10787500Y-13593671D02*
X10797024Y-13565100D01*
X10797024Y-13565100D02*
X10806548Y-13517481D01*
X10806548Y-13517481D02*
X10806548Y-13479386D01*
X10806548Y-13479386D02*
X10797024Y-13431767D01*
X10797024Y-13431767D02*
X10787500Y-13403195D01*
X10787500Y-13403195D02*
X10777977Y-13384148D01*
X10777977Y-13384148D02*
X10758929Y-13355576D01*
X10758929Y-13355576D02*
X10749405Y-13346052D01*
X11111310Y-13650814D02*
X11101786Y-13641290D01*
X11101786Y-13641290D02*
X11082739Y-13612719D01*
X11082739Y-13612719D02*
X11073215Y-13593671D01*
X11073215Y-13593671D02*
X11063691Y-13565100D01*
X11063691Y-13565100D02*
X11054167Y-13517481D01*
X11054167Y-13517481D02*
X11054167Y-13479386D01*
X11054167Y-13479386D02*
X11063691Y-13431767D01*
X11063691Y-13431767D02*
X11073215Y-13403195D01*
X11073215Y-13403195D02*
X11082739Y-13384148D01*
X11082739Y-13384148D02*
X11101786Y-13355576D01*
X11101786Y-13355576D02*
X11111310Y-13346052D01*
X11187500Y-13441290D02*
X11187500Y-13574624D01*
X11187500Y-13460338D02*
X11197024Y-13450814D01*
X11197024Y-13450814D02*
X11216072Y-13441290D01*
X11216072Y-13441290D02*
X11244643Y-13441290D01*
X11244643Y-13441290D02*
X11263691Y-13450814D01*
X11263691Y-13450814D02*
X11273215Y-13469862D01*
X11273215Y-13469862D02*
X11273215Y-13574624D01*
X11397024Y-13574624D02*
X11377977Y-13565100D01*
X11377977Y-13565100D02*
X11368453Y-13555576D01*
X11368453Y-13555576D02*
X11358929Y-13536528D01*
X11358929Y-13536528D02*
X11358929Y-13479386D01*
X11358929Y-13479386D02*
X11368453Y-13460338D01*
X11368453Y-13460338D02*
X11377977Y-13450814D01*
X11377977Y-13450814D02*
X11397024Y-13441290D01*
X11397024Y-13441290D02*
X11425596Y-13441290D01*
X11425596Y-13441290D02*
X11444643Y-13450814D01*
X11444643Y-13450814D02*
X11454167Y-13460338D01*
X11454167Y-13460338D02*
X11463691Y-13479386D01*
X11463691Y-13479386D02*
X11463691Y-13536528D01*
X11463691Y-13536528D02*
X11454167Y-13555576D01*
X11454167Y-13555576D02*
X11444643Y-13565100D01*
X11444643Y-13565100D02*
X11425596Y-13574624D01*
X11425596Y-13574624D02*
X11397024Y-13574624D01*
X11520834Y-13441290D02*
X11597024Y-13441290D01*
X11549405Y-13374624D02*
X11549405Y-13546052D01*
X11549405Y-13546052D02*
X11558929Y-13565100D01*
X11558929Y-13565100D02*
X11577977Y-13574624D01*
X11577977Y-13574624D02*
X11597024Y-13574624D01*
X11816072Y-13441290D02*
X11816072Y-13641290D01*
X11816072Y-13450814D02*
X11835119Y-13441290D01*
X11835119Y-13441290D02*
X11873215Y-13441290D01*
X11873215Y-13441290D02*
X11892262Y-13450814D01*
X11892262Y-13450814D02*
X11901786Y-13460338D01*
X11901786Y-13460338D02*
X11911310Y-13479386D01*
X11911310Y-13479386D02*
X11911310Y-13536528D01*
X11911310Y-13536528D02*
X11901786Y-13555576D01*
X11901786Y-13555576D02*
X11892262Y-13565100D01*
X11892262Y-13565100D02*
X11873215Y-13574624D01*
X11873215Y-13574624D02*
X11835119Y-13574624D01*
X11835119Y-13574624D02*
X11816072Y-13565100D01*
X12025596Y-13574624D02*
X12006548Y-13565100D01*
X12006548Y-13565100D02*
X11997024Y-13546052D01*
X11997024Y-13546052D02*
X11997024Y-13374624D01*
X12187500Y-13574624D02*
X12187500Y-13469862D01*
X12187500Y-13469862D02*
X12177977Y-13450814D01*
X12177977Y-13450814D02*
X12158929Y-13441290D01*
X12158929Y-13441290D02*
X12120834Y-13441290D01*
X12120834Y-13441290D02*
X12101786Y-13450814D01*
X12187500Y-13565100D02*
X12168453Y-13574624D01*
X12168453Y-13574624D02*
X12120834Y-13574624D01*
X12120834Y-13574624D02*
X12101786Y-13565100D01*
X12101786Y-13565100D02*
X12092262Y-13546052D01*
X12092262Y-13546052D02*
X12092262Y-13527005D01*
X12092262Y-13527005D02*
X12101786Y-13507957D01*
X12101786Y-13507957D02*
X12120834Y-13498433D01*
X12120834Y-13498433D02*
X12168453Y-13498433D01*
X12168453Y-13498433D02*
X12187500Y-13488909D01*
X12254167Y-13441290D02*
X12330358Y-13441290D01*
X12282739Y-13374624D02*
X12282739Y-13546052D01*
X12282739Y-13546052D02*
X12292262Y-13565100D01*
X12292262Y-13565100D02*
X12311310Y-13574624D01*
X12311310Y-13574624D02*
X12330358Y-13574624D01*
X12473215Y-13565100D02*
X12454167Y-13574624D01*
X12454167Y-13574624D02*
X12416072Y-13574624D01*
X12416072Y-13574624D02*
X12397024Y-13565100D01*
X12397024Y-13565100D02*
X12387500Y-13546052D01*
X12387500Y-13546052D02*
X12387500Y-13469862D01*
X12387500Y-13469862D02*
X12397024Y-13450814D01*
X12397024Y-13450814D02*
X12416072Y-13441290D01*
X12416072Y-13441290D02*
X12454167Y-13441290D01*
X12454167Y-13441290D02*
X12473215Y-13450814D01*
X12473215Y-13450814D02*
X12482739Y-13469862D01*
X12482739Y-13469862D02*
X12482739Y-13488909D01*
X12482739Y-13488909D02*
X12387500Y-13507957D01*
X12654167Y-13574624D02*
X12654167Y-13374624D01*
X12654167Y-13565100D02*
X12635120Y-13574624D01*
X12635120Y-13574624D02*
X12597024Y-13574624D01*
X12597024Y-13574624D02*
X12577977Y-13565100D01*
X12577977Y-13565100D02*
X12568453Y-13555576D01*
X12568453Y-13555576D02*
X12558929Y-13536528D01*
X12558929Y-13536528D02*
X12558929Y-13479386D01*
X12558929Y-13479386D02*
X12568453Y-13460338D01*
X12568453Y-13460338D02*
X12577977Y-13450814D01*
X12577977Y-13450814D02*
X12597024Y-13441290D01*
X12597024Y-13441290D02*
X12635120Y-13441290D01*
X12635120Y-13441290D02*
X12654167Y-13450814D01*
X12730358Y-13650814D02*
X12739881Y-13641290D01*
X12739881Y-13641290D02*
X12758929Y-13612719D01*
X12758929Y-13612719D02*
X12768453Y-13593671D01*
X12768453Y-13593671D02*
X12777977Y-13565100D01*
X12777977Y-13565100D02*
X12787500Y-13517481D01*
X12787500Y-13517481D02*
X12787500Y-13479386D01*
X12787500Y-13479386D02*
X12777977Y-13431767D01*
X12777977Y-13431767D02*
X12768453Y-13403195D01*
X12768453Y-13403195D02*
X12758929Y-13384148D01*
X12758929Y-13384148D02*
X12739881Y-13355576D01*
X12739881Y-13355576D02*
X12730358Y-13346052D01*
M02*
