%TF.GenerationSoftware,KiCad,Pcbnew,7.0.2*%
%TF.CreationDate,2023-08-10T20:25:35+02:00*%
%TF.ProjectId,PropellerClockPCB,50726f70-656c-46c6-9572-436c6f636b50,v1.0.0*%
%TF.SameCoordinates,Original*%
%TF.FileFunction,Drillmap*%
%TF.FilePolarity,Positive*%
%FSLAX45Y45*%
G04 Gerber Fmt 4.5, Leading zero omitted, Abs format (unit mm)*
G04 Created by KiCad (PCBNEW 7.0.2) date 2023-08-10 20:25:35*
%MOMM*%
%LPD*%
G01*
G04 APERTURE LIST*
%ADD10C,0.250000*%
%ADD11C,0.200000*%
G04 APERTURE END LIST*
D10*
X9375000Y-21160000D02*
X6625000Y-21160000D01*
X6625000Y-23910000D02*
X9375000Y-23910000D01*
X6625000Y-21160000D02*
X6625000Y-23910000D01*
X9375000Y-23910000D02*
X9375000Y-21160000D01*
D11*
X6860119Y-24235024D02*
X6860119Y-24035024D01*
X6860119Y-24035024D02*
X6907738Y-24035024D01*
X6907738Y-24035024D02*
X6936309Y-24044548D01*
X6936309Y-24044548D02*
X6955357Y-24063595D01*
X6955357Y-24063595D02*
X6964881Y-24082643D01*
X6964881Y-24082643D02*
X6974405Y-24120738D01*
X6974405Y-24120738D02*
X6974405Y-24149309D01*
X6974405Y-24149309D02*
X6964881Y-24187405D01*
X6964881Y-24187405D02*
X6955357Y-24206452D01*
X6955357Y-24206452D02*
X6936309Y-24225500D01*
X6936309Y-24225500D02*
X6907738Y-24235024D01*
X6907738Y-24235024D02*
X6860119Y-24235024D01*
X7060119Y-24235024D02*
X7060119Y-24101690D01*
X7060119Y-24139786D02*
X7069643Y-24120738D01*
X7069643Y-24120738D02*
X7079167Y-24111214D01*
X7079167Y-24111214D02*
X7098214Y-24101690D01*
X7098214Y-24101690D02*
X7117262Y-24101690D01*
X7183928Y-24235024D02*
X7183928Y-24101690D01*
X7183928Y-24035024D02*
X7174405Y-24044548D01*
X7174405Y-24044548D02*
X7183928Y-24054071D01*
X7183928Y-24054071D02*
X7193452Y-24044548D01*
X7193452Y-24044548D02*
X7183928Y-24035024D01*
X7183928Y-24035024D02*
X7183928Y-24054071D01*
X7307738Y-24235024D02*
X7288690Y-24225500D01*
X7288690Y-24225500D02*
X7279167Y-24206452D01*
X7279167Y-24206452D02*
X7279167Y-24035024D01*
X7412500Y-24235024D02*
X7393452Y-24225500D01*
X7393452Y-24225500D02*
X7383928Y-24206452D01*
X7383928Y-24206452D02*
X7383928Y-24035024D01*
X7641071Y-24235024D02*
X7641071Y-24035024D01*
X7641071Y-24035024D02*
X7707738Y-24177881D01*
X7707738Y-24177881D02*
X7774405Y-24035024D01*
X7774405Y-24035024D02*
X7774405Y-24235024D01*
X7955357Y-24235024D02*
X7955357Y-24130262D01*
X7955357Y-24130262D02*
X7945833Y-24111214D01*
X7945833Y-24111214D02*
X7926786Y-24101690D01*
X7926786Y-24101690D02*
X7888690Y-24101690D01*
X7888690Y-24101690D02*
X7869643Y-24111214D01*
X7955357Y-24225500D02*
X7936309Y-24235024D01*
X7936309Y-24235024D02*
X7888690Y-24235024D01*
X7888690Y-24235024D02*
X7869643Y-24225500D01*
X7869643Y-24225500D02*
X7860119Y-24206452D01*
X7860119Y-24206452D02*
X7860119Y-24187405D01*
X7860119Y-24187405D02*
X7869643Y-24168357D01*
X7869643Y-24168357D02*
X7888690Y-24158833D01*
X7888690Y-24158833D02*
X7936309Y-24158833D01*
X7936309Y-24158833D02*
X7955357Y-24149309D01*
X8050595Y-24101690D02*
X8050595Y-24301690D01*
X8050595Y-24111214D02*
X8069643Y-24101690D01*
X8069643Y-24101690D02*
X8107738Y-24101690D01*
X8107738Y-24101690D02*
X8126786Y-24111214D01*
X8126786Y-24111214D02*
X8136309Y-24120738D01*
X8136309Y-24120738D02*
X8145833Y-24139786D01*
X8145833Y-24139786D02*
X8145833Y-24196928D01*
X8145833Y-24196928D02*
X8136309Y-24215976D01*
X8136309Y-24215976D02*
X8126786Y-24225500D01*
X8126786Y-24225500D02*
X8107738Y-24235024D01*
X8107738Y-24235024D02*
X8069643Y-24235024D01*
X8069643Y-24235024D02*
X8050595Y-24225500D01*
X8231548Y-24215976D02*
X8241071Y-24225500D01*
X8241071Y-24225500D02*
X8231548Y-24235024D01*
X8231548Y-24235024D02*
X8222024Y-24225500D01*
X8222024Y-24225500D02*
X8231548Y-24215976D01*
X8231548Y-24215976D02*
X8231548Y-24235024D01*
X8231548Y-24111214D02*
X8241071Y-24120738D01*
X8241071Y-24120738D02*
X8231548Y-24130262D01*
X8231548Y-24130262D02*
X8222024Y-24120738D01*
X8222024Y-24120738D02*
X8231548Y-24111214D01*
X8231548Y-24111214D02*
X8231548Y-24130262D01*
M02*
