{
    "@context": {
    	"gax-trust-framework": "http://w3id.org/gaia-x/gax-trust-framework#",
    	"xsd": "http://www.w3.org/2001/XMLSchema#",
    	"vcard": "http://www.w3.org/2006/vcard/ns#"
    },
    "@id": "gax-trust-framework:Participant1",
    "@type": "gax-trust-framework:LegalPerson",
    "gax-trust-framework:legalName": "Provider Name",
    "gax-trust-framework:registrationNumber": {
        "@type": "gax-trust-framework:RegistrationNumber",
        "gax-trust-framework:local": "EC 12345",
        "gax-trust-framework:euid": "EC12345",
        "gax-trust-framework:eori": "EC12345",
        "gax-trust-framework:vatID": "12345",
        "gax-trust-framework:leiCode": "12345"
    },
    "gax-trust-framework:headquarterAddress": {
    	"@type": "vcard:Address",
        "vcard:street-address": "Street Name",
        "vcard:number": 1,
        "vcard:postal-code": "1234",
        "vcard:locality": "Town Name",
    	"vcard:country-name": "Country"
    },
    "gax-trust-framework:legalAddress": {
    	"@type": "vcard:Address",
        "vcard:street-address": "Street Name",
        "vcard:number": 1,
        "vcard:postal-code": "1234",
        "vcard:locality": "Town Name",
    	"vcard:country-name": "Country"
    },
    "gax-trust-framework:subOrganisation": [
    	{
    		"@id": "http://example.org/Provider1_1"
    	},
    	{
    		"@id": "http://example.org/Provider1_2"
    	}
    ]
}
