{
  "@context": {
    "foaf": "http://xmlns.com/foaf/0.1/",
    "ids": "https://w3id.org/idsa/core/",
    "owl": "http://www.w3.org/2002/07/owl#",
    "rdf": "http://www.w3.org/1999/02/22-rdf-syntax-ns#",
    "rdfs": "http://www.w3.org/2000/01/rdf-schema#",
    "vcard": "http://www.w3.org/2006/vcard/ns#",
    "gax-participant": "http://w3id.org/gaia-x/participant#",
    "gax-core": "http://w3id.org/gaia-x/core#" ,
    "ex": "http://example.org/",
    "xsd": "http://www.w3.org/2001/XMLSchema#"
  },
  "@id": "ex:ACMEProvider",
  "@type": "gax-participant:LegalPerson",
  "gax-participant:LegallyBindingName": "ACME Provider",
  "gax-participant:registrationNumber": "DE123456789",
  "gax-participant:headquarterAddress": {
    "@type": "vcard:Address",
    "vcard:street-address": "ACME Street",
    "vcard:number": 1,
    "vcard:postal-code": "12163",
    "vcard:country-name": "Germany",
    "vcard:locality": "Berlin"
  },
  "gax-participant:legalAddress": {
    "@type": "vcard:Address",
    "vcard:street-address": "ACME Street",
    "vcard:number": 1,
    "vcard:postal-code": "12163",
    "vcard:country-name": "Germany",
    "vcard:locality": "Berlin"
  },
  "gax-participant:termsAndConditions": {
    "@type": "gax-core:TermsAndConditions",
      "gax-core:content": {
        "@value": "https://acme.com/tac",
        "@type": "xsd:anyURI"
      },
     "gax-core:hash": "ba7816bf8f01cfea414140de5dae2223b00361a396177a9cb410ff61f20015ad"
  }
}

