
C:\Pinak\Mygit\mycode\BOT\Weather-Chatbot-Using-Luis-master>heroku logs -n 200
2020-04-19T09:57:25.915925+00:00 app[web.1]: WSGIApplication("%(prog)s [OPTIONS] [APP_MODULE]").run()
2020-04-19T09:57:25.915927+00:00 app[web.1]: File "/app/.heroku/python/lib/python3.6/site-packages/gunicorn/app/base.py", line 228, in run
2020-04-19T09:57:25.916089+00:00 app[web.1]: super().run()
2020-04-19T09:57:25.916092+00:00 app[web.1]: File "/app/.heroku/python/lib/python3.6/site-packages/gunicorn/app/base.py", line 72, in run
2020-04-19T09:57:25.916209+00:00 app[web.1]: Arbiter(self).run()
2020-04-19T09:57:25.916211+00:00 app[web.1]: File "/app/.heroku/python/lib/python3.6/site-packages/gunicorn/arbiter.py", line 229, in run
2020-04-19T09:57:25.916360+00:00 app[web.1]: self.halt(reason=inst.reason, exit_status=inst.exit_status)
2020-04-19T09:57:25.916360+00:00 app[web.1]: File "/app/.heroku/python/lib/python3.6/site-packages/gunicorn/arbiter.py", line 342, in halt
2020-04-19T09:57:25.916619+00:00 app[web.1]: self.stop()
2020-04-19T09:57:25.916622+00:00 app[web.1]: File "/app/.heroku/python/lib/python3.6/site-packages/gunicorn/arbiter.py", line 393, in stop
2020-04-19T09:57:25.916819+00:00 app[web.1]: time.sleep(0.1)
2020-04-19T09:57:25.916820+00:00 app[web.1]: File "/app/.heroku/python/lib/python3.6/site-packages/gunicorn/arbiter.py", line 242, in handle_chld
2020-04-19T09:57:25.916974+00:00 app[web.1]: self.reap_workers()
2020-04-19T09:57:25.916976+00:00 app[web.1]: File "/app/.heroku/python/lib/python3.6/site-packages/gunicorn/arbiter.py", line 528, in reap_workers
2020-04-19T09:57:25.917215+00:00 app[web.1]: raise HaltServer(reason, self.APP_LOAD_ERROR)
2020-04-19T09:57:25.917216+00:00 app[web.1]: gunicorn.errors.HaltServer: <HaltServer 'App failed to load.' 4>
2020-04-19T09:57:26.016220+00:00 heroku[web.1]: State changed from up to crashed
2020-04-19T10:09:18.461739+00:00 heroku[web.1]: State changed from crashed to starting
2020-04-19T10:09:32.240290+00:00 app[web.1]: [2020-04-19 10:09:32 +0000] [4] [INFO] Starting gunicorn 20.0.4
2020-04-19T10:09:32.240890+00:00 app[web.1]: [2020-04-19 10:09:32 +0000] [4] [INFO] Listening at: http://0.0.0.0:42481 (4)
2020-04-19T10:09:32.240996+00:00 app[web.1]: [2020-04-19 10:09:32 +0000] [4] [INFO] Using worker: sync
2020-04-19T10:09:32.245711+00:00 app[web.1]: [2020-04-19 10:09:32 +0000] [10] [INFO] Booting worker with pid: 10
2020-04-19T10:09:32.267402+00:00 app[web.1]: [2020-04-19 10:09:32 +0000] [11] [INFO] Booting worker with pid: 11
2020-04-19T10:09:32.774463+00:00 app[web.1]: Failed to parse 'app.py' as an attribute name or function call.
2020-04-19T10:09:32.775154+00:00 app[web.1]: [2020-04-19 10:09:32 +0000] [10] [INFO] Worker exiting (pid: 10)
2020-04-19T10:09:32.797017+00:00 app[web.1]: Failed to parse 'app.py' as an attribute name or function call.
2020-04-19T10:09:32.797797+00:00 app[web.1]: [2020-04-19 10:09:32 +0000] [11] [INFO] Worker exiting (pid: 11)
2020-04-19T10:09:32.951891+00:00 app[web.1]: [2020-04-19 10:09:32 +0000] [4] [INFO] Shutting down: Master
2020-04-19T10:09:32.951982+00:00 app[web.1]: [2020-04-19 10:09:32 +0000] [4] [INFO] Reason: App failed to load.
2020-04-19T10:09:33.036109+00:00 heroku[web.1]: State changed from starting to crashed
2020-04-19T10:24:42.964778+00:00 heroku[router]: at=error code=H10 desc="App crashed" method=OPTIONS path="/api/messages" host=pinakweatherbot.herokuapp.com request_id=455bff98-c6bf-42ad-8ead-bae84a0729f5 fwd="86.149.227.59" dyno= connect= service= status=503 bytes= protocol=https
2020-04-19T10:24:46.588234+00:00 heroku[router]: at=error code=H10 desc="App crashed" method=OPTIONS path="/api/messages" host=pinakweatherbot.herokuapp.com request_id=d813c8cf-15c5-4998-8808-49fea6b8797c fwd="86.149.227.59" dyno= connect= service= status=503 bytes= protocol=https
2020-04-19T10:24:54.568289+00:00 heroku[router]: at=error code=H10 desc="App crashed" method=OPTIONS path="/api/messages" host=pinakweatherbot.herokuapp.com request_id=4e61952a-f937-4c19-a228-a24259fef950 fwd="86.149.227.59" dyno= connect= service= status=503 bytes= protocol=https
2020-04-19T10:24:56.999273+00:00 heroku[router]: at=error code=H10 desc="App crashed" method=POST path="/api/messages" host=pinakweatherbot.herokuapp.com request_id=6ed45b32-f93a-48cc-9784-57d27cbd9911 fwd="51.140.46.219" dyno= connect= service= status=503 bytes= protocol=https
2020-04-19T10:25:04.503452+00:00 heroku[router]: at=error code=H10 desc="App crashed" method=POST path="/api/messages" host=pinakweatherbot.herokuapp.com request_id=a34e615b-c34c-4217-ae7a-0c2e2877e900 fwd="51.140.38.122" dyno= connect= service= status=503 bytes= protocol=https
2020-04-19T10:25:17.672297+00:00 heroku[router]: at=error code=H10 desc="App crashed" method=OPTIONS path="/api/messages" host=pinakweatherbot.herokuapp.com request_id=a5c25bd4-48e9-4fc3-837e-330a7fa046da fwd="86.149.227.59" dyno= connect= service= status=503 bytes= protocol=https
2020-04-19T10:26:03.816950+00:00 heroku[router]: at=error code=H10 desc="App crashed" method=GET path="/api/messages" host=pinakweatherbot.herokuapp.com request_id=88e89687-4012-4e75-9a07-f485a1d4cdda fwd="86.149.227.59" dyno= connect= service= status=503 bytes= protocol=https
2020-04-19T10:26:04.208507+00:00 heroku[router]: at=error code=H10 desc="App crashed" method=GET path="/favicon.ico" host=pinakweatherbot.herokuapp.com request_id=176edd3d-3cc5-4ed3-b4a2-d672d12adb4c fwd="86.149.227.59" dyno= connect= service= status=503 bytes= protocol=https
2020-04-19T10:28:46.000000+00:00 app[api]: Build started by user pinak.gt21@gmail.com
2020-04-19T10:30:45.996490+00:00 app[api]: Deploy 3f7e7627 by user pinak.gt21@gmail.com
2020-04-19T10:30:45.996490+00:00 app[api]: Release v4 created by user pinak.gt21@gmail.com
2020-04-19T10:30:47.694254+00:00 heroku[web.1]: State changed from crashed to starting
2020-04-19T10:30:59.207847+00:00 heroku[web.1]: State changed from starting to crashed
2020-04-19T10:30:59.211602+00:00 heroku[web.1]: State changed from crashed to starting
2020-04-19T10:30:59.145380+00:00 app[web.1]: python: can't open file 'app:app.py': [Errno 2] No such file or directory
2020-04-19T10:31:11.000000+00:00 app[api]: Build succeeded
2020-04-19T10:31:13.633201+00:00 heroku[web.1]: State changed from starting to crashed
2020-04-19T10:31:13.549393+00:00 app[web.1]: python: can't open file 'app:app.py': [Errno 2] No such file or directory
2020-04-19T10:31:15.004709+00:00 heroku[router]: at=error code=H10 desc="App crashed" method=POST path="/api/messages" host=pinakweatherbot.herokuapp.com request_id=02716993-3506-44df-b099-926692d2005f fwd="86.149.227.59" dyno= connect= service= status=503 bytes= protocol=https
2020-04-19T10:31:33.142831+00:00 heroku[router]: at=error code=H10 desc="App crashed" method=POST path="/api/messages" host=pinakweatherbot.herokuapp.com request_id=4a627b7e-005c-47f4-af9a-ddd1d0f1b93e fwd="86.149.227.59" dyno= connect= service= status=503 bytes= protocol=https
2020-04-19T10:31:54.585311+00:00 heroku[router]: at=error code=H10 desc="App crashed" method=OPTIONS path="/api/messages" host=pinakweatherbot.herokuapp.com request_id=ce6c5465-8cd4-4608-8e1b-9edf13798bf1 fwd="86.149.227.59" dyno= connect= service= status=503 bytes= protocol=https
2020-04-19T10:31:56.188703+00:00 heroku[router]: at=error code=H10 desc="App crashed" method=POST path="/api/messages" host=pinakweatherbot.herokuapp.com request_id=19ef12f2-ad30-47b4-9312-1bfd5bb00de3 fwd="51.140.103.179" dyno= connect= service= status=503 bytes= protocol=https
2020-04-19T10:32:08.812263+00:00 heroku[router]: at=error code=H10 desc="App crashed" method=POST path="/api/messages" host=pinakweatherbot.herokuapp.com request_id=d7bd8569-77f0-46fe-8e82-7870c687aab4 fwd="51.140.103.179" dyno= connect= service= status=503 bytes= protocol=https
2020-04-19T10:33:51.000000+00:00 app[api]: Build started by user pinak.gt21@gmail.com
2020-04-19T10:34:39.660023+00:00 heroku[web.1]: State changed from crashed to starting
2020-04-19T10:34:39.325893+00:00 app[api]: Deploy d909f765 by user pinak.gt21@gmail.com
2020-04-19T10:34:39.325893+00:00 app[api]: Release v5 created by user pinak.gt21@gmail.com
2020-04-19T10:34:52.083890+00:00 app[web.1]: * Serving Flask app "app" (lazy loading)
2020-04-19T10:34:52.083915+00:00 app[web.1]: * Environment: production
2020-04-19T10:34:52.083969+00:00 app[web.1]: WARNING: This is a development server. Do not use it in a production deployment.
2020-04-19T10:34:52.084004+00:00 app[web.1]: Use a production WSGI server instead.
2020-04-19T10:34:52.084033+00:00 app[web.1]: * Debug mode: off
2020-04-19T10:34:52.085097+00:00 app[web.1]: * Running on http://127.0.0.1:5000/ (Press CTRL+C to quit)
2020-04-19T10:35:03.000000+00:00 app[api]: Build succeeded
2020-04-19T10:35:49.514833+00:00 heroku[web.1]: State changed from starting to crashed
2020-04-19T10:35:50.989730+00:00 heroku[router]: at=error code=H10 desc="App crashed" method=POST path="/api/messages" host=pinakweatherbot.herokuapp.com request_id=b37e81bd-ed7a-48fc-8e77-44036437423f fwd="86.149.227.59" dyno= connect= service= status=503 bytes= protocol=https
2020-04-19T10:36:04.495969+00:00 heroku[router]: at=error code=H10 desc="App crashed" method=POST path="/api/messages" host=pinakweatherbot.herokuapp.com request_id=e24a2995-fb15-4b64-bf40-78a89578829e fwd="86.149.227.59" dyno= connect= service= status=503 bytes= protocol=https
2020-04-19T10:36:18.804938+00:00 heroku[router]: at=error code=H10 desc="App crashed" method=OPTIONS path="/api/messages" host=pinakweatherbot.herokuapp.com request_id=b182cf15-02d1-47ad-b957-2dfc5ef986bb fwd="86.149.227.59" dyno= connect= service= status=503 bytes= protocol=https
2020-04-19T10:36:18.952497+00:00 heroku[router]: at=error code=H10 desc="App crashed" method=OPTIONS path="/api/messages" host=pinakweatherbot.herokuapp.com request_id=1d9b52f8-4567-4ff5-bf2a-45c74d6ca5d5 fwd="86.149.227.59" dyno= connect= service= status=503 bytes= protocol=https
2020-04-19T10:36:20.352299+00:00 heroku[router]: at=error code=H10 desc="App crashed" method=POST path="/api/messages" host=pinakweatherbot.herokuapp.com request_id=1750b407-a537-47db-9375-f578e8826390 fwd="51.140.103.179" dyno= connect= service= status=503 bytes= protocol=https
2020-04-19T10:36:28.847789+00:00 heroku[router]: at=error code=H10 desc="App crashed" method=POST path="/api/messages" host=pinakweatherbot.herokuapp.com request_id=48dddbd6-55a9-4d83-8d16-b3226b1da59b fwd="51.140.103.179" dyno= connect= service= status=503 bytes= protocol=https
2020-04-19T10:44:24.154436+00:00 heroku[web.1]: State changed from crashed to starting
2020-04-19T10:44:35.856049+00:00 app[web.1]: * Serving Flask app "app" (lazy loading)
2020-04-19T10:44:35.856069+00:00 app[web.1]: * Environment: production
2020-04-19T10:44:35.856120+00:00 app[web.1]: WARNING: This is a development server. Do not use it in a production deployment.
2020-04-19T10:44:35.856160+00:00 app[web.1]: Use a production WSGI server instead.
2020-04-19T10:44:35.856195+00:00 app[web.1]: * Debug mode: off
2020-04-19T10:44:35.857284+00:00 app[web.1]: * Running on http://127.0.0.1:5000/ (Press CTRL+C to quit)
2020-04-19T10:45:33.039632+00:00 heroku[web.1]: State changed from starting to crashed
2020-04-19T10:49:12.383638+00:00 heroku[web.1]: State changed from crashed to starting
2020-04-19T10:49:26.499891+00:00 app[web.1]: * Serving Flask app "app" (lazy loading)
2020-04-19T10:49:26.499913+00:00 app[web.1]: * Environment: production
2020-04-19T10:49:26.499981+00:00 app[web.1]: WARNING: This is a development server. Do not use it in a production deployment.
2020-04-19T10:49:26.500038+00:00 app[web.1]: Use a production WSGI server instead.
2020-04-19T10:49:26.500131+00:00 app[web.1]: * Debug mode: off
2020-04-19T10:49:26.501267+00:00 app[web.1]: * Running on http://127.0.0.1:5000/ (Press CTRL+C to quit)
2020-04-19T10:50:23.395811+00:00 heroku[web.1]: State changed from starting to crashed
2020-04-19T10:50:24.843563+00:00 heroku[router]: at=error code=H10 desc="App crashed" method=POST path="/api/messages" host=pinakweatherbot.herokuapp.com request_id=5c567de3-9510-4102-99e9-c22352943386 fwd="51.140.38.122" dyno= connect= service= status=503 bytes= protocol=https
2020-04-19T10:50:25.856133+00:00 heroku[router]: at=error code=H10 desc="App crashed" method=OPTIONS path="/api/messages" host=pinakweatherbot.herokuapp.com request_id=3350ab1c-40a0-4b78-bf2b-8e2237a638cf fwd="86.149.227.59" dyno= connect= service= status=503 bytes= protocol=https
2020-04-19T10:50:25.864777+00:00 heroku[router]: at=error code=H10 desc="App crashed" method=OPTIONS path="/api/messages" host=pinakweatherbot.herokuapp.com request_id=42872c4b-38db-43b3-9293-a5ae3aa5afaa fwd="86.149.227.59" dyno= connect= service= status=503 bytes= protocol=https
2020-04-19T10:50:26.620909+00:00 heroku[router]: at=error code=H10 desc="App crashed" method=POST path="/api/messages" host=pinakweatherbot.herokuapp.com request_id=12d67245-ac2d-402b-9b10-0fc47c3b0138 fwd="51.140.103.179" dyno= connect= service= status=503 bytes= protocol=https
2020-04-19T10:56:26.869602+00:00 heroku[web.1]: State changed from crashed to starting
2020-04-19T10:56:46.459114+00:00 app[web.1]: * Serving Flask app "app" (lazy loading)
2020-04-19T10:56:46.459160+00:00 app[web.1]: * Environment: production
2020-04-19T10:56:46.459246+00:00 app[web.1]: WARNING: This is a development server. Do not use it in a production deployment.
2020-04-19T10:56:46.459290+00:00 app[web.1]: Use a production WSGI server instead.
2020-04-19T10:56:46.459348+00:00 app[web.1]: * Debug mode: off
2020-04-19T10:56:46.460805+00:00 app[web.1]: * Running on http://127.0.0.1:5000/ (Press CTRL+C to quit)
2020-04-19T10:57:41.830437+00:00 heroku[web.1]: State changed from starting to crashed
2020-04-19T10:59:44.000000+00:00 app[api]: Build started by user pinak.gt21@gmail.com
2020-04-19T11:00:35.167500+00:00 heroku[web.1]: State changed from crashed to starting
2020-04-19T11:00:34.789156+00:00 app[api]: Deploy 27a2e5c5 by user pinak.gt21@gmail.com
2020-04-19T11:00:34.789156+00:00 app[api]: Release v6 created by user pinak.gt21@gmail.com
2020-04-19T11:00:49.824073+00:00 app[web.1]: [2020-04-19 11:00:49 +0000] [4] [INFO] Starting gunicorn 20.0.4
2020-04-19T11:00:49.824930+00:00 app[web.1]: [2020-04-19 11:00:49 +0000] [4] [INFO] Listening at: http://0.0.0.0:15296 (4)
2020-04-19T11:00:49.825056+00:00 app[web.1]: [2020-04-19 11:00:49 +0000] [4] [INFO] Using worker: sync
2020-04-19T11:00:49.831189+00:00 app[web.1]: [2020-04-19 11:00:49 +0000] [10] [INFO] Booting worker with pid: 10
2020-04-19T11:00:49.833684+00:00 app[web.1]: [2020-04-19 11:00:49 +0000] [11] [INFO] Booting worker with pid: 11
2020-04-19T11:00:50.405584+00:00 heroku[web.1]: State changed from starting to up
2020-04-19T11:00:59.000000+00:00 app[api]: Build succeeded
2020-04-19T11:01:19.483546+00:00 heroku[web.1]: Restarting
2020-04-19T11:01:19.497768+00:00 heroku[web.1]: State changed from up to starting
2020-04-19T11:01:20.542482+00:00 app[web.1]: [2020-04-19 11:01:20 +0000] [10] [INFO] Worker exiting (pid: 10)
2020-04-19T11:01:20.542530+00:00 app[web.1]: [2020-04-19 11:01:20 +0000] [4] [INFO] Handling signal: term
2020-04-19T11:01:20.542809+00:00 app[web.1]: [2020-04-19 11:01:20 +0000] [11] [INFO] Worker exiting (pid: 11)
2020-04-19T11:01:20.643085+00:00 app[web.1]: [2020-04-19 11:01:20 +0000] [4] [INFO] Shutting down: Master
2020-04-19T11:01:33.446358+00:00 heroku[web.1]: State changed from starting to up
2020-04-19T11:01:33.397054+00:00 app[web.1]: [2020-04-19 11:01:33 +0000] [4] [INFO] Starting gunicorn 20.0.4
2020-04-19T11:01:33.398433+00:00 app[web.1]: [2020-04-19 11:01:33 +0000] [4] [INFO] Listening at: http://0.0.0.0:53280 (4)
2020-04-19T11:01:33.398628+00:00 app[web.1]: [2020-04-19 11:01:33 +0000] [4] [INFO] Using worker: sync
2020-04-19T11:01:33.407810+00:00 app[web.1]: [2020-04-19 11:01:33 +0000] [10] [INFO] Booting worker with pid: 10
2020-04-19T11:01:33.497863+00:00 app[web.1]: [2020-04-19 11:01:33 +0000] [11] [INFO] Booting worker with pid: 11
2020-04-19T11:01:34.847086+00:00 heroku[router]: at=info method=OPTIONS path="/api/messages" host=pinakweatherbot.herokuapp.com request_id=d30c4b43-5fd2-4d2e-9556-ede53c7cb71b fwd="86.149.227.59" dyno=web.1 connect=1ms service=939ms status=200 bytes=181 protocol=https
2020-04-19T11:01:34.845292+00:00 heroku[router]: at=info method=OPTIONS path="/api/messages" host=pinakweatherbot.herokuapp.com request_id=3ce49211-6dd2-4602-843d-b4b8e81937cc fwd="86.149.227.59" dyno=web.1 connect=0ms service=1008ms status=200 bytes=181 protocol=https
2020-04-19T11:01:34.844963+00:00 app[web.1]: 10.41.198.134 - - [19/Apr/2020:11:01:34 +0000] "OPTIONS /api/messages HTTP/1.1" 200 0 "-" "Mozilla/5.0 (Windows NT 6.3; Win64; x64) AppleWebKit/537.36 (KHTML, like Gecko) Chrome/80.0.3987.163 Safari/537.36"
2020-04-19T11:01:34.846271+00:00 app[web.1]: 10.35.254.221 - - [19/Apr/2020:11:01:34 +0000] "OPTIONS /api/messages HTTP/1.1" 200 0 "-" "Mozilla/5.0 (Windows NT 6.3; Win64; x64) AppleWebKit/537.36 (KHTML, like Gecko) Chrome/80.0.3987.163 Safari/537.36"
2020-04-19T11:01:35.479367+00:00 heroku[router]: at=info method=POST path="/api/messages" host=pinakweatherbot.herokuapp.com request_id=54f922d1-7eb3-4d93-b4e2-e11ce15ac24c fwd="51.140.103.179" dyno=web.1 connect=2ms service=347ms status=500 bytes=455 protocol=https
2020-04-19T11:01:35.476709+00:00 app[web.1]: [2020-04-19 11:01:35,474] ERROR in app: Exception on /api/messages [POST]
2020-04-19T11:01:35.476727+00:00 app[web.1]: Traceback (most recent call last):
2020-04-19T11:01:35.476728+00:00 app[web.1]: File "/app/.heroku/python/lib/python3.6/site-packages/flask/app.py", line 2446, in wsgi_app
2020-04-19T11:01:35.476728+00:00 app[web.1]: response = self.full_dispatch_request()
2020-04-19T11:01:35.476729+00:00 app[web.1]: File "/app/.heroku/python/lib/python3.6/site-packages/flask/app.py", line 1951, in full_dispatch_request
2020-04-19T11:01:35.476729+00:00 app[web.1]: rv = self.handle_user_exception(e)
2020-04-19T11:01:35.476730+00:00 app[web.1]: File "/app/.heroku/python/lib/python3.6/site-packages/flask/app.py", line 1820, in handle_user_exception
2020-04-19T11:01:35.476730+00:00 app[web.1]: reraise(exc_type, exc_value, tb)
2020-04-19T11:01:35.476730+00:00 app[web.1]: File "/app/.heroku/python/lib/python3.6/site-packages/flask/_compat.py", line 39, in reraise
2020-04-19T11:01:35.476731+00:00 app[web.1]: raise value
2020-04-19T11:01:35.476732+00:00 app[web.1]: File "/app/.heroku/python/lib/python3.6/site-packages/flask/app.py", line 1949, in full_dispatch_request
2020-04-19T11:01:35.476732+00:00 app[web.1]: rv = self.dispatch_request()
2020-04-19T11:01:35.476733+00:00 app[web.1]: File "/app/.heroku/python/lib/python3.6/site-packages/flask/app.py", line 1935, in dispatch_request
2020-04-19T11:01:35.476733+00:00 app[web.1]: return self.view_functions[rule.endpoint](**req.view_args)
2020-04-19T11:01:35.476734+00:00 app[web.1]: File "/app/app.py", line 35, in messages
2020-04-19T11:01:35.476734+00:00 app[web.1]: loop.run_until_complete(task)
2020-04-19T11:01:35.476734+00:00 app[web.1]: File "/app/.heroku/python/lib/python3.6/asyncio/base_events.py", line 488, in run_until_complete
2020-04-19T11:01:35.476735+00:00 app[web.1]: return future.result()
2020-04-19T11:01:35.476738+00:00 app[web.1]: File "/app/.heroku/python/lib/python3.6/site-packages/botbuilder/core/bot_framework_adapter.py", line 433, in process_activity
2020-04-19T11:01:35.476739+00:00 app[web.1]: identity = await self._authenticate_request(activity, auth_header)
2020-04-19T11:01:35.476739+00:00 app[web.1]: File "/app/.heroku/python/lib/python3.6/site-packages/botbuilder/core/bot_framework_adapter.py", line 516, in _authenticate_request
2020-04-19T11:01:35.476740+00:00 app[web.1]: self.settings.auth_configuration,
2020-04-19T11:01:35.476740+00:00 app[web.1]: File "/app/.heroku/python/lib/python3.6/site-packages/botframework/connector/auth/jwt_token_validation.py", line 60, in authenticate_request
2020-04-19T11:01:35.476740+00:00 app[web.1]: auth_configuration,
2020-04-19T11:01:35.476741+00:00 app[web.1]: File "/app/.heroku/python/lib/python3.6/site-packages/botframework/connector/auth/jwt_token_validation.py", line 155, in validate_auth_header
2020-04-19T11:01:35.476741+00:00 app[web.1]: claims = await get_claims()
2020-04-19T11:01:35.476742+00:00 app[web.1]: File "/app/.heroku/python/lib/python3.6/site-packages/botframework/connector/auth/jwt_token_validation.py", line 115, in get_claims
2020-04-19T11:01:35.476742+00:00 app[web.1]: auth_configuration,
2020-04-19T11:01:35.476744+00:00 app[web.1]: File "/app/.heroku/python/lib/python3.6/site-packages/botframework/connector/auth/channel_validation.py", line 52, in authenticate_channel_token_with_service_url
2020-04-19T11:01:35.476744+00:00 app[web.1]: auth_header, credentials, channel_id, auth_configuration
2020-04-19T11:01:35.476764+00:00 app[web.1]: File "/app/.heroku/python/lib/python3.6/site-packages/botframework/connector/auth/channel_validation.py", line 101, in authenticate_channel_token
2020-04-19T11:01:35.476765+00:00 app[web.1]: return await ChannelValidation.validate_identity(identity, credentials)
2020-04-19T11:01:35.476766+00:00 app[web.1]: File "/app/.heroku/python/lib/python3.6/site-packages/botframework/connector/auth/channel_validation.py", line 137, in validate_identity
2020-04-19T11:01:35.476766+00:00 app[web.1]: "Unauthorized. Invalid AppId passed on token: ", aud_claim
2020-04-19T11:01:35.476774+00:00 app[web.1]: PermissionError: [Errno Unauthorized. Invalid AppId passed on token: ] ce2b34e7-0d39-4714-abd0-29be8cd01fba
2020-04-19T11:01:35.477702+00:00 app[web.1]: 10.11.168.79 - - [19/Apr/2020:11:01:35 +0000] "POST /api/messages HTTP/1.1" 500 290 "-" "BF-DirectLine (Microsoft-BotFramework/3.2 +https://botframework.com/ua)"
2020-04-19T11:01:45.217076+00:00 heroku[router]: at=info method=POST path="/api/messages" host=pinakweatherbot.herokuapp.com request_id=41334d44-3d18-4447-a00f-5376353e2228 fwd="51.140.46.219" dyno=web.1 connect=1ms service=180ms status=500 bytes=455 protocol=https
2020-04-19T11:01:45.213865+00:00 app[web.1]: [2020-04-19 11:01:45,211] ERROR in app: Exception on /api/messages [POST]
2020-04-19T11:01:45.213878+00:00 app[web.1]: Traceback (most recent call last):
2020-04-19T11:01:45.213880+00:00 app[web.1]: File "/app/.heroku/python/lib/python3.6/site-packages/flask/app.py", line 2446, in wsgi_app
2020-04-19T11:01:45.213880+00:00 app[web.1]: response = self.full_dispatch_request()
2020-04-19T11:01:45.213882+00:00 app[web.1]: File "/app/.heroku/python/lib/python3.6/site-packages/flask/app.py", line 1951, in full_dispatch_request
2020-04-19T11:01:45.213882+00:00 app[web.1]: rv = self.handle_user_exception(e)
2020-04-19T11:01:45.213883+00:00 app[web.1]: File "/app/.heroku/python/lib/python3.6/site-packages/flask/app.py", line 1820, in handle_user_exception
2020-04-19T11:01:45.213883+00:00 app[web.1]: reraise(exc_type, exc_value, tb)
2020-04-19T11:01:45.213883+00:00 app[web.1]: File "/app/.heroku/python/lib/python3.6/site-packages/flask/_compat.py", line 39, in reraise
2020-04-19T11:01:45.213885+00:00 app[web.1]: raise value
2020-04-19T11:01:45.213886+00:00 app[web.1]: File "/app/.heroku/python/lib/python3.6/site-packages/flask/app.py", line 1949, in full_dispatch_request
2020-04-19T11:01:45.213886+00:00 app[web.1]: rv = self.dispatch_request()
2020-04-19T11:01:45.213887+00:00 app[web.1]: File "/app/.heroku/python/lib/python3.6/site-packages/flask/app.py", line 1935, in dispatch_request
2020-04-19T11:01:45.213888+00:00 app[web.1]: return self.view_functions[rule.endpoint](**req.view_args)
2020-04-19T11:01:45.213888+00:00 app[web.1]: File "/app/app.py", line 35, in messages
2020-04-19T11:01:45.213889+00:00 app[web.1]: loop.run_until_complete(task)
2020-04-19T11:01:45.213889+00:00 app[web.1]: File "/app/.heroku/python/lib/python3.6/asyncio/base_events.py", line 488, in run_until_complete
2020-04-19T11:01:45.213890+00:00 app[web.1]: return future.result()
2020-04-19T11:01:45.213892+00:00 app[web.1]: File "/app/.heroku/python/lib/python3.6/site-packages/botbuilder/core/bot_framework_adapter.py", line 433, in process_activity
2020-04-19T11:01:45.213892+00:00 app[web.1]: identity = await self._authenticate_request(activity, auth_header)
2020-04-19T11:01:45.213892+00:00 app[web.1]: File "/app/.heroku/python/lib/python3.6/site-packages/botbuilder/core/bot_framework_adapter.py", line 516, in _authenticate_request
2020-04-19T11:01:45.213893+00:00 app[web.1]: self.settings.auth_configuration,
2020-04-19T11:01:45.213893+00:00 app[web.1]: File "/app/.heroku/python/lib/python3.6/site-packages/botframework/connector/auth/jwt_token_validation.py", line 60, in authenticate_request
2020-04-19T11:01:45.213894+00:00 app[web.1]: auth_configuration,
2020-04-19T11:01:45.213894+00:00 app[web.1]: File "/app/.heroku/python/lib/python3.6/site-packages/botframework/connector/auth/jwt_token_validation.py", line 155, in validate_auth_header
2020-04-19T11:01:45.213895+00:00 app[web.1]: claims = await get_claims()
2020-04-19T11:01:45.213895+00:00 app[web.1]: File "/app/.heroku/python/lib/python3.6/site-packages/botframework/connector/auth/jwt_token_validation.py", line 115, in get_claims
2020-04-19T11:01:45.213896+00:00 app[web.1]: auth_configuration,
2020-04-19T11:01:45.213897+00:00 app[web.1]: File "/app/.heroku/python/lib/python3.6/site-packages/botframework/connector/auth/channel_validation.py", line 52, in authenticate_channel_token_with_service_url
2020-04-19T11:01:45.213897+00:00 app[web.1]: auth_header, credentials, channel_id, auth_configuration
2020-04-19T11:01:45.213899+00:00 app[web.1]: File "/app/.heroku/python/lib/python3.6/site-packages/botframework/connector/auth/channel_validation.py", line 101, in authenticate_channel_token
2020-04-19T11:01:45.213899+00:00 app[web.1]: return await ChannelValidation.validate_identity(identity, credentials)
2020-04-19T11:01:45.213899+00:00 app[web.1]: File "/app/.heroku/python/lib/python3.6/site-packages/botframework/connector/auth/channel_validation.py", line 137, in validate_identity
2020-04-19T11:01:45.213900+00:00 app[web.1]: "Unauthorized. Invalid AppId passed on token: ", aud_claim
2020-04-19T11:01:45.213905+00:00 app[web.1]: PermissionError: [Errno Unauthorized. Invalid AppId passed on token: ] ce2b34e7-0d39-4714-abd0-29be8cd01fba
2020-04-19T11:01:45.214847+00:00 app[web.1]: 10.28.44.109 - - [19/Apr/2020:11:01:45 +0000] "POST /api/messages HTTP/1.1" 500 290 "-" "BF-DirectLine (Microsoft-BotFramework/3.2 +https://botframework.com/ua)"

C:\Pinak\Mygit\mycode\BOT\Weather-Chatbot-Using-Luis-master>heroku logs -n 10
2020-04-19T11:05:48.801413+00:00 app[web.1]: File "/app/.heroku/python/lib/python3.6/concurrent/futures/thread.py", line 56, in run
2020-04-19T11:05:48.801414+00:00 app[web.1]: result = self.fn(*self.args, **self.kwargs)
2020-04-19T11:05:48.801414+00:00 app[web.1]: File "/app/.heroku/python/lib/python3.6/site-packages/requests/sessions.py", line 533, in request
2020-04-19T11:05:48.801415+00:00 app[web.1]: resp = self.send(prep, **send_kwargs)
2020-04-19T11:05:48.801415+00:00 app[web.1]: File "/app/.heroku/python/lib/python3.6/site-packages/requests/sessions.py", line 646, in send
2020-04-19T11:05:48.801416+00:00 app[web.1]: r = adapter.send(request, **kwargs)
2020-04-19T11:05:48.801416+00:00 app[web.1]: File "/app/.heroku/python/lib/python3.6/site-packages/requests/adapters.py", line 516, in send
2020-04-19T11:05:48.801417+00:00 app[web.1]: raise ConnectionError(e, request=request)
2020-04-19T11:05:48.801422+00:00 app[web.1]: msrest.exceptions.ClientRequestError: Error occurred in request., ConnectionError: HTTPConnectionPool(host='localhost', port=55340): Max retries exceeded with url: /v3/conversations/b09f23a0-822d-11ea-b5db-15f7a14bb516%7Clivechat/activities/b62a5bf0-822d-
11ea-b5db-15f7a14bb516 (Caused by NewConnectionError('<urllib3.connection.HTTPConnection object at 0x7ff201914b70>: Failed to establish a new connection: [Errno 111] Connection refused',))
2020-04-19T11:05:48.803258+00:00 app[web.1]: 10.9.216.41 - - [19/Apr/2020:11:05:48 +0000] "POST /api/messages HTTP/1.1" 500 290 "-" "node-fetch/1.0 (+https://github.com/bitinn/node-fetch)"

C:\Pinak\Mygit\mycode\BOT\Weather-Chatbot-Using-Luis-master>heroku logs -n 20
2020-04-19T11:05:48.801409+00:00 app[web.1]: File "/app/.heroku/python/lib/python3.6/site-packages/msrest/pipeline/async_requests.py", line 85, in send
2020-04-19T11:05:48.801409+00:00 app[web.1]: await self.driver.send(request.http_request, **kwargs)
2020-04-19T11:05:48.801410+00:00 app[web.1]: File "/app/.heroku/python/lib/python3.6/site-packages/msrest/universal_http/async_requests.py", line 91, in send
2020-04-19T11:05:48.801410+00:00 app[web.1]: return await super(AsyncRequestsHTTPSender, self).send(request, **requests_kwargs)
2020-04-19T11:05:48.801411+00:00 app[web.1]: File "/app/.heroku/python/lib/python3.6/site-packages/msrest/universal_http/async_requests.py", line 83, in send
2020-04-19T11:05:48.801411+00:00 app[web.1]: raise_with_traceback(ClientRequestError, msg, err)
2020-04-19T11:05:48.801412+00:00 app[web.1]: File "/app/.heroku/python/lib/python3.6/site-packages/msrest/exceptions.py", line 51, in raise_with_traceback
2020-04-19T11:05:48.801412+00:00 app[web.1]: raise error.with_traceback(exc_traceback)
2020-04-19T11:05:48.801413+00:00 app[web.1]: File "/app/.heroku/python/lib/python3.6/site-packages/msrest/universal_http/async_requests.py", line 79, in send
2020-04-19T11:05:48.801413+00:00 app[web.1]: await future
2020-04-19T11:05:48.801413+00:00 app[web.1]: File "/app/.heroku/python/lib/python3.6/concurrent/futures/thread.py", line 56, in run
2020-04-19T11:05:48.801414+00:00 app[web.1]: result = self.fn(*self.args, **self.kwargs)
2020-04-19T11:05:48.801414+00:00 app[web.1]: File "/app/.heroku/python/lib/python3.6/site-packages/requests/sessions.py", line 533, in request
2020-04-19T11:05:48.801415+00:00 app[web.1]: resp = self.send(prep, **send_kwargs)
2020-04-19T11:05:48.801415+00:00 app[web.1]: File "/app/.heroku/python/lib/python3.6/site-packages/requests/sessions.py", line 646, in send
2020-04-19T11:05:48.801416+00:00 app[web.1]: r = adapter.send(request, **kwargs)
2020-04-19T11:05:48.801416+00:00 app[web.1]: File "/app/.heroku/python/lib/python3.6/site-packages/requests/adapters.py", line 516, in send
2020-04-19T11:05:48.801417+00:00 app[web.1]: raise ConnectionError(e, request=request)
2020-04-19T11:05:48.801422+00:00 app[web.1]: msrest.exceptions.ClientRequestError: Error occurred in request., ConnectionError: HTTPConnectionPool(host='localhost', port=55340): Max retries exceeded with url: /v3/conversations/b09f23a0-822d-11ea-b5db-15f7a14bb516%7Clivechat/activities/b62a5bf0-822d-
11ea-b5db-15f7a14bb516 (Caused by NewConnectionError('<urllib3.connection.HTTPConnection object at 0x7ff201914b70>: Failed to establish a new connection: [Errno 111] Connection refused',))
2020-04-19T11:05:48.803258+00:00 app[web.1]: 10.9.216.41 - - [19/Apr/2020:11:05:48 +0000] "POST /api/messages HTTP/1.1" 500 290 "-" "node-fetch/1.0 (+https://github.com/bitinn/node-fetch)"

C:\Pinak\Mygit\mycode\BOT\Weather-Chatbot-Using-Luis-master>heroku logs -n 10
2020-04-19T11:11:08.125905+00:00 app[web.1]: File "/app/.heroku/python/lib/python3.6/site-packages/botframework/connector/auth/jwt_token_validation.py", line 115, in get_claims
2020-04-19T11:11:08.125906+00:00 app[web.1]: auth_configuration,
2020-04-19T11:11:08.125906+00:00 app[web.1]: File "/app/.heroku/python/lib/python3.6/site-packages/botframework/connector/auth/channel_validation.py", line 52, in authenticate_channel_token_with_service_url
2020-04-19T11:11:08.125907+00:00 app[web.1]: auth_header, credentials, channel_id, auth_configuration
2020-04-19T11:11:08.125907+00:00 app[web.1]: File "/app/.heroku/python/lib/python3.6/site-packages/botframework/connector/auth/channel_validation.py", line 101, in authenticate_channel_token
2020-04-19T11:11:08.125908+00:00 app[web.1]: return await ChannelValidation.validate_identity(identity, credentials)
2020-04-19T11:11:08.125908+00:00 app[web.1]: File "/app/.heroku/python/lib/python3.6/site-packages/botframework/connector/auth/channel_validation.py", line 137, in validate_identity
2020-04-19T11:11:08.125908+00:00 app[web.1]: "Unauthorized. Invalid AppId passed on token: ", aud_claim
2020-04-19T11:11:08.125915+00:00 app[web.1]: PermissionError: [Errno Unauthorized. Invalid AppId passed on token: ] ce2b34e7-0d39-4714-abd0-29be8cd01fba
2020-04-19T11:11:08.126934+00:00 app[web.1]: 10.186.202.203 - - [19/Apr/2020:11:11:08 +0000] "POST /api/messages HTTP/1.1" 500 290 "-" "BF-DirectLine (Microsoft-BotFramework/3.2 +https://botframework.com/ua)"

C:\Pinak\Mygit\mycode\BOT\Weather-Chatbot-Using-Luis-master>heroku logs -n 10
2020-04-19T11:16:44.622834+00:00 app[web.1]: File "/app/.heroku/python/lib/python3.6/site-packages/botframework/connector/auth/jwt_token_validation.py", line 115, in get_claims
2020-04-19T11:16:44.622835+00:00 app[web.1]: auth_configuration,
2020-04-19T11:16:44.622850+00:00 app[web.1]: File "/app/.heroku/python/lib/python3.6/site-packages/botframework/connector/auth/channel_validation.py", line 52, in authenticate_channel_token_with_service_url
2020-04-19T11:16:44.622851+00:00 app[web.1]: auth_header, credentials, channel_id, auth_configuration
2020-04-19T11:16:44.622855+00:00 app[web.1]: File "/app/.heroku/python/lib/python3.6/site-packages/botframework/connector/auth/channel_validation.py", line 101, in authenticate_channel_token
2020-04-19T11:16:44.622856+00:00 app[web.1]: return await ChannelValidation.validate_identity(identity, credentials)
2020-04-19T11:16:44.622856+00:00 app[web.1]: File "/app/.heroku/python/lib/python3.6/site-packages/botframework/connector/auth/channel_validation.py", line 137, in validate_identity
2020-04-19T11:16:44.622857+00:00 app[web.1]: "Unauthorized. Invalid AppId passed on token: ", aud_claim
2020-04-19T11:16:44.622863+00:00 app[web.1]: PermissionError: [Errno Unauthorized. Invalid AppId passed on token: ] ce2b34e7-0d39-4714-abd0-29be8cd01fba
2020-04-19T11:16:44.623589+00:00 app[web.1]: 10.37.207.144 - - [19/Apr/2020:11:16:44 +0000] "POST /api/messages HTTP/1.1" 500 290 "-" "BF-DirectLine (Microsoft-BotFramework/3.2 +https://botframework.com/ua)"

C:\Pinak\Mygit\mycode\BOT\Weather-Chatbot-Using-Luis-master>curl -n https://api.heroku.com/enterprise-accounts/$ENTERPRISE_ACCOUNT_ID/members
{"id":"missing_version","error":"Please specify a version along with Heroku's API MIME type. For example, `Accept: application/vnd.heroku+json; version=3`.\n"}
C:\Pinak\Mygit\mycode\BOT\Weather-Chatbot-Using-Luis-master>heroku config:set MICROSOFT_APP_ID=ce2b34e7-0d39-4714-abd0-29be8cd01fba
Setting MICROSOFT_APP_ID and restarting ? pinakweatherbot... done, v7
MICROSOFT_APP_ID: ce2b34e7-0d39-4714-abd0-29be8cd01fba

C:\Pinak\Mygit\mycode\BOT\Weather-Chatbot-Using-Luis-master>heroku logs -n 10
2020-04-19T11:27:40.715656+00:00 app[web.1]: File "/app/.heroku/python/lib/python3.6/site-packages/botframework/connector/auth/jwt_token_validation.py", line 115, in get_claims
2020-04-19T11:27:40.715656+00:00 app[web.1]: auth_configuration,
2020-04-19T11:27:40.715657+00:00 app[web.1]: File "/app/.heroku/python/lib/python3.6/site-packages/botframework/connector/auth/channel_validation.py", line 52, in authenticate_channel_token_with_service_url
2020-04-19T11:27:40.715658+00:00 app[web.1]: auth_header, credentials, channel_id, auth_configuration
2020-04-19T11:27:40.715659+00:00 app[web.1]: File "/app/.heroku/python/lib/python3.6/site-packages/botframework/connector/auth/channel_validation.py", line 101, in authenticate_channel_token
2020-04-19T11:27:40.715659+00:00 app[web.1]: return await ChannelValidation.validate_identity(identity, credentials)
2020-04-19T11:27:40.715660+00:00 app[web.1]: File "/app/.heroku/python/lib/python3.6/site-packages/botframework/connector/auth/channel_validation.py", line 137, in validate_identity
2020-04-19T11:27:40.715661+00:00 app[web.1]: "Unauthorized. Invalid AppId passed on token: ", aud_claim
2020-04-19T11:27:40.715667+00:00 app[web.1]: PermissionError: [Errno Unauthorized. Invalid AppId passed on token: ] ce2b34e7-0d39-4714-abd0-29be8cd01fba
2020-04-19T11:27:40.716618+00:00 app[web.1]: 10.30.214.223 - - [19/Apr/2020:11:27:40 +0000] "POST /api/messages HTTP/1.1" 500 290 "-" "BF-DirectLine (Microsoft-BotFramework/3.2 +https://botframework.com/ua)"

C:\Pinak\Mygit\mycode\BOT\Weather-Chatbot-Using-Luis-master>heroku config:set MICROSOFT_APP_ID=ce2b34e7-0d39-4714-abd0-29be8cd01fba MICROSOFT_APP_PASSWORD=?oQ:QJq@PBCSh2rzh55c4q]:baa@@1Y1
Setting MICROSOFT_APP_ID, MICROSOFT_APP_PASSWORD and restarting ? pinakweatherbot... done, v8
MICROSOFT_APP_ID:       ce2b34e7-0d39-4714-abd0-29be8cd01fba
MICROSOFT_APP_PASSWORD: ?oQ:QJq@PBCSh2rzh55c4q]:baa@@1Y1

C:\Pinak\Mygit\mycode\BOT\Weather-Chatbot-Using-Luis-master>heroku logs -n 10
2020-04-19T11:37:06.130951+00:00 app[web.1]: auth_configuration,
2020-04-19T11:37:06.130952+00:00 app[web.1]: File "/app/.heroku/python/lib/python3.6/site-packages/botframework/connector/auth/channel_validation.py", line 52, in authenticate_channel_token_with_service_url
2020-04-19T11:37:06.130953+00:00 app[web.1]: auth_header, credentials, channel_id, auth_configuration
2020-04-19T11:37:06.130953+00:00 app[web.1]: File "/app/.heroku/python/lib/python3.6/site-packages/botframework/connector/auth/channel_validation.py", line 101, in authenticate_channel_token
2020-04-19T11:37:06.130954+00:00 app[web.1]: return await ChannelValidation.validate_identity(identity, credentials)
2020-04-19T11:37:06.130954+00:00 app[web.1]: File "/app/.heroku/python/lib/python3.6/site-packages/botframework/connector/auth/channel_validation.py", line 137, in validate_identity
2020-04-19T11:37:06.130955+00:00 app[web.1]: "Unauthorized. Invalid AppId passed on token: ", aud_claim
2020-04-19T11:37:06.130963+00:00 app[web.1]: PermissionError: [Errno Unauthorized. Invalid AppId passed on token: ] ce2b34e7-0d39-4714-abd0-29be8cd01fba
2020-04-19T11:37:06.131681+00:00 app[web.1]: 10.5.239.252 - - [19/Apr/2020:11:37:06 +0000] "POST /api/messages HTTP/1.1" 500 290 "-" "BF-DirectLine (Microsoft-BotFramework/3.2 +https://botframework.com/ua)"
2020-04-19T11:37:06.132568+00:00 heroku[router]: at=info method=POST path="/api/messages" host=pinakweatherbot.herokuapp.com request_id=60c0d676-9c0d-44b3-9d59-2a156c67f3c0 fwd="51.140.103.179" dyno=web.1 connect=0ms service=107ms status=500 bytes=455 protocol=https

C:\Pinak\Mygit\mycode\BOT\Weather-Chatbot-Using-Luis-master>heroku logs -n 20
2020-04-19T11:37:06.130948+00:00 app[web.1]: identity = await self._authenticate_request(activity, auth_header)
2020-04-19T11:37:06.130948+00:00 app[web.1]: File "/app/.heroku/python/lib/python3.6/site-packages/botbuilder/core/bot_framework_adapter.py", line 516, in _authenticate_request
2020-04-19T11:37:06.130948+00:00 app[web.1]: self.settings.auth_configuration,
2020-04-19T11:37:06.130949+00:00 app[web.1]: File "/app/.heroku/python/lib/python3.6/site-packages/botframework/connector/auth/jwt_token_validation.py", line 60, in authenticate_request
2020-04-19T11:37:06.130949+00:00 app[web.1]: auth_configuration,
2020-04-19T11:37:06.130950+00:00 app[web.1]: File "/app/.heroku/python/lib/python3.6/site-packages/botframework/connector/auth/jwt_token_validation.py", line 155, in validate_auth_header
2020-04-19T11:37:06.130950+00:00 app[web.1]: claims = await get_claims()
2020-04-19T11:37:06.130951+00:00 app[web.1]: File "/app/.heroku/python/lib/python3.6/site-packages/botframework/connector/auth/jwt_token_validation.py", line 115, in get_claims
2020-04-19T11:37:06.130951+00:00 app[web.1]: auth_configuration,
2020-04-19T11:37:06.130952+00:00 app[web.1]: File "/app/.heroku/python/lib/python3.6/site-packages/botframework/connector/auth/channel_validation.py", line 52, in authenticate_channel_token_with_service_url
2020-04-19T11:37:06.130953+00:00 app[web.1]: auth_header, credentials, channel_id, auth_configuration
2020-04-19T11:37:06.130953+00:00 app[web.1]: File "/app/.heroku/python/lib/python3.6/site-packages/botframework/connector/auth/channel_validation.py", line 101, in authenticate_channel_token
2020-04-19T11:37:06.130954+00:00 app[web.1]: return await ChannelValidation.validate_identity(identity, credentials)
2020-04-19T11:37:06.130954+00:00 app[web.1]: File "/app/.heroku/python/lib/python3.6/site-packages/botframework/connector/auth/channel_validation.py", line 137, in validate_identity
2020-04-19T11:37:06.130955+00:00 app[web.1]: "Unauthorized. Invalid AppId passed on token: ", aud_claim
2020-04-19T11:37:06.130963+00:00 app[web.1]: PermissionError: [Errno Unauthorized. Invalid AppId passed on token: ] ce2b34e7-0d39-4714-abd0-29be8cd01fba
2020-04-19T11:37:06.131681+00:00 app[web.1]: 10.5.239.252 - - [19/Apr/2020:11:37:06 +0000] "POST /api/messages HTTP/1.1" 500 290 "-" "BF-DirectLine (Microsoft-BotFramework/3.2 +https://botframework.com/ua)"
2020-04-19T11:37:06.132568+00:00 heroku[router]: at=info method=POST path="/api/messages" host=pinakweatherbot.herokuapp.com request_id=60c0d676-9c0d-44b3-9d59-2a156c67f3c0 fwd="51.140.103.179" dyno=web.1 connect=0ms service=107ms status=500 bytes=455 protocol=https
2020-04-19T11:37:29.835121+00:00 heroku[router]: at=info method=OPTIONS path="/api/messages" host=pinakweatherbot.herokuapp.com request_id=f5b9e2ff-9f39-47ee-9e7a-a120011afce3 fwd="86.149.227.59" dyno=web.1 connect=1ms service=3ms status=200 bytes=181 protocol=https
2020-04-19T11:37:29.834867+00:00 app[web.1]: 10.33.187.161 - - [19/Apr/2020:11:37:29 +0000] "OPTIONS /api/messages HTTP/1.1" 200 0 "-" "Mozilla/5.0 (Windows NT 6.3; Win64; x64) AppleWebKit/537.36 (KHTML, like Gecko) Chrome/80.0.3987.163 Safari/537.36"

C:\Pinak\Mygit\mycode\BOT\Weather-Chatbot-Using-Luis-master>heroku restart
Restarting dynos on ? pinakweatherbot... done

C:\Pinak\Mygit\mycode\BOT\Weather-Chatbot-Using-Luis-master>heroku logs -n 20
2020-04-19T11:41:51.438792+00:00 app[web.1]: File "/app/.heroku/python/lib/python3.6/asyncio/base_events.py", line 488, in run_until_complete
2020-04-19T11:41:51.438793+00:00 app[web.1]: return future.result()
2020-04-19T11:41:51.438800+00:00 app[web.1]: File "/app/.heroku/python/lib/python3.6/site-packages/botbuilder/core/bot_framework_adapter.py", line 433, in process_activity
2020-04-19T11:41:51.438801+00:00 app[web.1]: identity = await self._authenticate_request(activity, auth_header)
2020-04-19T11:41:51.438801+00:00 app[web.1]: File "/app/.heroku/python/lib/python3.6/site-packages/botbuilder/core/bot_framework_adapter.py", line 516, in _authenticate_request
2020-04-19T11:41:51.438801+00:00 app[web.1]: self.settings.auth_configuration,
2020-04-19T11:41:51.438802+00:00 app[web.1]: File "/app/.heroku/python/lib/python3.6/site-packages/botframework/connector/auth/jwt_token_validation.py", line 60, in authenticate_request
2020-04-19T11:41:51.438802+00:00 app[web.1]: auth_configuration,
2020-04-19T11:41:51.438802+00:00 app[web.1]: File "/app/.heroku/python/lib/python3.6/site-packages/botframework/connector/auth/jwt_token_validation.py", line 155, in validate_auth_header
2020-04-19T11:41:51.438802+00:00 app[web.1]: claims = await get_claims()
2020-04-19T11:41:51.438802+00:00 app[web.1]: File "/app/.heroku/python/lib/python3.6/site-packages/botframework/connector/auth/jwt_token_validation.py", line 115, in get_claims
2020-04-19T11:41:51.438803+00:00 app[web.1]: auth_configuration,
2020-04-19T11:41:51.438805+00:00 app[web.1]: File "/app/.heroku/python/lib/python3.6/site-packages/botframework/connector/auth/channel_validation.py", line 52, in authenticate_channel_token_with_service_url
2020-04-19T11:41:51.438805+00:00 app[web.1]: auth_header, credentials, channel_id, auth_configuration
2020-04-19T11:41:51.438808+00:00 app[web.1]: File "/app/.heroku/python/lib/python3.6/site-packages/botframework/connector/auth/channel_validation.py", line 101, in authenticate_channel_token
2020-04-19T11:41:51.438808+00:00 app[web.1]: return await ChannelValidation.validate_identity(identity, credentials)
2020-04-19T11:41:51.438808+00:00 app[web.1]: File "/app/.heroku/python/lib/python3.6/site-packages/botframework/connector/auth/channel_validation.py", line 137, in validate_identity
2020-04-19T11:41:51.438808+00:00 app[web.1]: "Unauthorized. Invalid AppId passed on token: ", aud_claim
2020-04-19T11:41:51.438813+00:00 app[web.1]: PermissionError: [Errno Unauthorized. Invalid AppId passed on token: ] ce2b34e7-0d39-4714-abd0-29be8cd01fba
2020-04-19T11:41:51.439558+00:00 app[web.1]: 10.148.121.8 - - [19/Apr/2020:11:41:51 +0000] "POST /api/messages HTTP/1.1" 500 290 "-" "BF-DirectLine (Microsoft-BotFramework/3.2 +https://botframework.com/ua)"

C:\Pinak\Mygit\mycode\BOT\Weather-Chatbot-Using-Luis-master>