[
  {
    "id": "weekly-sweepstake",
    "description": "Weekly sweepstake",
    "prize": "200€ Gift card",
    "pointsNeeded": 100,
    "periodicity": "weekly",
    "amount": 1
  },
  {
    "id": "monthly-sweepstake-1",
    "description": "Monthly sweepstake",
    "prize": "iPhone 13",
    "pointsNeeded": 900,
    "periodicity": "monthly",
    "amount": 1
  },
  {
    "id": "big-sweepstake",
    "description": "Big sweepstake",
    "prize": "2500€ Amazon Gift Card",
    "pointsNeeded": 2000,
    "periodicity": "one-time",
    "amount": 1,
    "nextExecution": 1662627600000
  }
]