[
  { "id": "IAB1", "label": "IAB1 - Arts & Entertainment" },
  { "id": "IAB2", "label": "IAB2 - Automotive" },
  { "id": "IAB3", "label": "IAB3 - Business" },
  { "id": "IAB4", "label": "IAB4 - Careers" },
  { "id": "IAB5", "label": "IAB5 - Education" },
  { "id": "IAB6", "label": "IAB6 - Family & Parenting" },
  { "id": "IAB7", "label": "IAB7 - Health & Fitness" },
  { "id": "IAB8", "label": "IAB8 - Food & Drink" },
  { "id": "IAB9", "label": "IAB9 - Hobbies & Interests" },
  { "id": "IAB10", "label": "IAB10 - Home & Garden" },
  { "id": "IAB11", "label": "IAB11 - Law, Gov't & Politics" },
  { "id": "IAB12", "label": "IAB12 - News" },
  { "id": "IAB13", "label": "IAB13 - Personal Finance" },
  { "id": "IAB14", "label": "IAB14 - Society" },
  { "id": "IAB15", "label": "IAB15 - Science" },
  { "id": "IAB16", "label": "IAB16 - Pets" },
  { "id": "IAB17", "label": "IAB17 - Sports" },
  { "id": "IAB18", "label": "IAB18 - Style & Fashion" },
  { "id": "IAB19", "label": "IAB19 - Technology & Computing" },
  { "id": "IAB20", "label": "IAB20 - Travel" },
  { "id": "IAB21", "label": "IAB21 - Real Estate" },
  { "id": "IAB22", "label": "IAB22 - Shopping" },
  { "id": "IAB23", "label": "IAB23 - Religion & Spirituality" },
  { "id": "IAB24", "label": "IAB24 - Uncategorized" },
  { "id": "IAB25", "label": "IAB25 - Non-Standard Content" },
  { "id": "IAB26", "label": "IAB26 - Illegal Content" }
]