[
  { "id": "accounting", "label": "Accounting" },
  { "id": "airlines-aviation", "label": "Airlines Aviation" },
  { "id": "alternative-dispute-resolution", "label": "Alternative Dispute Resolution" },
  { "id": "alternative-medicine", "label": "Alternative Medicine" },
  { "id": "animation", "label": "Animation" },
  { "id": "apparel-fashion", "label": "Apparel Fashion" },
  { "id": "architecture-planning", "label": "Architecture Planning" },
  { "id": "arts-crafts", "label": "Arts Crafts" },
  { "id": "automotive", "label": "Automotive" },
  { "id": "aviation-aerospace", "label": "Aviation Aerospace" },
  { "id": "banking-mortgage", "label": "Banking Mortgage" },
  { "id": "biotechnology-greentech", "label": "Biotechnology Greentech" },
  { "id": "broadcast-media", "label": "Broadcast Media" },
  { "id": "building-materials", "label": "Building Materials" },
  { "id": "business-supplies-equipment", "label": "Business Supplies Equipment" },
  { "id": "capital-markets-hedge-fund-private-equity", "label": "Capital Markets Hedge Fund Private Equity" },
  { "id": "chemicals", "label": "Chemicals" },
  { "id": "civic-social-organization", "label": "Civic Social Organization" },
  { "id": "civil-engineering", "label": "Civil Engineering" },
  { "id": "commercial-real-estate", "label": "Commercial Real Estate" },
  { "id": "computer-games", "label": "Computer Games" },
  { "id": "computer-hardware", "label": "Computer Hardware" },
  { "id": "computer-networking", "label": "Computer Networking" },
  { "id": "computer-software-engineering", "label": "Computer Software Engineering" },
  { "id": "computer-network-security", "label": "Computer Network Security" },
  { "id": "construction", "label": "Construction" },
  { "id": "consumer-electronics", "label": "Consumer Electronics" },
  { "id": "consumer-goods", "label": "Consumer Goods" },
  { "id": "consumer-services", "label": "Consumer Services" },
  { "id": "cosmetics", "label": "Cosmetics" },
  { "id": "dairy", "label": "Dairy" },
  { "id": "defense-space", "label": "Defense Space" },
  { "id": "design", "label": "Design" },
  { "id": "e-learning", "label": "E Learning" },
  { "id": "education-management", "label": "Education Management" },
  { "id": "electrical-electronic-manufacturing", "label": "Electrical Electronic Manufacturing" },
  { "id": "entertainment-movie-production", "label": "Entertainment Movie Production" },
  { "id": "environmental-services", "label": "Environmental Services" },
  { "id": "events-services", "label": "Events Services" },
  { "id": "executive-office", "label": "Executive Office" },
  { "id": "facilities-services", "label": "Facilities Services" },
  { "id": "farming", "label": "Farming" },
  { "id": "financial-services", "label": "Financial Services" },
  { "id": "fine-art", "label": "Fine Art" },
  { "id": "fishery", "label": "Fishery" },
  { "id": "food-production", "label": "Food Production" },
  { "id": "food-beverages", "label": "Food Beverages" },
  { "id": "fundraising", "label": "Fundraising" },
  { "id": "furniture", "label": "Furniture" },
  { "id": "gambling-casinos", "label": "Gambling Casinos" },
  { "id": "glass-ceramics-concrete", "label": "Glass Ceramics Concrete" },
  { "id": "government-administration", "label": "Government Administration" },
  { "id": "government-relations", "label": "Government Relations" },
  { "id": "graphic-design-web-design", "label": "Graphic Design Web Design" },
  { "id": "health-fitness", "label": "Health Fitness" },
  { "id": "higher-education-acadamia", "label": "Higher Education Acadamia" },
  { "id": "hospital-health-care", "label": "Hospital Health Care" },
  { "id": "hospitality", "label": "Hospitality" },
  { "id": "human-resources-hr", "label": "Human Resources Hr" },
  { "id": "import-export", "label": "Import Export" },
  { "id": "individual-family-services", "label": "Individual Family Services" },
  { "id": "industrial-automation", "label": "Industrial Automation" },
  { "id": "information-services", "label": "Information Services" },
  { "id": "information-technology-it", "label": "Information Technology It" },
  { "id": "insurance", "label": "Insurance" },
  { "id": "international-affairs", "label": "International Affairs" },
  { "id": "international-trade-development", "label": "International Trade Development" },
  { "id": "internet", "label": "Internet" },
  { "id": "investment-banking-venture", "label": "Investment Banking Venture" },
  { "id": "investment-management-hedge-fund-private-equity", "label": "Investment Management Hedge Fund Private Equity" },
  { "id": "judiciary", "label": "Judiciary" },
  { "id": "law-enforcement", "label": "Law Enforcement" },
  { "id": "law-practice-law-firms", "label": "Law Practice Law Firms" },
  { "id": "legal-services", "label": "Legal Services" },
  { "id": "legislative-office", "label": "Legislative Office" },
  { "id": "leisure-travel", "label": "Leisure Travel" },
  { "id": "library", "label": "Library" },
  { "id": "logistics-procurement", "label": "Logistics Procurement" },
  { "id": "luxury-goods-jewelry", "label": "Luxury Goods Jewelry" },
  { "id": "machinery", "label": "Machinery" },
  { "id": "management-consulting", "label": "Management Consulting" },
  { "id": "maritime", "label": "Maritime" },
  { "id": "market-research", "label": "Market Research" },
  { "id": "marketing-advertising-sales", "label": "Marketing Advertising Sales" },
  { "id": "mechanical-or-industrial-engineering", "label": "Mechanical Or Industrial Engineering" },
  { "id": "media-production", "label": "Media Production" },
  { "id": "medical-equipment", "label": "Medical Equipment" },
  { "id": "medical-practice", "label": "Medical Practice" },
  { "id": "mental-health-care", "label": "Mental Health Care" },
  { "id": "military-industry", "label": "Military Industry" },
  { "id": "mining-metals", "label": "Mining Metals" },
  { "id": "motion-pictures-film", "label": "Motion Pictures Film" },
  { "id": "museums-institutions", "label": "Museums Institutions" },
  { "id": "music", "label": "Music" },
  { "id": "nanotechnology", "label": "Nanotechnology" },
  { "id": "newspapers-journalism", "label": "Newspapers Journalism" },
  { "id": "non-profit-volunteering", "label": "Non Profit Volunteering" },
  { "id": "oil-energy-solar-greentech", "label": "Oil Energy Solar Greentech" },
  { "id": "online-publishing", "label": "Online Publishing" },
  { "id": "other-industry", "label": "Other Industry" },
  { "id": "outsourcing-offshoring", "label": "Outsourcing Offshoring" },
  { "id": "package-freight-delivery", "label": "Package Freight Delivery" },
  { "id": "packaging-containers", "label": "Packaging Containers" },
  { "id": "paper-forest-products", "label": "Paper Forest Products" },
  { "id": "performing-arts", "label": "Performing Arts" },
  { "id": "pharmaceuticals", "label": "Pharmaceuticals" },
  { "id": "philanthropy", "label": "Philanthropy" },
  { "id": "photography", "label": "Photography" },
  { "id": "plastics", "label": "Plastics" },
  { "id": "political-organization", "label": "Political Organization" },
  { "id": "primary-secondary-education", "label": "Primary Secondary Education" },
  { "id": "printing", "label": "Printing" },
  { "id": "professional-training", "label": "Professional Training" },
  { "id": "program-development", "label": "Program Development" },
  { "id": "public-relations-pr", "label": "Public Relations Pr" },
  { "id": "public-safety", "label": "Public Safety" },
  { "id": "publishing-industry", "label": "Publishing Industry" },
  { "id": "railroad-manufacture", "label": "Railroad Manufacture" },
  { "id": "ranching", "label": "Ranching" },
  { "id": "real-estate-mortgage", "label": "Real Estate Mortgage" },
  { "id": "recreational-facilities-services", "label": "Recreational Facilities Services" },
  { "id": "religious-institutions", "label": "Religious Institutions" },
  { "id": "renewables-environment", "label": "Renewables Environment" },
  { "id": "research-industry", "label": "Research Industry" },
  { "id": "restaurants", "label": "Restaurants" },
  { "id": "retail-industry", "label": "Retail Industry" },
  { "id": "security-investigations", "label": "Security Investigations" },
  { "id": "semiconductors", "label": "Semiconductors" },
  { "id": "shipbuilding", "label": "Shipbuilding" },
  { "id": "sporting-goods", "label": "Sporting Goods" },
  { "id": "sports", "label": "Sports" },
  { "id": "staffing-recruiting", "label": "Staffing Recruiting" },
  { "id": "supermarkets", "label": "Supermarkets" },
  { "id": "telecommunications", "label": "Telecommunications" },
  { "id": "textiles", "label": "Textiles" },
  { "id": "think-tanks", "label": "Think Tanks" },
  { "id": "tobacco", "label": "Tobacco" },
  { "id": "translation-localization", "label": "Translation Localization" },
  { "id": "transportation", "label": "Transportation" },
  { "id": "utilities", "label": "Utilities" },
  { "id": "venture-capital-vc", "label": "Venture Capital Vc" },
  { "id": "veterinary", "label": "Veterinary" },
  { "id": "warehousing", "label": "Warehousing" },
  { "id": "wholesale", "label": "Wholesale" },
  { "id": "wine-spirits", "label": "Wine Spirits" },
  { "id": "wireless", "label": "Wireless" },
  { "id": "writing-editing", "label": "Writing Editing" } 
]