time,user,item
1,tony,beer
2,mark,pizza
3,mark,kebab
4,tony,beer
5,nik,beer
6,nik,pizza
7,tony,kebab
8,mark,pizza
9,nik,kebab
10,tony,pizza
11,nik,beer
12,tony,pizza
13,tony,pizza
14,mark,beer
15,mark,kebab
16,tony,kebab
17,tony,beer
18,mark,kebab
19,nik,beer
20,tony,kebab