{
  "name":"directories",
  "keys":["name","parent_dir","owner_id","created_on"],
  "pk":"dir_id",
  "pk_prefix":"prod-dir-",
  "fk":[
    {
      "local_key":"parent_dir",
      "collection":"Directories",
      "key":"dir_id"
    },
    {
      "local_key":"owner_id",
      "collection":"Users",
      "key":"user_id"
    }
  ]
}
