(footprint "SOT-353_SC-70-5_Handsoldering" (version 20221018) (generator pcbnew)
  (layer "F.Cu")
  (descr "SOT-353, SC-70-5, Handsoldering")
  (tags "SOT-353 SC-70-5 Handsoldering")
  (attr smd)
  (fp_text reference "REF**" (at 0 -2) (layer "F.SilkS")
      (effects (font (size 1 1) (thickness 0.15)))
    (tstamp 0f90565a-181f-4357-9f17-ed0de11f5d73)
  )
  (fp_text value "SOT-353_SC-70-5_Handsoldering" (at 0 2 180) (layer "F.Fab")
      (effects (font (size 1 1) (thickness 0.15)))
    (tstamp 0b289689-ec5b-415f-8897-6b6ebfce7968)
  )
  (fp_text user "${REFERENCE}" (at 0 0 90) (layer "F.Fab")
      (effects (font (size 0.5 0.5) (thickness 0.075)))
    (tstamp dcfeef94-6074-442a-b0ce-921b80450cfd)
  )
  (fp_line (start -0.7 1.16) (end 0.7 1.16)
    (stroke (width 0.12) (type solid)) (layer "F.SilkS") (tstamp 858f4046-3a4c-451f-8492-c380a0eb9a3b))
  (fp_line (start 0.7 -1.16) (end -1.2 -1.16)
    (stroke (width 0.12) (type solid)) (layer "F.SilkS") (tstamp f76c6a56-9afd-486f-b7d2-b3ce08d6d78c))
  (fp_line (start -2.4 -1.4) (end -2.4 1.4)
    (stroke (width 0.05) (type solid)) (layer "F.CrtYd") (tstamp 29feabd1-50b9-48ee-bd4d-e01eb8b128fa))
  (fp_line (start -2.4 -1.4) (end 2.4 -1.4)
    (stroke (width 0.05) (type solid)) (layer "F.CrtYd") (tstamp e373bdfa-5138-4ff0-8d74-e40200e75a01))
  (fp_line (start -2.4 1.4) (end 2.4 1.4)
    (stroke (width 0.05) (type solid)) (layer "F.CrtYd") (tstamp abb5f194-8af5-48b4-bb46-1e871aa68563))
  (fp_line (start 2.4 1.4) (end 2.4 -1.4)
    (stroke (width 0.05) (type solid)) (layer "F.CrtYd") (tstamp 49c955f6-3686-4005-a7d5-fa811eda9f45))
  (fp_line (start -0.675 -0.6) (end -0.675 1.1)
    (stroke (width 0.1) (type solid)) (layer "F.Fab") (tstamp 213b7f27-709e-4dd7-a9aa-2ad0aeacb768))
  (fp_line (start -0.175 -1.1) (end -0.675 -0.6)
    (stroke (width 0.1) (type solid)) (layer "F.Fab") (tstamp 6b63e094-f27a-4035-b259-ef82e45cf042))
  (fp_line (start 0.675 -1.1) (end -0.175 -1.1)
    (stroke (width 0.1) (type solid)) (layer "F.Fab") (tstamp bffd0372-1228-4ef6-bce8-c14f062d0c6b))
  (fp_line (start 0.675 -1.1) (end 0.675 1.1)
    (stroke (width 0.1) (type solid)) (layer "F.Fab") (tstamp a8fc7557-4dfa-4eed-a7f2-4bb1a4bfc404))
  (fp_line (start 0.675 1.1) (end -0.675 1.1)
    (stroke (width 0.1) (type solid)) (layer "F.Fab") (tstamp ada7344d-d64b-45d0-8600-037c4db5c09f))
  (pad "1" smd rect (at -1.33 -0.65) (size 1.5 0.4) (layers "F.Cu" "F.Paste" "F.Mask") (tstamp faf64020-e2b3-4242-a6d4-29b69d6891b8))
  (pad "2" smd rect (at -1.33 0) (size 1.5 0.4) (layers "F.Cu" "F.Paste" "F.Mask") (tstamp e3f97da7-3c2e-4aa9-8b80-762ee026f3a5))
  (pad "3" smd rect (at -1.33 0.65) (size 1.5 0.4) (layers "F.Cu" "F.Paste" "F.Mask") (tstamp 28d40f6c-f623-4f30-8712-a9800974219a))
  (pad "4" smd rect (at 1.33 0.65) (size 1.5 0.4) (layers "F.Cu" "F.Paste" "F.Mask") (tstamp e84381f8-da38-4860-b5f2-8594313b7616))
  (pad "5" smd rect (at 1.33 -0.65) (size 1.5 0.4) (layers "F.Cu" "F.Paste" "F.Mask") (tstamp 3a94d40a-0379-44af-9996-bf79d54c0aa3))
  (model "${KICAD6_3DMODEL_DIR}/Package_TO_SOT_SMD.3dshapes/SOT-353_SC-70-5.wrl"
    (offset (xyz 0 0 0))
    (scale (xyz 1 1 1))
    (rotate (xyz 0 0 0))
  )
)
