(footprint "Texas_NDW-7_TabPin8" (version 20221018) (generator pcbnew)
  (layer "F.Cu")
  (descr "NDW0007A SMD package, http://www.ti.com/lit/ml/mmsf024/mmsf024.pdf")
  (tags "NDW NDW")
  (attr smd)
  (fp_text reference "REF**" (at 0 -6.33) (layer "F.SilkS")
      (effects (font (size 1 1) (thickness 0.15)))
    (tstamp 3bc22a15-0860-459a-9d50-ee1cb2e50e45)
  )
  (fp_text value "Texas_NDW-7_TabPin8" (at 0 6.33) (layer "F.Fab")
      (effects (font (size 1 1) (thickness 0.15)))
    (tstamp 3879f2c6-31cb-4258-9f1f-4f6dede2e629)
  )
  (fp_text user "${REFERENCE}" (at 0 0) (layer "F.Fab")
      (effects (font (size 1 1) (thickness 0.15)))
    (tstamp c22f9fb9-a8a2-4855-9429-7bc775593b18)
  )
  (fp_line (start -5.125 -5.28) (end -5.125 -4.555)
    (stroke (width 0.12) (type solid)) (layer "F.SilkS") (tstamp a26c762b-99ca-4b09-bae6-7e12b31b8253))
  (fp_line (start -5.125 -4.555) (end -9.19 -4.555)
    (stroke (width 0.12) (type solid)) (layer "F.SilkS") (tstamp 52271767-e334-45c9-946a-ad3b4ac03d38))
  (fp_line (start -5.125 4.555) (end -5.8925 4.555)
    (stroke (width 0.12) (type solid)) (layer "F.SilkS") (tstamp f789c813-bbf7-48a0-802b-a2a8433dc02a))
  (fp_line (start -5.125 5.28) (end -5.125 4.555)
    (stroke (width 0.12) (type solid)) (layer "F.SilkS") (tstamp 39d00b33-30f8-4502-a6d3-fc90f1d8a1c8))
  (fp_line (start 4.925 -5.28) (end -5.125 -5.28)
    (stroke (width 0.12) (type solid)) (layer "F.SilkS") (tstamp 82fe0ad3-712c-453b-a796-1beac531d4bd))
  (fp_line (start 4.925 5.28) (end -5.125 5.28)
    (stroke (width 0.12) (type solid)) (layer "F.SilkS") (tstamp aff4554d-6cd1-44e0-b365-39d012f65091))
  (fp_line (start -9.45 -5.33) (end -9.45 5.33)
    (stroke (width 0.05) (type solid)) (layer "F.CrtYd") (tstamp a5462b65-b679-4498-81c4-0e8dceb164cd))
  (fp_line (start -9.45 5.33) (end 5.18 5.33)
    (stroke (width 0.05) (type solid)) (layer "F.CrtYd") (tstamp 9a0447eb-210a-41e1-8f00-be9f55ead6b8))
  (fp_line (start 5.18 -5.33) (end -9.45 -5.33)
    (stroke (width 0.05) (type solid)) (layer "F.CrtYd") (tstamp d004aab9-1378-426a-bdfd-746ceb3bac6f))
  (fp_line (start 5.18 5.33) (end 5.18 -5.33)
    (stroke (width 0.05) (type solid)) (layer "F.CrtYd") (tstamp b352d025-e439-4deb-91c2-9d547075f6f5))
  (fp_line (start -8.845 -4.155) (end -8.845 -3.465)
    (stroke (width 0.1) (type solid)) (layer "F.Fab") (tstamp 12f2c65d-b5ae-47ab-a00f-45029f79e295))
  (fp_line (start -8.845 -3.465) (end -4.925 -3.465)
    (stroke (width 0.1) (type solid)) (layer "F.Fab") (tstamp ad8095dc-94a8-4953-a95a-8c8c3f0dd234))
  (fp_line (start -8.845 -2.885) (end -8.845 -2.195)
    (stroke (width 0.1) (type solid)) (layer "F.Fab") (tstamp e9d4dd63-62d4-4912-b3c6-6bdec8c09437))
  (fp_line (start -8.845 -2.195) (end -4.925 -2.195)
    (stroke (width 0.1) (type solid)) (layer "F.Fab") (tstamp 9feac9c3-69e9-43d1-8163-4e11d44471dc))
  (fp_line (start -8.845 -1.615) (end -8.845 -0.925)
    (stroke (width 0.1) (type solid)) (layer "F.Fab") (tstamp edb9413e-cf45-4fad-a7cb-f61737e89662))
  (fp_line (start -8.845 -0.925) (end -4.925 -0.925)
    (stroke (width 0.1) (type solid)) (layer "F.Fab") (tstamp 37a4b076-900c-4584-9776-9febf17277bf))
  (fp_line (start -8.845 -0.345) (end -8.845 0.345)
    (stroke (width 0.1) (type solid)) (layer "F.Fab") (tstamp 6158249f-fc3e-4d93-8f97-372c27faf94f))
  (fp_line (start -8.845 0.345) (end -4.925 0.345)
    (stroke (width 0.1) (type solid)) (layer "F.Fab") (tstamp 708087e3-ea42-449c-a9fa-8886030992f0))
  (fp_line (start -8.845 0.925) (end -8.845 1.615)
    (stroke (width 0.1) (type solid)) (layer "F.Fab") (tstamp 221ea1dc-9ed4-43d8-93ed-4afea303cf21))
  (fp_line (start -8.845 1.615) (end -4.925 1.615)
    (stroke (width 0.1) (type solid)) (layer "F.Fab") (tstamp ae902ec8-0228-4cfb-a1c7-50025cec0ebc))
  (fp_line (start -8.845 2.195) (end -8.845 2.885)
    (stroke (width 0.1) (type solid)) (layer "F.Fab") (tstamp 403aaaab-5a3a-447b-a7ae-dc1ac63ccceb))
  (fp_line (start -8.845 2.885) (end -4.925 2.885)
    (stroke (width 0.1) (type solid)) (layer "F.Fab") (tstamp 833e1133-57a0-4993-9eec-b39c396f7fbb))
  (fp_line (start -8.845 3.465) (end -8.845 4.155)
    (stroke (width 0.1) (type solid)) (layer "F.Fab") (tstamp 2c499ad4-f167-47af-9493-3392e03bd05a))
  (fp_line (start -8.845 4.155) (end -4.925 4.155)
    (stroke (width 0.1) (type solid)) (layer "F.Fab") (tstamp c021d4e1-9ec9-464c-801a-7b28d4c51025))
  (fp_line (start -4.925 -4.08) (end -3.925 -5.08)
    (stroke (width 0.1) (type solid)) (layer "F.Fab") (tstamp c255a1f7-3d89-46e7-96e6-bd95ef62b089))
  (fp_line (start -4.925 -2.885) (end -8.845 -2.885)
    (stroke (width 0.1) (type solid)) (layer "F.Fab") (tstamp c9de6a4c-8a75-4bfd-be4f-c5a9fb576b15))
  (fp_line (start -4.925 -1.615) (end -8.845 -1.615)
    (stroke (width 0.1) (type solid)) (layer "F.Fab") (tstamp 7b8fd717-9f4a-4200-9c9a-7b2b62780a0d))
  (fp_line (start -4.925 -0.345) (end -8.845 -0.345)
    (stroke (width 0.1) (type solid)) (layer "F.Fab") (tstamp db4dddd1-6f6a-4fd3-be4c-88c46f5aa584))
  (fp_line (start -4.925 0.925) (end -8.845 0.925)
    (stroke (width 0.1) (type solid)) (layer "F.Fab") (tstamp 726adec4-bae0-4593-b8b7-a7e733e0c055))
  (fp_line (start -4.925 2.195) (end -8.845 2.195)
    (stroke (width 0.1) (type solid)) (layer "F.Fab") (tstamp 2ecb4ce3-7dd7-4cc1-ba95-df5517311057))
  (fp_line (start -4.925 3.465) (end -8.845 3.465)
    (stroke (width 0.1) (type solid)) (layer "F.Fab") (tstamp 4b515ce1-6f7d-4e6d-aa9a-3429785bee8f))
  (fp_line (start -4.925 5.08) (end -4.925 -4.08)
    (stroke (width 0.1) (type solid)) (layer "F.Fab") (tstamp 7afbb94c-d01d-4419-8d0c-ff893e7722e1))
  (fp_line (start -4.85 -4.155) (end -8.845 -4.155)
    (stroke (width 0.1) (type solid)) (layer "F.Fab") (tstamp ab61bb74-021b-4a85-a39f-5b3ef1d0616f))
  (fp_line (start -3.925 -5.08) (end 4.925 -5.08)
    (stroke (width 0.1) (type solid)) (layer "F.Fab") (tstamp b51d160c-0949-42dc-b430-ff416713fa1a))
  (fp_line (start 4.925 -5.08) (end 4.925 5.08)
    (stroke (width 0.1) (type solid)) (layer "F.Fab") (tstamp 1d42a266-914b-4d43-8d76-da807f37c3eb))
  (fp_line (start 4.925 5.08) (end -4.925 5.08)
    (stroke (width 0.1) (type solid)) (layer "F.Fab") (tstamp 7b61908c-e5c1-4e8a-9668-c4d1f4a99130))
  (pad "1" smd roundrect (at -7.66 -3.81) (size 3.06 0.89) (layers "F.Cu" "F.Paste" "F.Mask") (roundrect_rratio 0.25) (tstamp c5fe075b-97d3-4ff3-b7ee-da383a2afaa3))
  (pad "2" smd roundrect (at -7.66 -2.54) (size 3.06 0.89) (layers "F.Cu" "F.Paste" "F.Mask") (roundrect_rratio 0.25) (tstamp d96cfb2d-9cc7-4b36-965a-a6e89c0cef8a))
  (pad "3" smd roundrect (at -7.66 -1.27) (size 3.06 0.89) (layers "F.Cu" "F.Paste" "F.Mask") (roundrect_rratio 0.25) (tstamp 7c9eb408-005d-48e2-a528-7555ba4daffe))
  (pad "4" smd roundrect (at -7.66 0) (size 3.06 0.89) (layers "F.Cu" "F.Paste" "F.Mask") (roundrect_rratio 0.25) (tstamp 1c6b2a38-b0b6-451a-8f72-9284a11b7db5))
  (pad "5" smd roundrect (at -7.66 1.27) (size 3.06 0.89) (layers "F.Cu" "F.Paste" "F.Mask") (roundrect_rratio 0.25) (tstamp e611a72d-45ee-45a2-8162-6e39817c2911))
  (pad "6" smd roundrect (at -7.66 2.54) (size 3.06 0.89) (layers "F.Cu" "F.Paste" "F.Mask") (roundrect_rratio 0.25) (tstamp 7d73c1af-3464-4a90-98b9-7d87089367ab))
  (pad "7" smd roundrect (at -7.66 3.81) (size 3.06 0.89) (layers "F.Cu" "F.Paste" "F.Mask") (roundrect_rratio 0.25) (tstamp 26350d15-d713-4f49-8b31-24b15e2c54c7))
  (pad "8" smd roundrect (at -2.565 -1.4125) (size 4.12 2.525) (layers "F.Cu" "F.Paste") (roundrect_rratio 0.09901) (tstamp 1cc56688-7938-4f5e-b85a-ac7fbf32c352))
  (pad "8" smd roundrect (at -2.565 1.4125) (size 4.12 2.525) (layers "F.Cu" "F.Paste") (roundrect_rratio 0.09901) (tstamp 28f6d105-c6a9-4a26-b8a3-695bb0d45e70))
  (pad "8" smd roundrect (at -0.355 0) (size 8.54 5.35) (layers "F.Cu" "F.Mask") (roundrect_rratio 0.046729) (tstamp 2092e8a5-d2e9-4682-9974-5db176a2ba30))
  (pad "8" smd roundrect (at 1.855 -1.4125) (size 4.12 2.525) (layers "F.Cu" "F.Paste") (roundrect_rratio 0.09901) (tstamp b1736ed2-5ec2-4145-bf8e-766718b7d9b5))
  (pad "8" smd roundrect (at 1.855 1.4125) (size 4.12 2.525) (layers "F.Cu" "F.Paste") (roundrect_rratio 0.09901) (tstamp 94923d3a-8914-449b-919a-4fb6f05ae919))
  (model "${KICAD6_3DMODEL_DIR}/Package_TO_SOT_SMD.3dshapes/Texas_NDW-7_TabPin8.wrl"
    (offset (xyz 0 0 0))
    (scale (xyz 1 1 1))
    (rotate (xyz 0 0 0))
  )
)
