(footprint "WLCSP-6_1.4x1.0mm_P0.4mm" (version 20221018) (generator pcbnew)
  (layer "F.Cu")
  (descr "6pin Pitch 0.4mm")
  (tags "6pin Pitch 0.4mm WLCSP")
  (attr smd)
  (fp_text reference "REF**" (at 0 -1.7) (layer "F.SilkS")
      (effects (font (size 1 1) (thickness 0.15)))
    (tstamp 585e127a-2744-477c-b42f-bc53b870a4f2)
  )
  (fp_text value "WLCSP-6_1.4x1.0mm_P0.4mm" (at 0 1.8) (layer "F.Fab")
      (effects (font (size 1 1) (thickness 0.15)))
    (tstamp a354f091-b50d-4776-bbf7-5816a67dad2e)
  )
  (fp_text user "${REFERENCE}" (at 0 -1.7) (layer "F.Fab")
      (effects (font (size 1 1) (thickness 0.15)))
    (tstamp bc297a38-e18e-4cee-abec-aef27495a992)
  )
  (fp_line (start -0.78 0.58) (end -0.78 -0.26)
    (stroke (width 0.12) (type solid)) (layer "F.SilkS") (tstamp 48568402-ad7e-47a8-8ac9-818724754d85))
  (fp_line (start -0.46 -0.58) (end 0.78 -0.58)
    (stroke (width 0.12) (type solid)) (layer "F.SilkS") (tstamp 25c0c0ac-7954-4364-9332-2f46dfc3b90e))
  (fp_line (start 0.78 -0.58) (end 0.78 0.58)
    (stroke (width 0.12) (type solid)) (layer "F.SilkS") (tstamp 39ef3618-b91b-4574-a6a5-1905a7922962))
  (fp_line (start 0.78 0.58) (end -0.78 0.58)
    (stroke (width 0.12) (type solid)) (layer "F.SilkS") (tstamp 61ca033a-4aa9-49cd-a8f9-6de53e685fc5))
  (fp_poly
    (pts
      (xy -0.78 -0.58)
      (xy -1.28 -0.58)
      (xy -0.78 -1.08)
      (xy -0.78 -0.58)
    )

    (stroke (width 0.12) (type solid)) (fill solid) (layer "F.SilkS") (tstamp d35a0a5c-e743-4be3-ab0c-f026ee4b3367))
  (fp_line (start -0.95 -0.75) (end 0.95 -0.75)
    (stroke (width 0.05) (type solid)) (layer "F.CrtYd") (tstamp d7856790-d5cd-4bef-83a5-109f966ed17f))
  (fp_line (start -0.95 0.75) (end -0.95 -0.75)
    (stroke (width 0.05) (type solid)) (layer "F.CrtYd") (tstamp 0cca7be8-2fee-4dbb-b520-bc078a9d518d))
  (fp_line (start 0.95 -0.75) (end 0.95 0.75)
    (stroke (width 0.05) (type solid)) (layer "F.CrtYd") (tstamp b957eff6-ef20-4493-829c-531b659c572b))
  (fp_line (start 0.95 0.75) (end -0.95 0.75)
    (stroke (width 0.05) (type solid)) (layer "F.CrtYd") (tstamp ce3346eb-3eb3-4787-9126-fa477c8423ab))
  (fp_line (start -0.68 -0.1) (end -0.3 -0.48)
    (stroke (width 0.1) (type solid)) (layer "F.Fab") (tstamp 9fa76c48-a468-4af6-922c-5103e1cb1781))
  (fp_line (start -0.68 0.48) (end -0.68 -0.1)
    (stroke (width 0.1) (type solid)) (layer "F.Fab") (tstamp c1f00db6-aa98-4653-8815-ecb15e3585a0))
  (fp_line (start -0.3 -0.48) (end 0.68 -0.48)
    (stroke (width 0.1) (type solid)) (layer "F.Fab") (tstamp 88379976-1203-4523-ad0f-78023598a881))
  (fp_line (start 0.68 -0.48) (end 0.68 0.48)
    (stroke (width 0.1) (type solid)) (layer "F.Fab") (tstamp cb172f40-a453-437b-b21c-a0814dbea194))
  (fp_line (start 0.68 0.48) (end -0.68 0.48)
    (stroke (width 0.1) (type solid)) (layer "F.Fab") (tstamp a2ab13fb-8819-4f92-b595-a6e4a8e355e7))
  (pad "A1" smd circle (at -0.4 -0.2 90) (size 0.25 0.25) (layers "F.Cu" "F.Paste" "F.Mask")
    (solder_mask_margin 0.1) (tstamp 783b9064-52e0-4cd9-bae3-2929b88de833))
  (pad "A2" smd circle (at -0.4 0.2 90) (size 0.25 0.25) (layers "F.Cu" "F.Paste" "F.Mask")
    (solder_mask_margin 0.1) (tstamp b9e9c194-4f0c-418b-a25f-499e7c4ad148))
  (pad "B1" smd circle (at 0 -0.2 90) (size 0.25 0.25) (layers "F.Cu" "F.Paste" "F.Mask")
    (solder_mask_margin 0.1) (tstamp eeb264c8-6283-4b28-83f0-6c83c200fd80))
  (pad "B2" smd circle (at 0 0.2 90) (size 0.25 0.25) (layers "F.Cu" "F.Paste" "F.Mask")
    (solder_mask_margin 0.1) (tstamp a926d02c-6ee3-46a4-9fb9-852f1e562f34))
  (pad "C1" smd circle (at 0.4 -0.2 90) (size 0.25 0.25) (layers "F.Cu" "F.Paste" "F.Mask")
    (solder_mask_margin 0.1) (tstamp 10102b9e-e1dc-402a-b168-48d4dffdc25e))
  (pad "C2" smd circle (at 0.4 0.2 90) (size 0.25 0.25) (layers "F.Cu" "F.Paste" "F.Mask")
    (solder_mask_margin 0.1) (tstamp 7649ec51-f78d-4210-95ad-4d4ebc0628fb))
  (model "${KICAD6_3DMODEL_DIR}/Package_CSP.3dshapes/WLCSP-6_1.4x1.0mm_P0.4mm.wrl"
    (offset (xyz 0 0 0))
    (scale (xyz 1 1 1))
    (rotate (xyz 0 0 0))
  )
)
