(footprint "TO-263-3_TabPin2" (version 20221018) (generator pcbnew)
  (layer "F.Cu")
  (descr "TO-263/D2PAK/DDPAK SMD package, http://www.infineon.com/cms/en/product/packages/PG-TO263/PG-TO263-3-1/")
  (tags "D2PAK DDPAK TO-263 D2PAK-3 TO-263-3 SOT-404")
  (attr smd)
  (fp_text reference "REF**" (at 0 -6.65) (layer "F.SilkS")
      (effects (font (size 1 1) (thickness 0.15)))
    (tstamp 8b48763d-7261-4c31-adc4-3732c921d30a)
  )
  (fp_text value "TO-263-3_TabPin2" (at 0 6.65) (layer "F.Fab")
      (effects (font (size 1 1) (thickness 0.15)))
    (tstamp cfc5f03b-8798-4569-aad3-43a6c02c7944)
  )
  (fp_text user "${REFERENCE}" (at 0 0) (layer "F.Fab")
      (effects (font (size 1 1) (thickness 0.15)))
    (tstamp 67af60df-e06a-44c4-8d72-3db566cd75ea)
  )
  (fp_line (start -4.825 -5.2) (end -4.825 -3.39)
    (stroke (width 0.12) (type solid)) (layer "F.SilkS") (tstamp 6ecad155-763e-4423-a77a-d0c3cc8fd124))
  (fp_line (start -4.825 -3.39) (end -9.95 -3.39)
    (stroke (width 0.12) (type solid)) (layer "F.SilkS") (tstamp ae610ee9-5a4d-4253-a23d-753d6136d0cb))
  (fp_line (start -4.825 3.39) (end -5.925 3.39)
    (stroke (width 0.12) (type solid)) (layer "F.SilkS") (tstamp bf1989d3-cb12-4bb3-9922-5cee77534c19))
  (fp_line (start -4.825 5.2) (end -4.825 3.39)
    (stroke (width 0.12) (type solid)) (layer "F.SilkS") (tstamp 29919d7e-42c4-4ad7-bcfd-d756d6e5b34f))
  (fp_line (start -3.325 -5.2) (end -4.825 -5.2)
    (stroke (width 0.12) (type solid)) (layer "F.SilkS") (tstamp 1d1a033e-26f9-4150-933b-e4bcd673a463))
  (fp_line (start -3.325 5.2) (end -4.825 5.2)
    (stroke (width 0.12) (type solid)) (layer "F.SilkS") (tstamp e8bed974-12e2-43e2-9f56-1c105af1a656))
  (fp_line (start -10.2 -5.65) (end -10.2 5.65)
    (stroke (width 0.05) (type solid)) (layer "F.CrtYd") (tstamp 5391755d-c4d2-4137-a304-83f2cf0837c9))
  (fp_line (start -10.2 5.65) (end 6.45 5.65)
    (stroke (width 0.05) (type solid)) (layer "F.CrtYd") (tstamp 129693ed-169a-4ffd-af66-42a67f9ec8a3))
  (fp_line (start 6.45 -5.65) (end -10.2 -5.65)
    (stroke (width 0.05) (type solid)) (layer "F.CrtYd") (tstamp d5846b52-c3c4-4eca-8528-cfe7ce9d0ffc))
  (fp_line (start 6.45 5.65) (end 6.45 -5.65)
    (stroke (width 0.05) (type solid)) (layer "F.CrtYd") (tstamp a7d0f2a1-14c5-4ef4-aa5a-4338d59b9e13))
  (fp_line (start -9.325 -3.04) (end -9.325 -2.04)
    (stroke (width 0.1) (type solid)) (layer "F.Fab") (tstamp 9f109ffb-5533-4306-9817-fbe05a3cd1c7))
  (fp_line (start -9.325 -2.04) (end -4.625 -2.04)
    (stroke (width 0.1) (type solid)) (layer "F.Fab") (tstamp 65c66c0e-af29-4e18-bf07-333dae5a9dc2))
  (fp_line (start -9.325 -0.5) (end -9.325 0.5)
    (stroke (width 0.1) (type solid)) (layer "F.Fab") (tstamp b756a98a-6eaa-4ac4-8018-e2c5dad93d73))
  (fp_line (start -9.325 0.5) (end -4.625 0.5)
    (stroke (width 0.1) (type solid)) (layer "F.Fab") (tstamp befc37b0-a00d-4717-aee3-1be44b439935))
  (fp_line (start -9.325 2.04) (end -9.325 3.04)
    (stroke (width 0.1) (type solid)) (layer "F.Fab") (tstamp e73a7002-05ef-4b12-860d-9b55243c6e50))
  (fp_line (start -9.325 3.04) (end -4.625 3.04)
    (stroke (width 0.1) (type solid)) (layer "F.Fab") (tstamp 83d3afc0-fb9c-4f5a-9586-ddc547b81c7c))
  (fp_line (start -4.625 -4) (end -3.625 -5)
    (stroke (width 0.1) (type solid)) (layer "F.Fab") (tstamp 002a5939-a9ad-4dcd-988d-5d58ea21825b))
  (fp_line (start -4.625 -3.04) (end -9.325 -3.04)
    (stroke (width 0.1) (type solid)) (layer "F.Fab") (tstamp 179af66c-3669-498a-89ed-291b416a4ada))
  (fp_line (start -4.625 -0.5) (end -9.325 -0.5)
    (stroke (width 0.1) (type solid)) (layer "F.Fab") (tstamp 8ee87566-a2d4-4b19-8c31-0b79af637932))
  (fp_line (start -4.625 2.04) (end -9.325 2.04)
    (stroke (width 0.1) (type solid)) (layer "F.Fab") (tstamp 5415af5b-60a5-4c53-902d-91268efc423f))
  (fp_line (start -4.625 5) (end -4.625 -4)
    (stroke (width 0.1) (type solid)) (layer "F.Fab") (tstamp 4772298e-1465-439a-aed4-5d67fb191f2c))
  (fp_line (start -3.625 -5) (end 4.625 -5)
    (stroke (width 0.1) (type solid)) (layer "F.Fab") (tstamp 05accfe7-89a3-4f2c-8c36-54d7a35f7df7))
  (fp_line (start 4.625 -5) (end 4.625 5)
    (stroke (width 0.1) (type solid)) (layer "F.Fab") (tstamp b1ccaefd-88bf-4780-a415-43159bed12c6))
  (fp_line (start 4.625 -5) (end 5.625 -5)
    (stroke (width 0.1) (type solid)) (layer "F.Fab") (tstamp d676c529-a5cf-445a-a612-35ad773d5f64))
  (fp_line (start 4.625 5) (end -4.625 5)
    (stroke (width 0.1) (type solid)) (layer "F.Fab") (tstamp 023ecd1f-b6e3-49b4-937a-2983ed843cb1))
  (fp_line (start 5.625 -5) (end 5.625 5)
    (stroke (width 0.1) (type solid)) (layer "F.Fab") (tstamp e167feb4-5dc0-421d-ba1a-ec12bc5f0751))
  (fp_line (start 5.625 5) (end 4.625 5)
    (stroke (width 0.1) (type solid)) (layer "F.Fab") (tstamp ac9c299c-51cc-4a52-8e99-5069932ae125))
  (pad "1" smd roundrect (at -7.65 -2.54) (size 4.6 1.1) (layers "F.Cu" "F.Paste" "F.Mask") (roundrect_rratio 0.227273) (tstamp f9ba1357-76ca-4a03-b6ff-a63f6aceba71))
  (pad "2" smd roundrect (at -7.65 0) (size 4.6 1.1) (layers "F.Cu" "F.Paste" "F.Mask") (roundrect_rratio 0.227273) (tstamp 342f4e3b-28d8-4fd2-92ca-c9fcec0f8849))
  (pad "2" smd roundrect (at -0.925 -2.775) (size 4.55 5.25) (layers "F.Cu" "F.Paste") (roundrect_rratio 0.054945) (tstamp 809c853e-a6a4-42b1-8c11-758027488e29))
  (pad "2" smd roundrect (at -0.925 2.775) (size 4.55 5.25) (layers "F.Cu" "F.Paste") (roundrect_rratio 0.054945) (tstamp 7a719679-de6e-4845-adc8-d820ea5bc149))
  (pad "2" smd roundrect (at 1.5 0) (size 9.4 10.8) (layers "F.Cu" "F.Mask") (roundrect_rratio 0.026596) (tstamp a8ac2ae6-f32e-4a52-891e-af64aaed5cd3))
  (pad "2" smd roundrect (at 3.925 -2.775) (size 4.55 5.25) (layers "F.Cu" "F.Paste") (roundrect_rratio 0.054945) (tstamp bb9b2c76-fd35-475e-b8db-70088b3d8df4))
  (pad "2" smd roundrect (at 3.925 2.775) (size 4.55 5.25) (layers "F.Cu" "F.Paste") (roundrect_rratio 0.054945) (tstamp d6f6e13c-0051-4616-8ac6-66cd5ed51f4a))
  (pad "3" smd roundrect (at -7.65 2.54) (size 4.6 1.1) (layers "F.Cu" "F.Paste" "F.Mask") (roundrect_rratio 0.227273) (tstamp 5f029383-74bf-420b-9c4d-24784082c2aa))
  (model "${KICAD6_3DMODEL_DIR}/Package_TO_SOT_SMD.3dshapes/TO-263-3_TabPin2.wrl"
    (offset (xyz 0 0 0))
    (scale (xyz 1 1 1))
    (rotate (xyz 0 0 0))
  )
)
