(footprint "TO-252-3_TabPin2" (version 20221018) (generator pcbnew)
  (layer "F.Cu")
  (descr "TO-252/DPAK SMD package, http://www.infineon.com/cms/en/product/packages/PG-TO252/PG-TO252-3-1/")
  (tags "DPAK TO-252 DPAK-3 TO-252-3 SOT-428")
  (attr smd)
  (fp_text reference "REF**" (at 0 -4.5) (layer "F.SilkS")
      (effects (font (size 1 1) (thickness 0.15)))
    (tstamp f6f89e58-f073-43a1-949e-630660854200)
  )
  (fp_text value "TO-252-3_TabPin2" (at 0 4.5) (layer "F.Fab")
      (effects (font (size 1 1) (thickness 0.15)))
    (tstamp b77b2a62-e792-4f12-a00a-07dee5dbb3ab)
  )
  (fp_text user "${REFERENCE}" (at 0 0) (layer "F.Fab")
      (effects (font (size 1 1) (thickness 0.15)))
    (tstamp 034c3c31-0501-4c84-a5de-1e159ae7fd26)
  )
  (fp_line (start -3.31 -3.45) (end -3.31 -3.18)
    (stroke (width 0.12) (type solid)) (layer "F.SilkS") (tstamp e62cd22e-98dd-445b-a6eb-ec2603fc4ff7))
  (fp_line (start -3.31 -3.18) (end -6.14 -3.18)
    (stroke (width 0.12) (type solid)) (layer "F.SilkS") (tstamp 1a962ce8-8804-49b4-84a3-43d85a17b990))
  (fp_line (start -3.31 3.18) (end -4.41 3.18)
    (stroke (width 0.12) (type solid)) (layer "F.SilkS") (tstamp 1934e059-87c5-49de-91d6-6ad9e5aa53d4))
  (fp_line (start -3.31 3.45) (end -3.31 3.18)
    (stroke (width 0.12) (type solid)) (layer "F.SilkS") (tstamp 3af0ff19-0756-474e-b906-96bd5da4e9a2))
  (fp_line (start 3.11 -3.45) (end -3.31 -3.45)
    (stroke (width 0.12) (type solid)) (layer "F.SilkS") (tstamp 9a2437ea-a642-467d-a80a-360b310d2b17))
  (fp_line (start 3.11 3.45) (end -3.31 3.45)
    (stroke (width 0.12) (type solid)) (layer "F.SilkS") (tstamp efcaf486-c694-491d-8e37-3e7fbbad696e))
  (fp_line (start -6.39 -3.5) (end -6.39 3.5)
    (stroke (width 0.05) (type solid)) (layer "F.CrtYd") (tstamp 3b86c5bc-5933-47cb-9266-ef03e4ecb439))
  (fp_line (start -6.39 3.5) (end 4.71 3.5)
    (stroke (width 0.05) (type solid)) (layer "F.CrtYd") (tstamp 1faec289-6429-466d-9188-c463c8f87086))
  (fp_line (start 4.71 -3.5) (end -6.39 -3.5)
    (stroke (width 0.05) (type solid)) (layer "F.CrtYd") (tstamp 267413ad-58b9-4b31-918c-7472dbb851a3))
  (fp_line (start 4.71 3.5) (end 4.71 -3.5)
    (stroke (width 0.05) (type solid)) (layer "F.CrtYd") (tstamp 0191bbb2-e79f-44f2-ae72-795428d59dea))
  (fp_line (start -5.81 -2.655) (end -5.81 -1.905)
    (stroke (width 0.1) (type solid)) (layer "F.Fab") (tstamp 85431a59-ad64-4fb8-8d78-a584441a84a1))
  (fp_line (start -5.81 -1.905) (end -3.11 -1.905)
    (stroke (width 0.1) (type solid)) (layer "F.Fab") (tstamp bb5b66a2-36fe-4f29-b2b1-868b00c2ead8))
  (fp_line (start -5.81 -0.375) (end -5.81 0.375)
    (stroke (width 0.1) (type solid)) (layer "F.Fab") (tstamp f29a6391-da48-424f-8a71-fd199806fae3))
  (fp_line (start -5.81 0.375) (end -3.11 0.375)
    (stroke (width 0.1) (type solid)) (layer "F.Fab") (tstamp 1fc868be-e96f-4f3d-9712-fa00bf186a02))
  (fp_line (start -5.81 1.905) (end -5.81 2.655)
    (stroke (width 0.1) (type solid)) (layer "F.Fab") (tstamp fbe39b2f-daa7-4b88-8bab-ae9a2bcdd4b5))
  (fp_line (start -5.81 2.655) (end -3.11 2.655)
    (stroke (width 0.1) (type solid)) (layer "F.Fab") (tstamp 9de5a553-6d34-41ec-99b8-75f7bccc5361))
  (fp_line (start -3.11 -2.25) (end -2.11 -3.25)
    (stroke (width 0.1) (type solid)) (layer "F.Fab") (tstamp 139ef3f5-6750-4330-8b4f-cf2838c2d1af))
  (fp_line (start -3.11 -0.375) (end -5.81 -0.375)
    (stroke (width 0.1) (type solid)) (layer "F.Fab") (tstamp 872cdb68-e994-429a-800c-0de959c45e45))
  (fp_line (start -3.11 1.905) (end -5.81 1.905)
    (stroke (width 0.1) (type solid)) (layer "F.Fab") (tstamp fda27c3b-9ae7-4cc8-b5bf-c3ece28d7139))
  (fp_line (start -3.11 3.25) (end -3.11 -2.25)
    (stroke (width 0.1) (type solid)) (layer "F.Fab") (tstamp 3aa0b893-bfe3-4547-ae1b-8e3791d9479f))
  (fp_line (start -2.705 -2.655) (end -5.81 -2.655)
    (stroke (width 0.1) (type solid)) (layer "F.Fab") (tstamp cea473ea-9500-4069-8490-e0e2dcc2690d))
  (fp_line (start -2.11 -3.25) (end 3.11 -3.25)
    (stroke (width 0.1) (type solid)) (layer "F.Fab") (tstamp 92c3c9c8-4f4f-4d9e-93a9-73e04d690071))
  (fp_line (start 3.11 -3.25) (end 3.11 3.25)
    (stroke (width 0.1) (type solid)) (layer "F.Fab") (tstamp b367ffdc-8827-4522-8bb2-31b0392466eb))
  (fp_line (start 3.11 -2.7) (end 4.11 -2.7)
    (stroke (width 0.1) (type solid)) (layer "F.Fab") (tstamp d279e2d1-edda-49d0-90ae-72306626fe7b))
  (fp_line (start 3.11 3.25) (end -3.11 3.25)
    (stroke (width 0.1) (type solid)) (layer "F.Fab") (tstamp 32888949-85a0-4158-8b3d-b87f8f04538d))
  (fp_line (start 4.11 -2.7) (end 4.11 2.7)
    (stroke (width 0.1) (type solid)) (layer "F.Fab") (tstamp a5c24428-7c68-49fd-b910-612a00debe2f))
  (fp_line (start 4.11 2.7) (end 3.11 2.7)
    (stroke (width 0.1) (type solid)) (layer "F.Fab") (tstamp 288e34e0-6870-4261-ba63-4cbc4a8cfdd0))
  (pad "1" smd roundrect (at -5.04 -2.28) (size 2.2 1.2) (layers "F.Cu" "F.Paste" "F.Mask") (roundrect_rratio 0.208333) (tstamp d496e782-8ff1-47fd-b7eb-8aa88ab8762a))
  (pad "2" smd roundrect (at -5.04 0) (size 2.2 1.2) (layers "F.Cu" "F.Paste" "F.Mask") (roundrect_rratio 0.208333) (tstamp d7a3a69b-1626-44eb-bd11-0a5902732ef7))
  (pad "2" smd roundrect (at -0.415 -1.525) (size 3.05 2.75) (layers "F.Cu" "F.Paste") (roundrect_rratio 0.090909) (tstamp 64116302-d49a-469f-86f0-ab9da872d3f9))
  (pad "2" smd roundrect (at -0.415 1.525) (size 3.05 2.75) (layers "F.Cu" "F.Paste") (roundrect_rratio 0.090909) (tstamp 1bffb45d-bcd7-413f-a3f4-530289810dd1))
  (pad "2" smd roundrect (at 1.26 0) (size 6.4 5.8) (layers "F.Cu" "F.Mask") (roundrect_rratio 0.043103) (tstamp f665f645-f2c1-4b7f-ab11-737f20ba0c3b))
  (pad "2" smd roundrect (at 2.935 -1.525) (size 3.05 2.75) (layers "F.Cu" "F.Paste") (roundrect_rratio 0.090909) (tstamp 7cf5a64f-5d7b-4fb3-bb81-7d2498158c1e))
  (pad "2" smd roundrect (at 2.935 1.525) (size 3.05 2.75) (layers "F.Cu" "F.Paste") (roundrect_rratio 0.090909) (tstamp f5497300-f43d-4e86-898b-d4bee9f38f44))
  (pad "3" smd roundrect (at -5.04 2.28) (size 2.2 1.2) (layers "F.Cu" "F.Paste" "F.Mask") (roundrect_rratio 0.208333) (tstamp ae44e958-8311-4dd2-abf2-0f2c42dbb1ee))
  (model "${KICAD6_3DMODEL_DIR}/Package_TO_SOT_SMD.3dshapes/TO-252-3_TabPin2.wrl"
    (offset (xyz 0 0 0))
    (scale (xyz 1 1 1))
    (rotate (xyz 0 0 0))
  )
)
