(footprint "SC-70-8" (version 20221018) (generator pcbnew)
  (layer "F.Cu")
  (descr "SC70-8")
  (tags "SC70-8")
  (attr smd)
  (fp_text reference "REF**" (at 0 -1.95) (layer "F.SilkS")
      (effects (font (size 1 1) (thickness 0.15)))
    (tstamp 7892c1f0-c98c-4a41-8132-b7425bfdf498)
  )
  (fp_text value "SC-70-8" (at 0 2.05) (layer "F.Fab")
      (effects (font (size 1 1) (thickness 0.15)))
    (tstamp e650b958-cfac-4f8b-9e42-cb0db1a59bf1)
  )
  (fp_text user "${REFERENCE}" (at 0 0 90) (layer "F.Fab")
      (effects (font (size 0.5 0.5) (thickness 0.075)))
    (tstamp 0ae928f6-8faf-4e53-885f-9f9b8c052018)
  )
  (fp_line (start -0.675 1.16) (end 0.735 1.16)
    (stroke (width 0.12) (type solid)) (layer "F.SilkS") (tstamp 3eed288d-290c-4b77-ab02-844bf7bb712d))
  (fp_line (start 0.735 -1.16) (end -1.35 -1.16)
    (stroke (width 0.12) (type solid)) (layer "F.SilkS") (tstamp 7e44b66f-0c16-4f19-8981-0689fbf3503b))
  (fp_line (start -1.7 -1.3) (end 1.7 -1.3)
    (stroke (width 0.05) (type solid)) (layer "F.CrtYd") (tstamp 49e190eb-9c22-4f76-8683-a191799fc326))
  (fp_line (start -1.7 1.3) (end -1.7 -1.3)
    (stroke (width 0.05) (type solid)) (layer "F.CrtYd") (tstamp c7600ed0-b3ee-4909-bbcf-34f58a98e2f9))
  (fp_line (start 1.7 -1.3) (end 1.7 1.3)
    (stroke (width 0.05) (type solid)) (layer "F.CrtYd") (tstamp e4310289-b71b-414b-8ea2-50db9bafc85a))
  (fp_line (start 1.7 1.3) (end -1.7 1.3)
    (stroke (width 0.05) (type solid)) (layer "F.CrtYd") (tstamp 09005eda-1da5-4a96-9a59-3f387aa3fd03))
  (fp_line (start -0.675 -0.6) (end -0.675 1.1)
    (stroke (width 0.1) (type solid)) (layer "F.Fab") (tstamp 120b1fcd-a9aa-4170-a235-ea71e873ed41))
  (fp_line (start -0.175 -1.1) (end -0.675 -0.6)
    (stroke (width 0.1) (type solid)) (layer "F.Fab") (tstamp 46a4f40c-d259-4973-9eea-cffc02822a7a))
  (fp_line (start 0.675 -1.1) (end -0.175 -1.1)
    (stroke (width 0.1) (type solid)) (layer "F.Fab") (tstamp 54089a58-acc1-41cf-82db-f4242481d3e6))
  (fp_line (start 0.675 -1.1) (end 0.675 1.1)
    (stroke (width 0.1) (type solid)) (layer "F.Fab") (tstamp ec84a3a5-44a5-4856-9315-a6e5e04a7f12))
  (fp_line (start 0.675 1.1) (end -0.675 1.1)
    (stroke (width 0.1) (type solid)) (layer "F.Fab") (tstamp 477194d1-2974-40c7-97ef-46ba5140c989))
  (pad "1" smd rect (at -0.9 -0.75 270) (size 0.3 1) (layers "F.Cu" "F.Paste" "F.Mask") (tstamp 991c73cc-58da-469d-bd4f-169e01da180b))
  (pad "2" smd rect (at -0.9 -0.25 270) (size 0.3 1) (layers "F.Cu" "F.Paste" "F.Mask") (tstamp 2e09a37e-ac4d-458b-93d0-9f3093864ea4))
  (pad "3" smd rect (at -0.9 0.25 270) (size 0.3 1) (layers "F.Cu" "F.Paste" "F.Mask") (tstamp b118e09a-d6ab-4498-a83c-b73dd97eefe0))
  (pad "4" smd rect (at -0.9 0.75 270) (size 0.3 1) (layers "F.Cu" "F.Paste" "F.Mask") (tstamp a301f520-52ed-4323-91f8-05e3bed4415e))
  (pad "5" smd rect (at 0.9 0.75 270) (size 0.3 1) (layers "F.Cu" "F.Paste" "F.Mask") (tstamp 9777cd32-15ee-4456-a27b-e260741765dd))
  (pad "6" smd rect (at 0.9 0.25 270) (size 0.3 1) (layers "F.Cu" "F.Paste" "F.Mask") (tstamp f1d54028-639d-43b6-9503-7557293993f6))
  (pad "7" smd rect (at 0.9 -0.25 270) (size 0.3 1) (layers "F.Cu" "F.Paste" "F.Mask") (tstamp 678c906d-2910-447e-939b-c4309847c714))
  (pad "8" smd rect (at 0.9 -0.75 270) (size 0.3 1) (layers "F.Cu" "F.Paste" "F.Mask") (tstamp 4449de19-b9c9-4b96-8002-4aa8d3fb9f8c))
  (model "${KICAD6_3DMODEL_DIR}/Package_TO_SOT_SMD.3dshapes/SC-70-8.wrl"
    (offset (xyz 0 0 0))
    (scale (xyz 1 1 1))
    (rotate (xyz 0 0 0))
  )
)
