(footprint "BGA-256_17.0x17.0mm_Layout16x16_P1.0mm_Ball0.5mm_Pad0.4mm_NSMD" (version 20221018) (generator pcbnew)
  (layer "F.Cu")
  (descr "BGA-256, dimensions: https://www.xilinx.com/support/documentation/package_specs/ft256.pdf, design rules: https://www.xilinx.com/support/documentation/user_guides/ug1099-bga-device-design-rules.pdf")
  (tags "BGA-256")
  (attr smd)
  (fp_text reference "REF**" (at 0 -9.6) (layer "F.SilkS")
      (effects (font (size 1 1) (thickness 0.15)))
    (tstamp 750d3e4e-8539-41ef-860a-10627f816043)
  )
  (fp_text value "BGA-256_17.0x17.0mm_Layout16x16_P1.0mm_Ball0.5mm_Pad0.4mm_NSMD" (at 0 9.7) (layer "F.Fab")
      (effects (font (size 1 1) (thickness 0.15)))
    (tstamp e67f3555-3461-44cc-8c88-f710c55523c7)
  )
  (fp_text user "${REFERENCE}" (at 0 0) (layer "F.Fab")
      (effects (font (size 1 1) (thickness 0.15)))
    (tstamp 944bd7c5-5321-46f8-a592-22ef712908d0)
  )
  (fp_line (start -8.6 -8.28) (end -8.6 8.6)
    (stroke (width 0.12) (type solid)) (layer "F.SilkS") (tstamp 5a439de8-4b52-492c-84d9-edee16bb041f))
  (fp_line (start -8.6 8.6) (end 8.6 8.6)
    (stroke (width 0.12) (type solid)) (layer "F.SilkS") (tstamp 2321936c-0df6-44c8-a23e-368d42f4d2be))
  (fp_line (start 8.6 8.6) (end 8.6 -8.6)
    (stroke (width 0.12) (type solid)) (layer "F.SilkS") (tstamp 8e5c1f03-0d51-458a-9052-ebb08ac318bb))
  (fp_line (start 8.92 -8.6) (end -8.28 -8.6)
    (stroke (width 0.12) (type solid)) (layer "F.SilkS") (tstamp 08a0aad5-98aa-4ba2-965b-621215ce351d))
  (fp_poly
    (pts
      (xy -8.6 -8.6)
      (xy -9.1 -8.6)
      (xy -8.6 -9.1)
      (xy -8.6 -8.6)
    )

    (stroke (width 0.12) (type solid)) (fill solid) (layer "F.SilkS") (tstamp 1ed7cd9b-f750-4e74-913e-88c7f44c387c))
  (fp_line (start -9.5 -9.5) (end -9.5 9.5)
    (stroke (width 0.05) (type solid)) (layer "F.CrtYd") (tstamp 8d9dcba9-f421-437f-91b9-6eca167f1449))
  (fp_line (start -9.5 -9.5) (end 9.5 -9.5)
    (stroke (width 0.05) (type solid)) (layer "F.CrtYd") (tstamp a86c54a9-8530-4fba-89b1-3eee4cca1685))
  (fp_line (start 9.5 9.5) (end -9.5 9.5)
    (stroke (width 0.05) (type solid)) (layer "F.CrtYd") (tstamp fa1dddfd-f104-4c71-a2c8-2e1ca17db361))
  (fp_line (start 9.5 9.5) (end 9.5 -9.5)
    (stroke (width 0.05) (type solid)) (layer "F.CrtYd") (tstamp 65aa3eba-686d-41d7-8e23-e3b483fc42c6))
  (fp_line (start -8.5 -8) (end -8.5 8.5)
    (stroke (width 0.1) (type solid)) (layer "F.Fab") (tstamp 4c451915-7076-4096-98aa-4080621ec132))
  (fp_line (start -8.5 8.5) (end 8.5 8.5)
    (stroke (width 0.1) (type solid)) (layer "F.Fab") (tstamp 881cd4da-6c9a-48fd-bad1-a693dab424a7))
  (fp_line (start -8 -8.5) (end -8.5 -8)
    (stroke (width 0.1) (type solid)) (layer "F.Fab") (tstamp 1cd9e5dc-61e6-49cf-bcc7-9fb1e992ccdf))
  (fp_line (start 8.5 -8.5) (end -8 -8.5)
    (stroke (width 0.1) (type solid)) (layer "F.Fab") (tstamp 860600df-e84a-4385-a267-f4e10906a575))
  (fp_line (start 8.5 8.5) (end 8.5 -8.5)
    (stroke (width 0.1) (type solid)) (layer "F.Fab") (tstamp 54c9ae41-9211-4522-a978-d2620d612ea4))
  (pad "A1" smd circle (at -7.5 -7.5) (size 0.4 0.4) (layers "F.Cu" "F.Paste" "F.Mask") (tstamp 8ff61be7-6aa4-491c-b313-81e4c6d5d094))
  (pad "A2" smd circle (at -6.5 -7.5) (size 0.4 0.4) (layers "F.Cu" "F.Paste" "F.Mask") (tstamp fe568b02-d0f5-4955-aa23-e5fe40027f18))
  (pad "A3" smd circle (at -5.5 -7.5) (size 0.4 0.4) (layers "F.Cu" "F.Paste" "F.Mask") (tstamp afeacc22-2b4f-47e5-8eec-27d1ac794a84))
  (pad "A4" smd circle (at -4.5 -7.5) (size 0.4 0.4) (layers "F.Cu" "F.Paste" "F.Mask") (tstamp 148d58ef-7649-494b-af83-8d87e1f0c6d1))
  (pad "A5" smd circle (at -3.5 -7.5) (size 0.4 0.4) (layers "F.Cu" "F.Paste" "F.Mask") (tstamp 8f589f94-ade1-4da0-872c-87ba120168b8))
  (pad "A6" smd circle (at -2.5 -7.5) (size 0.4 0.4) (layers "F.Cu" "F.Paste" "F.Mask") (tstamp 60e8f3ce-0f3d-4e15-9655-c7482014f83c))
  (pad "A7" smd circle (at -1.5 -7.5) (size 0.4 0.4) (layers "F.Cu" "F.Paste" "F.Mask") (tstamp ebc8892e-3de7-455a-a1bb-7b7be180b0b6))
  (pad "A8" smd circle (at -0.5 -7.5) (size 0.4 0.4) (layers "F.Cu" "F.Paste" "F.Mask") (tstamp 906ba0a1-c311-4961-9b33-322987cd1511))
  (pad "A9" smd circle (at 0.5 -7.5) (size 0.4 0.4) (layers "F.Cu" "F.Paste" "F.Mask") (tstamp 75c68b6b-d42d-41a8-91d7-f1c8a416804d))
  (pad "A10" smd circle (at 1.5 -7.5) (size 0.4 0.4) (layers "F.Cu" "F.Paste" "F.Mask") (tstamp 10a623d2-97ad-43a1-91f3-cd2d456f18ac))
  (pad "A11" smd circle (at 2.5 -7.5) (size 0.4 0.4) (layers "F.Cu" "F.Paste" "F.Mask") (tstamp 00efae90-8faa-4965-81d5-c581ddebc3c7))
  (pad "A12" smd circle (at 3.5 -7.5) (size 0.4 0.4) (layers "F.Cu" "F.Paste" "F.Mask") (tstamp 29c033ce-8f05-49bf-9f14-c7639dcc890e))
  (pad "A13" smd circle (at 4.5 -7.5) (size 0.4 0.4) (layers "F.Cu" "F.Paste" "F.Mask") (tstamp 0b30c36b-ff77-400f-a40f-772b5b654841))
  (pad "A14" smd circle (at 5.5 -7.5) (size 0.4 0.4) (layers "F.Cu" "F.Paste" "F.Mask") (tstamp 780ee731-e566-482d-8d76-cad53b6cf590))
  (pad "A15" smd circle (at 6.5 -7.5) (size 0.4 0.4) (layers "F.Cu" "F.Paste" "F.Mask") (tstamp 55d9ef21-cb05-42b9-9370-b1951f8fa290))
  (pad "A16" smd circle (at 7.5 -7.5) (size 0.4 0.4) (layers "F.Cu" "F.Paste" "F.Mask") (tstamp 733a26c3-01ab-4878-9adf-567edf250748))
  (pad "B1" smd circle (at -7.5 -6.5) (size 0.4 0.4) (layers "F.Cu" "F.Paste" "F.Mask") (tstamp a51afede-68b6-46d6-94f3-a3e8c7f1e266))
  (pad "B2" smd circle (at -6.5 -6.5) (size 0.4 0.4) (layers "F.Cu" "F.Paste" "F.Mask") (tstamp 28496eaa-ed00-43d8-afc5-4f9790cc2b00))
  (pad "B3" smd circle (at -5.5 -6.5) (size 0.4 0.4) (layers "F.Cu" "F.Paste" "F.Mask") (tstamp 0906304f-331d-4720-9e10-478228da841f))
  (pad "B4" smd circle (at -4.5 -6.5) (size 0.4 0.4) (layers "F.Cu" "F.Paste" "F.Mask") (tstamp f5e8fd9e-9542-4af1-a3db-6688c417eec1))
  (pad "B5" smd circle (at -3.5 -6.5) (size 0.4 0.4) (layers "F.Cu" "F.Paste" "F.Mask") (tstamp 3f7726f5-b44c-4bc0-877a-a56d937327ae))
  (pad "B6" smd circle (at -2.5 -6.5) (size 0.4 0.4) (layers "F.Cu" "F.Paste" "F.Mask") (tstamp 0d5dce3b-b4e5-4508-9e0a-d25a90efd7e7))
  (pad "B7" smd circle (at -1.5 -6.5) (size 0.4 0.4) (layers "F.Cu" "F.Paste" "F.Mask") (tstamp 04a65aa7-a50d-4297-ade4-42f304c29330))
  (pad "B8" smd circle (at -0.5 -6.5) (size 0.4 0.4) (layers "F.Cu" "F.Paste" "F.Mask") (tstamp f16cf3cf-f897-4e9f-84ed-15919e015052))
  (pad "B9" smd circle (at 0.5 -6.5) (size 0.4 0.4) (layers "F.Cu" "F.Paste" "F.Mask") (tstamp 4445f95e-81c1-4992-9e3e-bcdd36e3ed9c))
  (pad "B10" smd circle (at 1.5 -6.5) (size 0.4 0.4) (layers "F.Cu" "F.Paste" "F.Mask") (tstamp f94ee4cc-4aa1-4bab-93d6-3f10e2969487))
  (pad "B11" smd circle (at 2.5 -6.5) (size 0.4 0.4) (layers "F.Cu" "F.Paste" "F.Mask") (tstamp 49d24594-6538-4d1d-8ab5-ec9645d8f287))
  (pad "B12" smd circle (at 3.5 -6.5) (size 0.4 0.4) (layers "F.Cu" "F.Paste" "F.Mask") (tstamp 93865b04-8441-4708-8614-8405efd7d0f0))
  (pad "B13" smd circle (at 4.5 -6.5) (size 0.4 0.4) (layers "F.Cu" "F.Paste" "F.Mask") (tstamp ee362023-8095-4f2e-b0cd-b41a87b5c658))
  (pad "B14" smd circle (at 5.5 -6.5) (size 0.4 0.4) (layers "F.Cu" "F.Paste" "F.Mask") (tstamp 29df0c73-6939-4b33-a6d2-7b94b6b597fb))
  (pad "B15" smd circle (at 6.5 -6.5) (size 0.4 0.4) (layers "F.Cu" "F.Paste" "F.Mask") (tstamp 96610724-9e25-4215-9d56-9ed008c2df16))
  (pad "B16" smd circle (at 7.5 -6.5) (size 0.4 0.4) (layers "F.Cu" "F.Paste" "F.Mask") (tstamp 98130efc-497e-446c-b181-be3eb565038b))
  (pad "C1" smd circle (at -7.5 -5.5) (size 0.4 0.4) (layers "F.Cu" "F.Paste" "F.Mask") (tstamp 1b1f17b5-859d-49a2-b6fd-461b16236459))
  (pad "C2" smd circle (at -6.5 -5.5) (size 0.4 0.4) (layers "F.Cu" "F.Paste" "F.Mask") (tstamp 73d23c25-7edb-47f1-8e19-6eb6109d0906))
  (pad "C3" smd circle (at -5.5 -5.5) (size 0.4 0.4) (layers "F.Cu" "F.Paste" "F.Mask") (tstamp 75583902-17b4-472a-b9b2-89773ceb7c91))
  (pad "C4" smd circle (at -4.5 -5.5) (size 0.4 0.4) (layers "F.Cu" "F.Paste" "F.Mask") (tstamp 154323c6-04f7-4591-81c1-000c92a6e481))
  (pad "C5" smd circle (at -3.5 -5.5) (size 0.4 0.4) (layers "F.Cu" "F.Paste" "F.Mask") (tstamp b5c06138-a99d-41d8-a5e2-3d8da316407a))
  (pad "C6" smd circle (at -2.5 -5.5) (size 0.4 0.4) (layers "F.Cu" "F.Paste" "F.Mask") (tstamp 3c23667c-389c-4f17-962e-3ca3aa060768))
  (pad "C7" smd circle (at -1.5 -5.5) (size 0.4 0.4) (layers "F.Cu" "F.Paste" "F.Mask") (tstamp 37f0067d-fc04-44ff-b8f3-32731d4f8547))
  (pad "C8" smd circle (at -0.5 -5.5) (size 0.4 0.4) (layers "F.Cu" "F.Paste" "F.Mask") (tstamp 622f52d9-be26-475a-9614-a4736b8c55be))
  (pad "C9" smd circle (at 0.5 -5.5) (size 0.4 0.4) (layers "F.Cu" "F.Paste" "F.Mask") (tstamp d5f72c99-7232-45a2-a7a5-7fe973572e74))
  (pad "C10" smd circle (at 1.5 -5.5) (size 0.4 0.4) (layers "F.Cu" "F.Paste" "F.Mask") (tstamp 9b86efc4-9f08-400d-9d41-725c7f2e6a6b))
  (pad "C11" smd circle (at 2.5 -5.5) (size 0.4 0.4) (layers "F.Cu" "F.Paste" "F.Mask") (tstamp 34accc58-e911-4335-8793-eb9083a72697))
  (pad "C12" smd circle (at 3.5 -5.5) (size 0.4 0.4) (layers "F.Cu" "F.Paste" "F.Mask") (tstamp 3b296f7e-c5ae-4817-aa65-05ea7e7c40b0))
  (pad "C13" smd circle (at 4.5 -5.5) (size 0.4 0.4) (layers "F.Cu" "F.Paste" "F.Mask") (tstamp 4a40bd89-54d0-4619-a298-4111ae626644))
  (pad "C14" smd circle (at 5.5 -5.5) (size 0.4 0.4) (layers "F.Cu" "F.Paste" "F.Mask") (tstamp 2398940f-19dd-4041-951b-e8f3e893cb97))
  (pad "C15" smd circle (at 6.5 -5.5) (size 0.4 0.4) (layers "F.Cu" "F.Paste" "F.Mask") (tstamp 49c745a2-efc3-4eaf-b3af-d7ac3ea35966))
  (pad "C16" smd circle (at 7.5 -5.5) (size 0.4 0.4) (layers "F.Cu" "F.Paste" "F.Mask") (tstamp 29f5d5ec-4182-43bc-94dc-aedcee3d5a4a))
  (pad "D1" smd circle (at -7.5 -4.5) (size 0.4 0.4) (layers "F.Cu" "F.Paste" "F.Mask") (tstamp 464b433d-865a-4d83-9c1a-7953a11a3459))
  (pad "D2" smd circle (at -6.5 -4.5) (size 0.4 0.4) (layers "F.Cu" "F.Paste" "F.Mask") (tstamp 89f5a46e-b402-490f-a25b-59811fed0247))
  (pad "D3" smd circle (at -5.5 -4.5) (size 0.4 0.4) (layers "F.Cu" "F.Paste" "F.Mask") (tstamp 37646737-bd89-4c4e-835a-6d5f9a21dc2b))
  (pad "D4" smd circle (at -4.5 -4.5) (size 0.4 0.4) (layers "F.Cu" "F.Paste" "F.Mask") (tstamp 79481ec5-2798-4b0f-b374-b5bf6f0f586b))
  (pad "D5" smd circle (at -3.5 -4.5) (size 0.4 0.4) (layers "F.Cu" "F.Paste" "F.Mask") (tstamp 7d0d5151-868c-4639-84cf-219e861eb07e))
  (pad "D6" smd circle (at -2.5 -4.5) (size 0.4 0.4) (layers "F.Cu" "F.Paste" "F.Mask") (tstamp 91dace2f-85b4-453e-b5c1-083811be1129))
  (pad "D7" smd circle (at -1.5 -4.5) (size 0.4 0.4) (layers "F.Cu" "F.Paste" "F.Mask") (tstamp 740cece8-8232-4010-9cb5-26d55f830c58))
  (pad "D8" smd circle (at -0.5 -4.5) (size 0.4 0.4) (layers "F.Cu" "F.Paste" "F.Mask") (tstamp c89887ec-9916-4902-8ae3-06a2690eb026))
  (pad "D9" smd circle (at 0.5 -4.5) (size 0.4 0.4) (layers "F.Cu" "F.Paste" "F.Mask") (tstamp 170b5d68-fbd2-499d-99aa-1a0db812cc64))
  (pad "D10" smd circle (at 1.5 -4.5) (size 0.4 0.4) (layers "F.Cu" "F.Paste" "F.Mask") (tstamp 9f308244-d0e6-4eb8-b09b-15663d41d209))
  (pad "D11" smd circle (at 2.5 -4.5) (size 0.4 0.4) (layers "F.Cu" "F.Paste" "F.Mask") (tstamp bbc5b1cd-a98b-4ced-8b04-3c1c4a04e5e9))
  (pad "D12" smd circle (at 3.5 -4.5) (size 0.4 0.4) (layers "F.Cu" "F.Paste" "F.Mask") (tstamp 6a1bc5d1-2207-4142-852b-471bf2a4a5f2))
  (pad "D13" smd circle (at 4.5 -4.5) (size 0.4 0.4) (layers "F.Cu" "F.Paste" "F.Mask") (tstamp bebf7a6b-2663-44eb-affb-d8c415ac2a8e))
  (pad "D14" smd circle (at 5.5 -4.5) (size 0.4 0.4) (layers "F.Cu" "F.Paste" "F.Mask") (tstamp c47735e0-11c2-42c0-ae6f-904ce5f98bb6))
  (pad "D15" smd circle (at 6.5 -4.5) (size 0.4 0.4) (layers "F.Cu" "F.Paste" "F.Mask") (tstamp 79a4fae5-4ff1-4ab0-8d1c-3dccf5f8e4cd))
  (pad "D16" smd circle (at 7.5 -4.5) (size 0.4 0.4) (layers "F.Cu" "F.Paste" "F.Mask") (tstamp 82800c1a-161a-42fd-917f-24f99f1644af))
  (pad "E1" smd circle (at -7.5 -3.5) (size 0.4 0.4) (layers "F.Cu" "F.Paste" "F.Mask") (tstamp 5a79c5a6-a3c7-4a3f-802b-73bd3b026f21))
  (pad "E2" smd circle (at -6.5 -3.5) (size 0.4 0.4) (layers "F.Cu" "F.Paste" "F.Mask") (tstamp b9d306ad-4343-4dad-9e04-7abab59c8f2e))
  (pad "E3" smd circle (at -5.5 -3.5) (size 0.4 0.4) (layers "F.Cu" "F.Paste" "F.Mask") (tstamp 41fa5b23-6bd9-4292-b95a-f009acae4d21))
  (pad "E4" smd circle (at -4.5 -3.5) (size 0.4 0.4) (layers "F.Cu" "F.Paste" "F.Mask") (tstamp 6b69dabf-eccd-4743-af2b-405baaf141fe))
  (pad "E5" smd circle (at -3.5 -3.5) (size 0.4 0.4) (layers "F.Cu" "F.Paste" "F.Mask") (tstamp c56ba4ba-5480-475b-a387-bcda7f9a27c5))
  (pad "E6" smd circle (at -2.5 -3.5) (size 0.4 0.4) (layers "F.Cu" "F.Paste" "F.Mask") (tstamp 531fb116-995b-4751-b906-a794f75ec78e))
  (pad "E7" smd circle (at -1.5 -3.5) (size 0.4 0.4) (layers "F.Cu" "F.Paste" "F.Mask") (tstamp 7740b500-f7be-4fde-8254-87e11a43c7ff))
  (pad "E8" smd circle (at -0.5 -3.5) (size 0.4 0.4) (layers "F.Cu" "F.Paste" "F.Mask") (tstamp 724a2c42-d1b7-45a9-bd91-0a0518ae294f))
  (pad "E9" smd circle (at 0.5 -3.5) (size 0.4 0.4) (layers "F.Cu" "F.Paste" "F.Mask") (tstamp 0d673e08-4491-49f3-87e4-0c889f96e46b))
  (pad "E10" smd circle (at 1.5 -3.5) (size 0.4 0.4) (layers "F.Cu" "F.Paste" "F.Mask") (tstamp 3b547a3d-70cf-4ed2-bee6-f2ac1ad4fd34))
  (pad "E11" smd circle (at 2.5 -3.5) (size 0.4 0.4) (layers "F.Cu" "F.Paste" "F.Mask") (tstamp 259862c0-4ad6-4500-8163-718b822a97e0))
  (pad "E12" smd circle (at 3.5 -3.5) (size 0.4 0.4) (layers "F.Cu" "F.Paste" "F.Mask") (tstamp 55ba0750-dad8-47a9-9fb9-11cf5d507c23))
  (pad "E13" smd circle (at 4.5 -3.5) (size 0.4 0.4) (layers "F.Cu" "F.Paste" "F.Mask") (tstamp 006db12a-a978-4694-829c-8d9d4b4a6ef7))
  (pad "E14" smd circle (at 5.5 -3.5) (size 0.4 0.4) (layers "F.Cu" "F.Paste" "F.Mask") (tstamp 57695bad-e1d9-4e11-a345-93ddc23416e4))
  (pad "E15" smd circle (at 6.5 -3.5) (size 0.4 0.4) (layers "F.Cu" "F.Paste" "F.Mask") (tstamp d0d261e7-628e-4d28-98cd-058d7fe0d13f))
  (pad "E16" smd circle (at 7.5 -3.5) (size 0.4 0.4) (layers "F.Cu" "F.Paste" "F.Mask") (tstamp 57d319a4-179c-4d3b-86fb-9795ea0ad92f))
  (pad "F1" smd circle (at -7.5 -2.5) (size 0.4 0.4) (layers "F.Cu" "F.Paste" "F.Mask") (tstamp bd043970-52de-4bfc-bf08-c6b0674b4542))
  (pad "F2" smd circle (at -6.5 -2.5) (size 0.4 0.4) (layers "F.Cu" "F.Paste" "F.Mask") (tstamp c81ab1b1-e9a6-4c1a-9634-5ccca492d6f3))
  (pad "F3" smd circle (at -5.5 -2.5) (size 0.4 0.4) (layers "F.Cu" "F.Paste" "F.Mask") (tstamp 1f4a5e4c-69a3-4ef5-83c4-2d9544fe21ba))
  (pad "F4" smd circle (at -4.5 -2.5) (size 0.4 0.4) (layers "F.Cu" "F.Paste" "F.Mask") (tstamp f660f8ad-5215-485a-bd02-4b9eb51bf519))
  (pad "F5" smd circle (at -3.5 -2.5) (size 0.4 0.4) (layers "F.Cu" "F.Paste" "F.Mask") (tstamp 982efd33-01d0-43d6-9ccd-d8bd20bf3c11))
  (pad "F6" smd circle (at -2.5 -2.5) (size 0.4 0.4) (layers "F.Cu" "F.Paste" "F.Mask") (tstamp 71e75447-1734-4bee-99c9-6866a868b032))
  (pad "F7" smd circle (at -1.5 -2.5) (size 0.4 0.4) (layers "F.Cu" "F.Paste" "F.Mask") (tstamp 11fe6e01-3843-4ffc-9b76-fe3ca97b734e))
  (pad "F8" smd circle (at -0.5 -2.5) (size 0.4 0.4) (layers "F.Cu" "F.Paste" "F.Mask") (tstamp 03a2aa7c-0e61-4262-9ddf-1e72d538249e))
  (pad "F9" smd circle (at 0.5 -2.5) (size 0.4 0.4) (layers "F.Cu" "F.Paste" "F.Mask") (tstamp fb7b4f23-dfec-4d96-ab92-94646a5776f3))
  (pad "F10" smd circle (at 1.5 -2.5) (size 0.4 0.4) (layers "F.Cu" "F.Paste" "F.Mask") (tstamp 63cd879c-f11c-4634-b8aa-2c0675864f83))
  (pad "F11" smd circle (at 2.5 -2.5) (size 0.4 0.4) (layers "F.Cu" "F.Paste" "F.Mask") (tstamp 8c3404f3-f598-49e8-a48f-d33effb31eeb))
  (pad "F12" smd circle (at 3.5 -2.5) (size 0.4 0.4) (layers "F.Cu" "F.Paste" "F.Mask") (tstamp 92867e6d-86a1-4155-bdd8-1cd1beb5e109))
  (pad "F13" smd circle (at 4.5 -2.5) (size 0.4 0.4) (layers "F.Cu" "F.Paste" "F.Mask") (tstamp 5213d900-1012-418a-b019-0f431b639d1e))
  (pad "F14" smd circle (at 5.5 -2.5) (size 0.4 0.4) (layers "F.Cu" "F.Paste" "F.Mask") (tstamp a45a4374-0b29-47ae-9e59-edfa0508d8ef))
  (pad "F15" smd circle (at 6.5 -2.5) (size 0.4 0.4) (layers "F.Cu" "F.Paste" "F.Mask") (tstamp e3329db8-d0e4-4528-8334-4eedf5083e04))
  (pad "F16" smd circle (at 7.5 -2.5) (size 0.4 0.4) (layers "F.Cu" "F.Paste" "F.Mask") (tstamp 34f0db58-7300-43b5-a8d6-7b07e58ebcd8))
  (pad "G1" smd circle (at -7.5 -1.5) (size 0.4 0.4) (layers "F.Cu" "F.Paste" "F.Mask") (tstamp c32440ee-8cc8-4d4b-8380-724ebab0c4d7))
  (pad "G2" smd circle (at -6.5 -1.5) (size 0.4 0.4) (layers "F.Cu" "F.Paste" "F.Mask") (tstamp a878c68c-c207-49a0-9896-22c07dd08cb4))
  (pad "G3" smd circle (at -5.5 -1.5) (size 0.4 0.4) (layers "F.Cu" "F.Paste" "F.Mask") (tstamp c00bfb36-03b3-4503-b155-262c7423b0bf))
  (pad "G4" smd circle (at -4.5 -1.5) (size 0.4 0.4) (layers "F.Cu" "F.Paste" "F.Mask") (tstamp 8ce323c7-e91e-4afb-8bd0-8dd42f619ab5))
  (pad "G5" smd circle (at -3.5 -1.5) (size 0.4 0.4) (layers "F.Cu" "F.Paste" "F.Mask") (tstamp e444f2af-a4a8-4564-b7e8-cfb6fdcf7864))
  (pad "G6" smd circle (at -2.5 -1.5) (size 0.4 0.4) (layers "F.Cu" "F.Paste" "F.Mask") (tstamp 83d8ebec-80a3-491f-bb15-66454899e819))
  (pad "G7" smd circle (at -1.5 -1.5) (size 0.4 0.4) (layers "F.Cu" "F.Paste" "F.Mask") (tstamp 4a9bcf75-16eb-4448-b374-41c12d5f0055))
  (pad "G8" smd circle (at -0.5 -1.5) (size 0.4 0.4) (layers "F.Cu" "F.Paste" "F.Mask") (tstamp 48511375-a20f-47cb-b512-553d3e8d7f40))
  (pad "G9" smd circle (at 0.5 -1.5) (size 0.4 0.4) (layers "F.Cu" "F.Paste" "F.Mask") (tstamp 0f75e5c2-39c3-4164-9990-34f6c28e0793))
  (pad "G10" smd circle (at 1.5 -1.5) (size 0.4 0.4) (layers "F.Cu" "F.Paste" "F.Mask") (tstamp ff55e4a0-aeb2-4ab7-a0ef-23646dbd274f))
  (pad "G11" smd circle (at 2.5 -1.5) (size 0.4 0.4) (layers "F.Cu" "F.Paste" "F.Mask") (tstamp bc83cef7-c3e9-47e4-854e-a444c83544b0))
  (pad "G12" smd circle (at 3.5 -1.5) (size 0.4 0.4) (layers "F.Cu" "F.Paste" "F.Mask") (tstamp b772a765-e661-4da7-bd1c-52ad0fdc4fe1))
  (pad "G13" smd circle (at 4.5 -1.5) (size 0.4 0.4) (layers "F.Cu" "F.Paste" "F.Mask") (tstamp da3ba626-d98d-405b-8f78-e72edc33b67a))
  (pad "G14" smd circle (at 5.5 -1.5) (size 0.4 0.4) (layers "F.Cu" "F.Paste" "F.Mask") (tstamp f4b6ad06-1ca3-4529-acb7-c7d5bf35d4fd))
  (pad "G15" smd circle (at 6.5 -1.5) (size 0.4 0.4) (layers "F.Cu" "F.Paste" "F.Mask") (tstamp 8b438bd2-a37f-4ddc-a101-a7ec520e578a))
  (pad "G16" smd circle (at 7.5 -1.5) (size 0.4 0.4) (layers "F.Cu" "F.Paste" "F.Mask") (tstamp ab0a507c-f010-468c-bc38-c5f50e905506))
  (pad "H1" smd circle (at -7.5 -0.5) (size 0.4 0.4) (layers "F.Cu" "F.Paste" "F.Mask") (tstamp f22b38a8-deae-4184-9776-3e21ec2ecd3f))
  (pad "H2" smd circle (at -6.5 -0.5) (size 0.4 0.4) (layers "F.Cu" "F.Paste" "F.Mask") (tstamp 5a1f585c-63cc-4cfa-bc2e-f8a794485f7a))
  (pad "H3" smd circle (at -5.5 -0.5) (size 0.4 0.4) (layers "F.Cu" "F.Paste" "F.Mask") (tstamp 0045a767-d39a-4770-b72d-6ffc2672ef67))
  (pad "H4" smd circle (at -4.5 -0.5) (size 0.4 0.4) (layers "F.Cu" "F.Paste" "F.Mask") (tstamp 964e772d-dea4-4b54-8066-ab0cb9791e5e))
  (pad "H5" smd circle (at -3.5 -0.5) (size 0.4 0.4) (layers "F.Cu" "F.Paste" "F.Mask") (tstamp 0449fd2d-15ae-4253-b53e-d8205e336cba))
  (pad "H6" smd circle (at -2.5 -0.5) (size 0.4 0.4) (layers "F.Cu" "F.Paste" "F.Mask") (tstamp 4b032b6b-7948-4aa9-97d9-9ccfee06b182))
  (pad "H7" smd circle (at -1.5 -0.5) (size 0.4 0.4) (layers "F.Cu" "F.Paste" "F.Mask") (tstamp 5a7d398a-6d1c-4542-8f6b-3bb937bfa4c7))
  (pad "H8" smd circle (at -0.5 -0.5) (size 0.4 0.4) (layers "F.Cu" "F.Paste" "F.Mask") (tstamp 44dbc3bd-6d0c-4e07-8be8-3b58f35b4812))
  (pad "H9" smd circle (at 0.5 -0.5) (size 0.4 0.4) (layers "F.Cu" "F.Paste" "F.Mask") (tstamp d3a1ccc8-632b-4ba4-901c-75b15047080c))
  (pad "H10" smd circle (at 1.5 -0.5) (size 0.4 0.4) (layers "F.Cu" "F.Paste" "F.Mask") (tstamp 026798c6-754d-4448-b38d-d8c077fb2803))
  (pad "H11" smd circle (at 2.5 -0.5) (size 0.4 0.4) (layers "F.Cu" "F.Paste" "F.Mask") (tstamp 141e5717-5c23-4729-8906-b33200d4f9d1))
  (pad "H12" smd circle (at 3.5 -0.5) (size 0.4 0.4) (layers "F.Cu" "F.Paste" "F.Mask") (tstamp 9b286d2a-c19f-4f60-a7ba-8feecea7034c))
  (pad "H13" smd circle (at 4.5 -0.5) (size 0.4 0.4) (layers "F.Cu" "F.Paste" "F.Mask") (tstamp 3d4de673-229c-434b-b4cf-f5ac2ada8c63))
  (pad "H14" smd circle (at 5.5 -0.5) (size 0.4 0.4) (layers "F.Cu" "F.Paste" "F.Mask") (tstamp 616536a1-65cc-44c1-926d-cbf4f599c57a))
  (pad "H15" smd circle (at 6.5 -0.5) (size 0.4 0.4) (layers "F.Cu" "F.Paste" "F.Mask") (tstamp 84d545b9-78b5-4ac1-8bb6-aaa09a180b9c))
  (pad "H16" smd circle (at 7.5 -0.5) (size 0.4 0.4) (layers "F.Cu" "F.Paste" "F.Mask") (tstamp 462159de-3b83-4278-8d00-7d729a559a88))
  (pad "J1" smd circle (at -7.5 0.5) (size 0.4 0.4) (layers "F.Cu" "F.Paste" "F.Mask") (tstamp fb06d692-a3ff-4a54-beed-eac599f0ede5))
  (pad "J2" smd circle (at -6.5 0.5) (size 0.4 0.4) (layers "F.Cu" "F.Paste" "F.Mask") (tstamp 404edcbe-0508-4173-8def-d3a06c05f072))
  (pad "J3" smd circle (at -5.5 0.5) (size 0.4 0.4) (layers "F.Cu" "F.Paste" "F.Mask") (tstamp 3bc179df-c1cd-4715-afde-5281b6f89aa9))
  (pad "J4" smd circle (at -4.5 0.5) (size 0.4 0.4) (layers "F.Cu" "F.Paste" "F.Mask") (tstamp 82c04798-2318-4099-b83a-17ee0d43ad33))
  (pad "J5" smd circle (at -3.5 0.5) (size 0.4 0.4) (layers "F.Cu" "F.Paste" "F.Mask") (tstamp 4cfbfdfe-9a3c-4aea-8558-83aee59e5081))
  (pad "J6" smd circle (at -2.5 0.5) (size 0.4 0.4) (layers "F.Cu" "F.Paste" "F.Mask") (tstamp ceab2b06-97de-4742-b936-c5d0597431d2))
  (pad "J7" smd circle (at -1.5 0.5) (size 0.4 0.4) (layers "F.Cu" "F.Paste" "F.Mask") (tstamp 630e175f-5778-499b-9efa-9a86ca63cde9))
  (pad "J8" smd circle (at -0.5 0.5) (size 0.4 0.4) (layers "F.Cu" "F.Paste" "F.Mask") (tstamp 483612a5-a075-41b9-9c4d-c6d620136a02))
  (pad "J9" smd circle (at 0.5 0.5) (size 0.4 0.4) (layers "F.Cu" "F.Paste" "F.Mask") (tstamp 1d26dff7-e62e-45f0-aa45-aa238e4114a9))
  (pad "J10" smd circle (at 1.5 0.5) (size 0.4 0.4) (layers "F.Cu" "F.Paste" "F.Mask") (tstamp 9bac65d4-45d3-45e0-851a-1e301c106a63))
  (pad "J11" smd circle (at 2.5 0.5) (size 0.4 0.4) (layers "F.Cu" "F.Paste" "F.Mask") (tstamp f8976a1f-3260-40e8-bf3a-dd4feb6b78ce))
  (pad "J12" smd circle (at 3.5 0.5) (size 0.4 0.4) (layers "F.Cu" "F.Paste" "F.Mask") (tstamp e2d640f8-8e22-40a2-a148-734fed2d3515))
  (pad "J13" smd circle (at 4.5 0.5) (size 0.4 0.4) (layers "F.Cu" "F.Paste" "F.Mask") (tstamp 5db3ec65-b878-41ef-95ac-a1ce145ad51e))
  (pad "J14" smd circle (at 5.5 0.5) (size 0.4 0.4) (layers "F.Cu" "F.Paste" "F.Mask") (tstamp d328fcfc-eed5-4ed0-8f7a-11fe92142136))
  (pad "J15" smd circle (at 6.5 0.5) (size 0.4 0.4) (layers "F.Cu" "F.Paste" "F.Mask") (tstamp e6a52433-016d-4bc6-a735-f9860057d64e))
  (pad "J16" smd circle (at 7.5 0.5) (size 0.4 0.4) (layers "F.Cu" "F.Paste" "F.Mask") (tstamp a6b426c7-8370-449e-9dfc-2b7bf4624fa4))
  (pad "K1" smd circle (at -7.5 1.5) (size 0.4 0.4) (layers "F.Cu" "F.Paste" "F.Mask") (tstamp 8217dfdb-ec65-4dea-9e81-a6f9e28ca74e))
  (pad "K2" smd circle (at -6.5 1.5) (size 0.4 0.4) (layers "F.Cu" "F.Paste" "F.Mask") (tstamp 218ed8a3-1b31-4301-a0c3-1a43e7814f29))
  (pad "K3" smd circle (at -5.5 1.5) (size 0.4 0.4) (layers "F.Cu" "F.Paste" "F.Mask") (tstamp a42075b0-a35d-4669-b36b-df34d85c04cd))
  (pad "K4" smd circle (at -4.5 1.5) (size 0.4 0.4) (layers "F.Cu" "F.Paste" "F.Mask") (tstamp 4cfe281f-1849-4de4-a245-71524bb55144))
  (pad "K5" smd circle (at -3.5 1.5) (size 0.4 0.4) (layers "F.Cu" "F.Paste" "F.Mask") (tstamp 0ee06d57-3200-46a5-9be7-c0d467a8694b))
  (pad "K6" smd circle (at -2.5 1.5) (size 0.4 0.4) (layers "F.Cu" "F.Paste" "F.Mask") (tstamp 09dd2637-b4c6-4969-88f1-89e1cdd1c350))
  (pad "K7" smd circle (at -1.5 1.5) (size 0.4 0.4) (layers "F.Cu" "F.Paste" "F.Mask") (tstamp 4ff58f1d-84eb-423c-9837-a4e1f5d1bad2))
  (pad "K8" smd circle (at -0.5 1.5) (size 0.4 0.4) (layers "F.Cu" "F.Paste" "F.Mask") (tstamp 6220f243-56e6-40a9-a67f-b30d11409f76))
  (pad "K9" smd circle (at 0.5 1.5) (size 0.4 0.4) (layers "F.Cu" "F.Paste" "F.Mask") (tstamp f41e66d2-6cea-4b16-9d12-3fb2f6b5ed73))
  (pad "K10" smd circle (at 1.5 1.5) (size 0.4 0.4) (layers "F.Cu" "F.Paste" "F.Mask") (tstamp b2a77c4c-29a8-41b7-aaa6-6a50afd315c2))
  (pad "K11" smd circle (at 2.5 1.5) (size 0.4 0.4) (layers "F.Cu" "F.Paste" "F.Mask") (tstamp 1cd9936e-8dab-40f8-915b-c47491bd6fda))
  (pad "K12" smd circle (at 3.5 1.5) (size 0.4 0.4) (layers "F.Cu" "F.Paste" "F.Mask") (tstamp b333bf5d-82c2-4518-9f40-31f71cb9a062))
  (pad "K13" smd circle (at 4.5 1.5) (size 0.4 0.4) (layers "F.Cu" "F.Paste" "F.Mask") (tstamp 9d4c6c4c-d197-42b1-b982-919e9f5f3d9e))
  (pad "K14" smd circle (at 5.5 1.5) (size 0.4 0.4) (layers "F.Cu" "F.Paste" "F.Mask") (tstamp 498f77ca-1bc6-48a5-a21b-238fee80cd8a))
  (pad "K15" smd circle (at 6.5 1.5) (size 0.4 0.4) (layers "F.Cu" "F.Paste" "F.Mask") (tstamp f298a84e-868d-42de-958b-32c7c79e1ddd))
  (pad "K16" smd circle (at 7.5 1.5) (size 0.4 0.4) (layers "F.Cu" "F.Paste" "F.Mask") (tstamp b389e8f1-b791-47d3-9132-fedc8a0dd851))
  (pad "L1" smd circle (at -7.5 2.5) (size 0.4 0.4) (layers "F.Cu" "F.Paste" "F.Mask") (tstamp 8b8da1d0-f8e3-45a4-8250-0d24e7bde0bc))
  (pad "L2" smd circle (at -6.5 2.5) (size 0.4 0.4) (layers "F.Cu" "F.Paste" "F.Mask") (tstamp 4fa21160-75f1-4016-9651-d684d1f5833e))
  (pad "L3" smd circle (at -5.5 2.5) (size 0.4 0.4) (layers "F.Cu" "F.Paste" "F.Mask") (tstamp 2b419825-b259-4691-9781-ebd10fcea18b))
  (pad "L4" smd circle (at -4.5 2.5) (size 0.4 0.4) (layers "F.Cu" "F.Paste" "F.Mask") (tstamp e21c62f4-9899-4bbd-9a0e-a350ac90a61e))
  (pad "L5" smd circle (at -3.5 2.5) (size 0.4 0.4) (layers "F.Cu" "F.Paste" "F.Mask") (tstamp 0f5743c6-c2db-44e4-babc-b49dc714be60))
  (pad "L6" smd circle (at -2.5 2.5) (size 0.4 0.4) (layers "F.Cu" "F.Paste" "F.Mask") (tstamp 0052f0f8-6e1d-4e49-9352-51f228fd8142))
  (pad "L7" smd circle (at -1.5 2.5) (size 0.4 0.4) (layers "F.Cu" "F.Paste" "F.Mask") (tstamp 478bbd58-bf4e-49ed-8cab-b89ec977a586))
  (pad "L8" smd circle (at -0.5 2.5) (size 0.4 0.4) (layers "F.Cu" "F.Paste" "F.Mask") (tstamp 1e72d5cc-c940-4f3b-9a71-8e78b598d448))
  (pad "L9" smd circle (at 0.5 2.5) (size 0.4 0.4) (layers "F.Cu" "F.Paste" "F.Mask") (tstamp d6d381c9-37f6-4349-adbe-8cfa4059ab72))
  (pad "L10" smd circle (at 1.5 2.5) (size 0.4 0.4) (layers "F.Cu" "F.Paste" "F.Mask") (tstamp 2320cc6d-a157-4a59-821a-e948460daaa4))
  (pad "L11" smd circle (at 2.5 2.5) (size 0.4 0.4) (layers "F.Cu" "F.Paste" "F.Mask") (tstamp 97a15f46-7005-4fff-9366-facbfdb98b7b))
  (pad "L12" smd circle (at 3.5 2.5) (size 0.4 0.4) (layers "F.Cu" "F.Paste" "F.Mask") (tstamp ca4272b8-c9ad-4917-82a7-a18ef771d940))
  (pad "L13" smd circle (at 4.5 2.5) (size 0.4 0.4) (layers "F.Cu" "F.Paste" "F.Mask") (tstamp db043ee7-2f65-4c5b-a066-8f28f241faa8))
  (pad "L14" smd circle (at 5.5 2.5) (size 0.4 0.4) (layers "F.Cu" "F.Paste" "F.Mask") (tstamp 36d5f1da-b538-4573-813d-9bda51d1bde4))
  (pad "L15" smd circle (at 6.5 2.5) (size 0.4 0.4) (layers "F.Cu" "F.Paste" "F.Mask") (tstamp 148c456f-a0c4-45c7-ac3c-77c6107713ec))
  (pad "L16" smd circle (at 7.5 2.5) (size 0.4 0.4) (layers "F.Cu" "F.Paste" "F.Mask") (tstamp 894d7a15-ba8b-4de3-823e-9f42fe6d6425))
  (pad "M1" smd circle (at -7.5 3.5) (size 0.4 0.4) (layers "F.Cu" "F.Paste" "F.Mask") (tstamp cb813061-c5e1-46b7-bb0b-36a6e1fabd82))
  (pad "M2" smd circle (at -6.5 3.5) (size 0.4 0.4) (layers "F.Cu" "F.Paste" "F.Mask") (tstamp 379e3eaa-a926-4785-a984-f4c5d5fe5968))
  (pad "M3" smd circle (at -5.5 3.5) (size 0.4 0.4) (layers "F.Cu" "F.Paste" "F.Mask") (tstamp 48245382-c296-4c96-9b6d-f45de21ca0cd))
  (pad "M4" smd circle (at -4.5 3.5) (size 0.4 0.4) (layers "F.Cu" "F.Paste" "F.Mask") (tstamp 7917aa0f-6534-48f4-96c4-6a8d83e3af94))
  (pad "M5" smd circle (at -3.5 3.5) (size 0.4 0.4) (layers "F.Cu" "F.Paste" "F.Mask") (tstamp 9b53ab56-5d6c-48eb-a03e-d1c91b4760d4))
  (pad "M6" smd circle (at -2.5 3.5) (size 0.4 0.4) (layers "F.Cu" "F.Paste" "F.Mask") (tstamp 1b008c60-ae4d-4449-bafb-6398492f8898))
  (pad "M7" smd circle (at -1.5 3.5) (size 0.4 0.4) (layers "F.Cu" "F.Paste" "F.Mask") (tstamp e7afd86f-f469-4480-b158-17137d662dbe))
  (pad "M8" smd circle (at -0.5 3.5) (size 0.4 0.4) (layers "F.Cu" "F.Paste" "F.Mask") (tstamp e1fe3eef-823c-4bc7-a099-862e26decdb8))
  (pad "M9" smd circle (at 0.5 3.5) (size 0.4 0.4) (layers "F.Cu" "F.Paste" "F.Mask") (tstamp c3308b64-b7cc-4248-a63e-df476789302c))
  (pad "M10" smd circle (at 1.5 3.5) (size 0.4 0.4) (layers "F.Cu" "F.Paste" "F.Mask") (tstamp 7a2d1228-2cfd-4571-a272-d66aa116dea1))
  (pad "M11" smd circle (at 2.5 3.5) (size 0.4 0.4) (layers "F.Cu" "F.Paste" "F.Mask") (tstamp e6ad03cc-4e25-4f1e-9389-55b53cf6b2d3))
  (pad "M12" smd circle (at 3.5 3.5) (size 0.4 0.4) (layers "F.Cu" "F.Paste" "F.Mask") (tstamp 5a5e674d-03c2-4e54-b069-b878bdbf59dd))
  (pad "M13" smd circle (at 4.5 3.5) (size 0.4 0.4) (layers "F.Cu" "F.Paste" "F.Mask") (tstamp 38850192-553a-4841-9187-ff4a1ffb68d2))
  (pad "M14" smd circle (at 5.5 3.5) (size 0.4 0.4) (layers "F.Cu" "F.Paste" "F.Mask") (tstamp 6d223a12-6840-454e-9266-d3599cd1dd25))
  (pad "M15" smd circle (at 6.5 3.5) (size 0.4 0.4) (layers "F.Cu" "F.Paste" "F.Mask") (tstamp 6d65dbce-8642-4bbd-abe0-7033b1576ba0))
  (pad "M16" smd circle (at 7.5 3.5) (size 0.4 0.4) (layers "F.Cu" "F.Paste" "F.Mask") (tstamp 3348a900-1610-498b-9538-defdcc58bc8a))
  (pad "N1" smd circle (at -7.5 4.5) (size 0.4 0.4) (layers "F.Cu" "F.Paste" "F.Mask") (tstamp 3a81841f-bd0e-417c-b9b2-77b7666a3363))
  (pad "N2" smd circle (at -6.5 4.5) (size 0.4 0.4) (layers "F.Cu" "F.Paste" "F.Mask") (tstamp f250e528-9590-4b0c-b8dd-78c09d5b7b92))
  (pad "N3" smd circle (at -5.5 4.5) (size 0.4 0.4) (layers "F.Cu" "F.Paste" "F.Mask") (tstamp a61de3b6-f9a9-448f-b11e-9e3d9826a133))
  (pad "N4" smd circle (at -4.5 4.5) (size 0.4 0.4) (layers "F.Cu" "F.Paste" "F.Mask") (tstamp 132a2d2d-2b9a-43f2-b491-0aea972e8b4d))
  (pad "N5" smd circle (at -3.5 4.5) (size 0.4 0.4) (layers "F.Cu" "F.Paste" "F.Mask") (tstamp 37832d50-c428-4ccb-abf7-3ad3279d3845))
  (pad "N6" smd circle (at -2.5 4.5) (size 0.4 0.4) (layers "F.Cu" "F.Paste" "F.Mask") (tstamp 68539682-c31a-4a64-b381-60e99a0b2f87))
  (pad "N7" smd circle (at -1.5 4.5) (size 0.4 0.4) (layers "F.Cu" "F.Paste" "F.Mask") (tstamp 2c1aabe7-344f-4b8e-b36c-c13092333fab))
  (pad "N8" smd circle (at -0.5 4.5) (size 0.4 0.4) (layers "F.Cu" "F.Paste" "F.Mask") (tstamp e1b80015-15e7-4912-8723-8c5f28064fe0))
  (pad "N9" smd circle (at 0.5 4.5) (size 0.4 0.4) (layers "F.Cu" "F.Paste" "F.Mask") (tstamp df6612f3-5584-42df-b051-e4952607632e))
  (pad "N10" smd circle (at 1.5 4.5) (size 0.4 0.4) (layers "F.Cu" "F.Paste" "F.Mask") (tstamp 0142a12a-59b9-4994-9c93-7e602939329a))
  (pad "N11" smd circle (at 2.5 4.5) (size 0.4 0.4) (layers "F.Cu" "F.Paste" "F.Mask") (tstamp 3d3381c2-67eb-4410-82f2-83eca3c1143a))
  (pad "N12" smd circle (at 3.5 4.5) (size 0.4 0.4) (layers "F.Cu" "F.Paste" "F.Mask") (tstamp 36d683be-7d78-4f0a-8411-0eb55d5529b7))
  (pad "N13" smd circle (at 4.5 4.5) (size 0.4 0.4) (layers "F.Cu" "F.Paste" "F.Mask") (tstamp aa196ed2-3d31-40a1-a52e-113b3e323ddf))
  (pad "N14" smd circle (at 5.5 4.5) (size 0.4 0.4) (layers "F.Cu" "F.Paste" "F.Mask") (tstamp 6b15d24b-86a2-474f-b98d-e5263cf61f6a))
  (pad "N15" smd circle (at 6.5 4.5) (size 0.4 0.4) (layers "F.Cu" "F.Paste" "F.Mask") (tstamp 136ce5d3-b074-48b3-918d-b63f62460304))
  (pad "N16" smd circle (at 7.5 4.5) (size 0.4 0.4) (layers "F.Cu" "F.Paste" "F.Mask") (tstamp 2e543b3c-8244-4bd0-bb2d-f92fdcf86114))
  (pad "P1" smd circle (at -7.5 5.5) (size 0.4 0.4) (layers "F.Cu" "F.Paste" "F.Mask") (tstamp 578f7b7a-2d04-4e2d-85b9-7bc274dca086))
  (pad "P2" smd circle (at -6.5 5.5) (size 0.4 0.4) (layers "F.Cu" "F.Paste" "F.Mask") (tstamp a072bbe8-acc7-4a4a-8166-e5fcbc654b61))
  (pad "P3" smd circle (at -5.5 5.5) (size 0.4 0.4) (layers "F.Cu" "F.Paste" "F.Mask") (tstamp 9c3ed6f9-d00b-4e7c-b6c4-d14211d84af5))
  (pad "P4" smd circle (at -4.5 5.5) (size 0.4 0.4) (layers "F.Cu" "F.Paste" "F.Mask") (tstamp aa3765ee-5f75-451c-b185-012f5f2ffbb1))
  (pad "P5" smd circle (at -3.5 5.5) (size 0.4 0.4) (layers "F.Cu" "F.Paste" "F.Mask") (tstamp 06667604-087b-424b-a68b-641ce15a0fd2))
  (pad "P6" smd circle (at -2.5 5.5) (size 0.4 0.4) (layers "F.Cu" "F.Paste" "F.Mask") (tstamp 0a019ba3-ec26-488d-bbe6-75187aa5baea))
  (pad "P7" smd circle (at -1.5 5.5) (size 0.4 0.4) (layers "F.Cu" "F.Paste" "F.Mask") (tstamp bf5a74d1-a147-46e9-985f-637dde5a7a7a))
  (pad "P8" smd circle (at -0.5 5.5) (size 0.4 0.4) (layers "F.Cu" "F.Paste" "F.Mask") (tstamp 50138617-0fd7-46d9-b281-d99686bcbd74))
  (pad "P9" smd circle (at 0.5 5.5) (size 0.4 0.4) (layers "F.Cu" "F.Paste" "F.Mask") (tstamp 93fe8f5d-dcb8-417c-ab74-fd98ccad4425))
  (pad "P10" smd circle (at 1.5 5.5) (size 0.4 0.4) (layers "F.Cu" "F.Paste" "F.Mask") (tstamp 9af55119-722e-4f98-b729-26ecc950d4ef))
  (pad "P11" smd circle (at 2.5 5.5) (size 0.4 0.4) (layers "F.Cu" "F.Paste" "F.Mask") (tstamp fcfc6d74-e261-46ba-8bf4-583b9205d013))
  (pad "P12" smd circle (at 3.5 5.5) (size 0.4 0.4) (layers "F.Cu" "F.Paste" "F.Mask") (tstamp e20fc2e1-5653-45c1-a590-5b6c6b769b6d))
  (pad "P13" smd circle (at 4.5 5.5) (size 0.4 0.4) (layers "F.Cu" "F.Paste" "F.Mask") (tstamp 54da0cec-690d-4610-8d7e-8cc9d8dbd5be))
  (pad "P14" smd circle (at 5.5 5.5) (size 0.4 0.4) (layers "F.Cu" "F.Paste" "F.Mask") (tstamp d19680ff-8556-4cd6-9eb5-91261a8e3cc5))
  (pad "P15" smd circle (at 6.5 5.5) (size 0.4 0.4) (layers "F.Cu" "F.Paste" "F.Mask") (tstamp bc6cc395-ab34-4fab-a644-634f4312d2f6))
  (pad "P16" smd circle (at 7.5 5.5) (size 0.4 0.4) (layers "F.Cu" "F.Paste" "F.Mask") (tstamp 6b070684-b2a2-42c3-96d6-f1454a62dea3))
  (pad "R1" smd circle (at -7.5 6.5) (size 0.4 0.4) (layers "F.Cu" "F.Paste" "F.Mask") (tstamp cb71c839-657e-4ba9-9a99-df184b5baf0e))
  (pad "R2" smd circle (at -6.5 6.5) (size 0.4 0.4) (layers "F.Cu" "F.Paste" "F.Mask") (tstamp c4a371d5-b314-4e11-870d-39eddb26e773))
  (pad "R3" smd circle (at -5.5 6.5) (size 0.4 0.4) (layers "F.Cu" "F.Paste" "F.Mask") (tstamp 30294310-3d22-4f9d-bace-f6d29de9755f))
  (pad "R4" smd circle (at -4.5 6.5) (size 0.4 0.4) (layers "F.Cu" "F.Paste" "F.Mask") (tstamp b9d35c20-d07d-41c5-83f2-a6fcbec3d66d))
  (pad "R5" smd circle (at -3.5 6.5) (size 0.4 0.4) (layers "F.Cu" "F.Paste" "F.Mask") (tstamp 8fb68427-9647-40c9-bb13-44ce9dc85c86))
  (pad "R6" smd circle (at -2.5 6.5) (size 0.4 0.4) (layers "F.Cu" "F.Paste" "F.Mask") (tstamp 91c29477-4a8f-4449-8c30-f42353d4e517))
  (pad "R7" smd circle (at -1.5 6.5) (size 0.4 0.4) (layers "F.Cu" "F.Paste" "F.Mask") (tstamp 0a3fe8d5-853e-44b6-a817-0f163674801c))
  (pad "R8" smd circle (at -0.5 6.5) (size 0.4 0.4) (layers "F.Cu" "F.Paste" "F.Mask") (tstamp 4a8f238a-6d7d-4591-a16a-12b801050a7e))
  (pad "R9" smd circle (at 0.5 6.5) (size 0.4 0.4) (layers "F.Cu" "F.Paste" "F.Mask") (tstamp 5510d332-8a35-4442-88eb-4228fa39378f))
  (pad "R10" smd circle (at 1.5 6.5) (size 0.4 0.4) (layers "F.Cu" "F.Paste" "F.Mask") (tstamp c353dd90-4a15-415c-864a-0c6d40fb673d))
  (pad "R11" smd circle (at 2.5 6.5) (size 0.4 0.4) (layers "F.Cu" "F.Paste" "F.Mask") (tstamp 5374b7c3-a729-4985-b848-9214cae6fe4b))
  (pad "R12" smd circle (at 3.5 6.5) (size 0.4 0.4) (layers "F.Cu" "F.Paste" "F.Mask") (tstamp a882c654-6f98-461f-aa51-f6d74fa23ece))
  (pad "R13" smd circle (at 4.5 6.5) (size 0.4 0.4) (layers "F.Cu" "F.Paste" "F.Mask") (tstamp 3d14aef6-7e83-4fff-9ce4-878ebf439935))
  (pad "R14" smd circle (at 5.5 6.5) (size 0.4 0.4) (layers "F.Cu" "F.Paste" "F.Mask") (tstamp 02221ed4-66d3-4a9f-b424-e3ae8335d366))
  (pad "R15" smd circle (at 6.5 6.5) (size 0.4 0.4) (layers "F.Cu" "F.Paste" "F.Mask") (tstamp eb74150e-5fd1-4759-9059-bef9c5773cd0))
  (pad "R16" smd circle (at 7.5 6.5) (size 0.4 0.4) (layers "F.Cu" "F.Paste" "F.Mask") (tstamp 6de3902e-0bf8-4fd6-8a01-002b249aae1a))
  (pad "T1" smd circle (at -7.5 7.5) (size 0.4 0.4) (layers "F.Cu" "F.Paste" "F.Mask") (tstamp 0121e902-280f-458d-8072-efb8a25d4ad1))
  (pad "T2" smd circle (at -6.5 7.5) (size 0.4 0.4) (layers "F.Cu" "F.Paste" "F.Mask") (tstamp 58f27405-1ba6-4237-bf4b-4a2eb3156d38))
  (pad "T3" smd circle (at -5.5 7.5) (size 0.4 0.4) (layers "F.Cu" "F.Paste" "F.Mask") (tstamp 75066aa5-1f26-4b5f-bb7d-4b7fa5c795b6))
  (pad "T4" smd circle (at -4.5 7.5) (size 0.4 0.4) (layers "F.Cu" "F.Paste" "F.Mask") (tstamp 2c32d597-2e18-4979-ba87-99185218179c))
  (pad "T5" smd circle (at -3.5 7.5) (size 0.4 0.4) (layers "F.Cu" "F.Paste" "F.Mask") (tstamp 6af3297c-2b83-498d-80ad-e445265244f5))
  (pad "T6" smd circle (at -2.5 7.5) (size 0.4 0.4) (layers "F.Cu" "F.Paste" "F.Mask") (tstamp fe436011-f1fe-4fbe-aed2-d65e34c55144))
  (pad "T7" smd circle (at -1.5 7.5) (size 0.4 0.4) (layers "F.Cu" "F.Paste" "F.Mask") (tstamp 79bb5ac4-4a28-4f1b-8b63-9d0ee2012dae))
  (pad "T8" smd circle (at -0.5 7.5) (size 0.4 0.4) (layers "F.Cu" "F.Paste" "F.Mask") (tstamp 8c3a3049-7953-4a6a-8d66-7def1ba200b6))
  (pad "T9" smd circle (at 0.5 7.5) (size 0.4 0.4) (layers "F.Cu" "F.Paste" "F.Mask") (tstamp 74e59173-7c6b-436e-a17a-d086804fca50))
  (pad "T10" smd circle (at 1.5 7.5) (size 0.4 0.4) (layers "F.Cu" "F.Paste" "F.Mask") (tstamp cce916a4-3d8b-44d7-92e9-d61f54db5786))
  (pad "T11" smd circle (at 2.5 7.5) (size 0.4 0.4) (layers "F.Cu" "F.Paste" "F.Mask") (tstamp eb5b5168-ca39-4590-97a3-be02b5d2a30a))
  (pad "T12" smd circle (at 3.5 7.5) (size 0.4 0.4) (layers "F.Cu" "F.Paste" "F.Mask") (tstamp d3f45a0e-4a5c-4907-9997-0308e96d5154))
  (pad "T13" smd circle (at 4.5 7.5) (size 0.4 0.4) (layers "F.Cu" "F.Paste" "F.Mask") (tstamp 886785b1-565f-486d-886b-737a7ccf5c57))
  (pad "T14" smd circle (at 5.5 7.5) (size 0.4 0.4) (layers "F.Cu" "F.Paste" "F.Mask") (tstamp 5ea13f3d-6f25-4cbc-b333-a981fec7d213))
  (pad "T15" smd circle (at 6.5 7.5) (size 0.4 0.4) (layers "F.Cu" "F.Paste" "F.Mask") (tstamp c867cec0-007e-4cfb-bbe5-e0161b9d583c))
  (pad "T16" smd circle (at 7.5 7.5) (size 0.4 0.4) (layers "F.Cu" "F.Paste" "F.Mask") (tstamp 7bd136c1-ddeb-4c1b-b281-5c2bec617bb5))
  (model "${KICAD6_3DMODEL_DIR}/Package_BGA.3dshapes/BGA-256_17.0x17.0mm_Layout16x16_P1.0mm_Ball0.5mm_Pad0.4mm_NSMD.wrl"
    (offset (xyz 0 0 0))
    (scale (xyz 1 1 1))
    (rotate (xyz 0 0 0))
  )
)
