(footprint SC-74-6_1.55x2.9mm_P0.95mm (version 20221018) (generator kicad-footprint-generator)
  (layer F.Cu)
  (descr "SC-74, 6 Pin (https://www.jeita.or.jp/japanese/standard/book/ED-7500B/#target/page_no=39), generated with kicad-footprint-generator ipc_gullwing_generator.py")
  (tags "SC-74 SO")
  (attr smd)
  (fp_text reference REF** (at 0 -2.4) (layer F.SilkS)
    (effects (font (size 1 1) (thickness 0.15)))
  )
  (fp_text value SC-74-6_1.55x2.9mm_P0.95mm (at 0 2.4) (layer F.Fab)
    (effects (font (size 1 1) (thickness 0.15)))
  )
  (fp_line (start -2.2 -1.7) (end -2.2 1.7)
    (stroke (width 0.05) (type solid)) (layer F.CrtYd))
  (fp_line (start -2.2 1.7) (end 2.2 1.7)
    (stroke (width 0.05) (type solid)) (layer F.CrtYd))
  (fp_line (start 2.2 1.7) (end 2.2 -1.7)
    (stroke (width 0.05) (type solid)) (layer F.CrtYd))
  (fp_line (start 2.2 -1.7) (end -2.2 -1.7)
    (stroke (width 0.05) (type solid)) (layer F.CrtYd))
  (fp_line (start 0 1.56) (end 0.775 1.56)
    (stroke (width 0.12) (type solid)) (layer F.SilkS))
  (fp_line (start 0 1.56) (end -0.775 1.56)
    (stroke (width 0.12) (type solid)) (layer F.SilkS))
  (fp_line (start 0 -1.56) (end 0.775 -1.56)
    (stroke (width 0.12) (type solid)) (layer F.SilkS))
  (fp_line (start 0 -1.56) (end -0.775 -1.56)
    (stroke (width 0.12) (type solid)) (layer F.SilkS))
  (fp_line (start -0.3875 -1.45) (end 0.775 -1.45)
    (stroke (width 0.1) (type solid)) (layer F.Fab))
  (fp_line (start 0.775 -1.45) (end 0.775 1.45)
    (stroke (width 0.1) (type solid)) (layer F.Fab))
  (fp_line (start 0.775 1.45) (end -0.775 1.45)
    (stroke (width 0.1) (type solid)) (layer F.Fab))
  (fp_line (start -0.775 1.45) (end -0.775 -1.0625)
    (stroke (width 0.1) (type solid)) (layer F.Fab))
  (fp_line (start -0.775 -1.0625) (end -0.3875 -1.45)
    (stroke (width 0.1) (type solid)) (layer F.Fab))
  (pad 1 smd roundrect (at -1.15 -0.95) (size 1.6 0.6) (layers F.Cu F.Mask F.Paste) (roundrect_rratio 0.25))
  (pad 2 smd roundrect (at -1.15 0) (size 1.6 0.6) (layers F.Cu F.Mask F.Paste) (roundrect_rratio 0.25))
  (pad 3 smd roundrect (at -1.15 0.95) (size 1.6 0.6) (layers F.Cu F.Mask F.Paste) (roundrect_rratio 0.25))
  (pad 4 smd roundrect (at 1.15 0.95) (size 1.6 0.6) (layers F.Cu F.Mask F.Paste) (roundrect_rratio 0.25))
  (pad 5 smd roundrect (at 1.15 0) (size 1.6 0.6) (layers F.Cu F.Mask F.Paste) (roundrect_rratio 0.25))
  (pad 6 smd roundrect (at 1.15 -0.95) (size 1.6 0.6) (layers F.Cu F.Mask F.Paste) (roundrect_rratio 0.25))
  (fp_poly (pts (xy -1.3625 -1.51) (xy -1.6025 -1.84) (xy -1.1225 -1.84) (xy -1.3625 -1.51))
    (stroke (width 0.12) (type solid)) (fill solid) (layer F.SilkS))
  (fp_text user ${REFERENCE} (at 0 0) (layer F.Fab)
    (effects (font (size 0.39 0.39) (thickness 0.06)))
  )
  (model ${KICAD7_3DMODEL_DIR}/Package_SO.3dshapes/SC-74-6_1.55x2.9mm_P0.95mm.wrl
    (offset (xyz 0 0 0))
    (scale (xyz 1 1 1))
    (rotate (xyz 0 0 0))
  )
)
