(footprint "BGA-153_8.0x8.0mm_Layout15x15_P0.5mm_Ball0.3mm_Pad0.25mm_NSMD" (version 20221018) (generator pcbnew)
  (layer "F.Cu")
  (descr "Altera MBGA-153, https://www.altera.com/content/dam/altera-www/global/en_US/pdfs/literature/packaging/04r00471-00.pdf")
  (tags "Altera BGA-153 M153 MBGA")
  (attr smd)
  (fp_text reference "REF**" (at 0 -5) (layer "F.SilkS")
      (effects (font (size 1 1) (thickness 0.15)))
    (tstamp bb0a3a54-f6e2-4076-bd97-8f31b4e5cda5)
  )
  (fp_text value "BGA-153_8.0x8.0mm_Layout15x15_P0.5mm_Ball0.3mm_Pad0.25mm_NSMD" (at 0 5) (layer "F.Fab")
      (effects (font (size 1 1) (thickness 0.15)))
    (tstamp 9e6d1de5-4162-4f03-9348-71ae6ab16e01)
  )
  (fp_text user "${REFERENCE}" (at 0 0) (layer "F.Fab")
      (effects (font (size 1 1) (thickness 0.15)))
    (tstamp a0e2f324-59e6-47a1-99d5-250c6b05041a)
  )
  (fp_line (start -4.15 -3.83) (end -4.15 -2.14)
    (stroke (width 0.12) (type solid)) (layer "F.SilkS") (tstamp ed38423e-b2ec-409e-b3b0-bba248c431ae))
  (fp_line (start -4.15 4.15) (end -4.15 2.15)
    (stroke (width 0.12) (type solid)) (layer "F.SilkS") (tstamp 4cb145ae-93f9-46da-ad69-26232c25cfbd))
  (fp_line (start -2.15 -4.15) (end -3.83 -4.15)
    (stroke (width 0.12) (type solid)) (layer "F.SilkS") (tstamp 88e24354-baf5-4cc8-80b4-799de650719c))
  (fp_line (start -2.15 4.15) (end -4.15 4.15)
    (stroke (width 0.12) (type solid)) (layer "F.SilkS") (tstamp 8f8c667b-b262-4066-837b-82d7edba0533))
  (fp_line (start 2.15 -4.15) (end 4.15 -4.15)
    (stroke (width 0.12) (type solid)) (layer "F.SilkS") (tstamp 943259a8-741e-4c83-985c-a29c6fedc96e))
  (fp_line (start 2.15 4.15) (end 4.15 4.15)
    (stroke (width 0.12) (type solid)) (layer "F.SilkS") (tstamp 3d2f98ac-15c2-487a-aec7-2e4e4fa4ca9b))
  (fp_line (start 4.15 -4.15) (end 4.15 -2.15)
    (stroke (width 0.12) (type solid)) (layer "F.SilkS") (tstamp 9b2751b2-bbd0-4842-a119-0de3dbe62fc5))
  (fp_line (start 4.15 4.15) (end 4.15 2.15)
    (stroke (width 0.12) (type solid)) (layer "F.SilkS") (tstamp 6b3e861d-c23f-4979-8d44-ca42b747a315))
  (fp_poly
    (pts
      (xy -4.15 -4.15)
      (xy -4.65 -4.15)
      (xy -4.15 -4.65)
      (xy -4.15 -4.15)
    )

    (stroke (width 0.12) (type solid)) (fill solid) (layer "F.SilkS") (tstamp 4d6ca31b-9458-4753-b990-a9a2283173b2))
  (fp_rect (start 5 5) (end -5 -5)
    (stroke (width 0.05) (type solid)) (fill none) (layer "F.CrtYd") (tstamp 3acbda72-321a-4398-b703-fab6fa906d77))
  (fp_line (start -4 -3.5) (end -4 4)
    (stroke (width 0.1) (type solid)) (layer "F.Fab") (tstamp a92fd50a-3a49-4049-a0a6-c494c243eaa3))
  (fp_line (start -4 4) (end 4 4)
    (stroke (width 0.1) (type solid)) (layer "F.Fab") (tstamp ce946f6a-8295-4393-a765-d0780f6b8a60))
  (fp_line (start -3.5 -4) (end -4 -3.5)
    (stroke (width 0.1) (type solid)) (layer "F.Fab") (tstamp 30f9efd6-69fd-42fb-ad7b-76b15c74e9cb))
  (fp_line (start 4 -4) (end -3.5 -4)
    (stroke (width 0.1) (type solid)) (layer "F.Fab") (tstamp b59fdd73-f07a-4891-9aac-ec61483ee222))
  (fp_line (start 4 4) (end 4 -4)
    (stroke (width 0.1) (type solid)) (layer "F.Fab") (tstamp 9b6a48eb-6dec-44f8-a733-e90f792b4c4a))
  (pad "A1" smd circle (at -3.5 -3.5) (size 0.25 0.25) (layers "F.Cu" "F.Paste" "F.Mask") (tstamp cc04fe75-64ca-4e12-987c-98e59a8c6eff))
  (pad "A2" smd circle (at -3 -3.5) (size 0.25 0.25) (layers "F.Cu" "F.Paste" "F.Mask") (tstamp 6974d713-a961-4913-9a61-7bc54d28d235))
  (pad "A3" smd circle (at -2.5 -3.5) (size 0.25 0.25) (layers "F.Cu" "F.Paste" "F.Mask") (tstamp 2448b789-5964-4a35-8293-a15d8ed6f2a2))
  (pad "A5" smd circle (at -1.5 -3.5) (size 0.25 0.25) (layers "F.Cu" "F.Paste" "F.Mask") (tstamp 84d3ccf4-6f23-4144-a5f1-30ad5132ba8f))
  (pad "A7" smd circle (at -0.5 -3.5) (size 0.25 0.25) (layers "F.Cu" "F.Paste" "F.Mask") (tstamp 648ed62e-051a-4a53-b416-94af48743d96))
  (pad "A9" smd circle (at 0.5 -3.5) (size 0.25 0.25) (layers "F.Cu" "F.Paste" "F.Mask") (tstamp ee86b5a4-89ee-42da-a2ca-d2a81a5b690c))
  (pad "A11" smd circle (at 1.5 -3.5) (size 0.25 0.25) (layers "F.Cu" "F.Paste" "F.Mask") (tstamp 296dfe2b-1923-414d-a1bf-4ef201b41f43))
  (pad "A13" smd circle (at 2.5 -3.5) (size 0.25 0.25) (layers "F.Cu" "F.Paste" "F.Mask") (tstamp 0a42b290-be9a-41e3-8536-f0a884e46c14))
  (pad "A14" smd circle (at 3 -3.5) (size 0.25 0.25) (layers "F.Cu" "F.Paste" "F.Mask") (tstamp 098c9934-abaa-41ea-8c28-2356637dc097))
  (pad "A15" smd circle (at 3.5 -3.5) (size 0.25 0.25) (layers "F.Cu" "F.Paste" "F.Mask") (tstamp 13fb2c93-8c36-43e5-a05c-2f92bf35d213))
  (pad "B1" smd circle (at -3.5 -3) (size 0.25 0.25) (layers "F.Cu" "F.Paste" "F.Mask") (tstamp 132d290c-417b-4ab4-9e65-a8777d0b68c7))
  (pad "B2" smd circle (at -3 -3) (size 0.25 0.25) (layers "F.Cu" "F.Paste" "F.Mask") (tstamp 168a22cd-6e97-4efe-a7e0-a3900cec721f))
  (pad "B3" smd circle (at -2.5 -3) (size 0.25 0.25) (layers "F.Cu" "F.Paste" "F.Mask") (tstamp 5ec4c0d1-87e9-4dab-8bd1-1fa90451ffd7))
  (pad "B4" smd circle (at -2 -3) (size 0.25 0.25) (layers "F.Cu" "F.Paste" "F.Mask") (tstamp b5e5ea7a-0a02-46c7-9a7d-2619c25460be))
  (pad "B5" smd circle (at -1.5 -3) (size 0.25 0.25) (layers "F.Cu" "F.Paste" "F.Mask") (tstamp e5b8e3a1-776b-4e1c-a044-b28d2ec8b240))
  (pad "B6" smd circle (at -1 -3) (size 0.25 0.25) (layers "F.Cu" "F.Paste" "F.Mask") (tstamp d49e5252-129c-4c3a-adfa-6ba58da24e08))
  (pad "B7" smd circle (at -0.5 -3) (size 0.25 0.25) (layers "F.Cu" "F.Paste" "F.Mask") (tstamp 3ff80149-500e-4ebf-a850-bf060503f15d))
  (pad "B8" smd circle (at 0 -3) (size 0.25 0.25) (layers "F.Cu" "F.Paste" "F.Mask") (tstamp 2abfcde4-960b-4eca-851c-3fa93463fc04))
  (pad "B9" smd circle (at 0.5 -3) (size 0.25 0.25) (layers "F.Cu" "F.Paste" "F.Mask") (tstamp e51b6f6d-3553-4c84-aa20-dc3f232ca543))
  (pad "B10" smd circle (at 1 -3) (size 0.25 0.25) (layers "F.Cu" "F.Paste" "F.Mask") (tstamp 664c731c-5076-400a-871c-c42abc990159))
  (pad "B11" smd circle (at 1.5 -3) (size 0.25 0.25) (layers "F.Cu" "F.Paste" "F.Mask") (tstamp ece935a0-92ce-4b3b-8fa9-1b58328938a4))
  (pad "B12" smd circle (at 2 -3) (size 0.25 0.25) (layers "F.Cu" "F.Paste" "F.Mask") (tstamp 4b007070-785a-4793-91a4-b5c7e398a4c8))
  (pad "B13" smd circle (at 2.5 -3) (size 0.25 0.25) (layers "F.Cu" "F.Paste" "F.Mask") (tstamp 44ae1120-9c75-4f47-8314-7d619aab437f))
  (pad "B14" smd circle (at 3 -3) (size 0.25 0.25) (layers "F.Cu" "F.Paste" "F.Mask") (tstamp 32de0766-c799-45f9-bb64-1e8517405d5e))
  (pad "B15" smd circle (at 3.5 -3) (size 0.25 0.25) (layers "F.Cu" "F.Paste" "F.Mask") (tstamp 662f6ce9-8247-400c-8113-77190794109a))
  (pad "C1" smd circle (at -3.5 -2.5) (size 0.25 0.25) (layers "F.Cu" "F.Paste" "F.Mask") (tstamp 01f6295f-7374-4945-af2a-688b86924c32))
  (pad "C2" smd circle (at -3 -2.5) (size 0.25 0.25) (layers "F.Cu" "F.Paste" "F.Mask") (tstamp adc64773-bb11-416c-b10b-3ae8eab292f0))
  (pad "C8" smd circle (at 0 -2.5) (size 0.25 0.25) (layers "F.Cu" "F.Paste" "F.Mask") (tstamp 4be7f750-bf95-4f35-bcae-c07ef21900fe))
  (pad "C14" smd circle (at 3 -2.5) (size 0.25 0.25) (layers "F.Cu" "F.Paste" "F.Mask") (tstamp 1b4fc13e-68a4-4b92-8ce7-083de6adf3b8))
  (pad "C15" smd circle (at 3.5 -2.5) (size 0.25 0.25) (layers "F.Cu" "F.Paste" "F.Mask") (tstamp dddef45f-b192-466e-b5e4-6c5194be1b87))
  (pad "D2" smd circle (at -3 -2) (size 0.25 0.25) (layers "F.Cu" "F.Paste" "F.Mask") (tstamp 10d976c6-361a-479e-8786-2e974c0308f3))
  (pad "D4" smd circle (at -2 -2) (size 0.25 0.25) (layers "F.Cu" "F.Paste" "F.Mask") (tstamp 66ff3ec5-815b-45b7-9f5e-01d1769f9700))
  (pad "D5" smd circle (at -1.5 -2) (size 0.25 0.25) (layers "F.Cu" "F.Paste" "F.Mask") (tstamp 86127557-adfb-4e03-a04e-0123cc3d9adc))
  (pad "D6" smd circle (at -1 -2) (size 0.25 0.25) (layers "F.Cu" "F.Paste" "F.Mask") (tstamp 8575aad1-74f4-4016-9673-b02600b04548))
  (pad "D7" smd circle (at -0.5 -2) (size 0.25 0.25) (layers "F.Cu" "F.Paste" "F.Mask") (tstamp 0e2fe18e-6566-402e-b6a6-06d0e7521a2c))
  (pad "D8" smd circle (at 0 -2) (size 0.25 0.25) (layers "F.Cu" "F.Paste" "F.Mask") (tstamp bd607822-e418-4174-b263-433dca2ea2ac))
  (pad "D9" smd circle (at 0.5 -2) (size 0.25 0.25) (layers "F.Cu" "F.Paste" "F.Mask") (tstamp 0f1ae8c4-cf4c-4a9c-9830-847572847948))
  (pad "D10" smd circle (at 1 -2) (size 0.25 0.25) (layers "F.Cu" "F.Paste" "F.Mask") (tstamp a23d0556-0b0b-4d12-bce9-1e9983ec35f8))
  (pad "D11" smd circle (at 1.5 -2) (size 0.25 0.25) (layers "F.Cu" "F.Paste" "F.Mask") (tstamp 0643141c-cf4e-4b5d-a28e-79948505ba53))
  (pad "D12" smd circle (at 2 -2) (size 0.25 0.25) (layers "F.Cu" "F.Paste" "F.Mask") (tstamp 65905b2e-dabe-4fc9-b43f-adbb1014c60d))
  (pad "D14" smd circle (at 3 -2) (size 0.25 0.25) (layers "F.Cu" "F.Paste" "F.Mask") (tstamp 942013ce-9293-48d9-b023-09fa437c7e7a))
  (pad "E1" smd circle (at -3.5 -1.5) (size 0.25 0.25) (layers "F.Cu" "F.Paste" "F.Mask") (tstamp 78ce959d-b25e-4545-960c-cf44a61a3d21))
  (pad "E2" smd circle (at -3 -1.5) (size 0.25 0.25) (layers "F.Cu" "F.Paste" "F.Mask") (tstamp fbeb1fdc-d0c6-4da9-8807-0a9b40371c82))
  (pad "E4" smd circle (at -2 -1.5) (size 0.25 0.25) (layers "F.Cu" "F.Paste" "F.Mask") (tstamp 3ff64bf2-d169-432a-9b6c-1534e2fe95a8))
  (pad "E5" smd circle (at -1.5 -1.5) (size 0.25 0.25) (layers "F.Cu" "F.Paste" "F.Mask") (tstamp ab1edf68-8326-4669-804a-7c3a4481f6bf))
  (pad "E6" smd circle (at -1 -1.5) (size 0.25 0.25) (layers "F.Cu" "F.Paste" "F.Mask") (tstamp bb01d247-5f16-4540-8ac4-06ac8efd6bac))
  (pad "E7" smd circle (at -0.5 -1.5) (size 0.25 0.25) (layers "F.Cu" "F.Paste" "F.Mask") (tstamp fc5950dd-27f7-4c8e-bd25-f7cadba7a822))
  (pad "E8" smd circle (at 0 -1.5) (size 0.25 0.25) (layers "F.Cu" "F.Paste" "F.Mask") (tstamp 7c23d6dd-1eda-43f9-bbee-3758bcd7b4f6))
  (pad "E9" smd circle (at 0.5 -1.5) (size 0.25 0.25) (layers "F.Cu" "F.Paste" "F.Mask") (tstamp 73f767f2-fcb0-4443-a682-29cdcbad972b))
  (pad "E10" smd circle (at 1 -1.5) (size 0.25 0.25) (layers "F.Cu" "F.Paste" "F.Mask") (tstamp 7bde2d80-96e8-43d2-a875-d2401ee7b805))
  (pad "E11" smd circle (at 1.5 -1.5) (size 0.25 0.25) (layers "F.Cu" "F.Paste" "F.Mask") (tstamp 4d5eaad6-6b2c-4e72-8459-cde98a270c02))
  (pad "E12" smd circle (at 2 -1.5) (size 0.25 0.25) (layers "F.Cu" "F.Paste" "F.Mask") (tstamp 32d80d06-0be8-439b-a3b8-c80b11b435c8))
  (pad "E14" smd circle (at 3 -1.5) (size 0.25 0.25) (layers "F.Cu" "F.Paste" "F.Mask") (tstamp a896bd91-82b1-4955-9c38-6a72cb5404cb))
  (pad "E15" smd circle (at 3.5 -1.5) (size 0.25 0.25) (layers "F.Cu" "F.Paste" "F.Mask") (tstamp 6585da74-a621-4bae-b16e-3d50ef8dcf26))
  (pad "F2" smd circle (at -3 -1) (size 0.25 0.25) (layers "F.Cu" "F.Paste" "F.Mask") (tstamp 18cd8d74-9b71-42d2-86e7-65f519864bc3))
  (pad "F4" smd circle (at -2 -1) (size 0.25 0.25) (layers "F.Cu" "F.Paste" "F.Mask") (tstamp 5c88f0f7-44b4-4961-a163-945cfbce8217))
  (pad "F5" smd circle (at -1.5 -1) (size 0.25 0.25) (layers "F.Cu" "F.Paste" "F.Mask") (tstamp 88805139-6dd5-457b-b9fa-704486fe4c77))
  (pad "F11" smd circle (at 1.5 -1) (size 0.25 0.25) (layers "F.Cu" "F.Paste" "F.Mask") (tstamp 7dcff8db-732e-41f4-95ae-7309ccd5dfd8))
  (pad "F12" smd circle (at 2 -1) (size 0.25 0.25) (layers "F.Cu" "F.Paste" "F.Mask") (tstamp 89338acc-a3aa-4adf-ba1a-8228e4c26c57))
  (pad "F14" smd circle (at 3 -1) (size 0.25 0.25) (layers "F.Cu" "F.Paste" "F.Mask") (tstamp 3d6ece9a-b431-4f98-8e30-d89f6f0a3648))
  (pad "G1" smd circle (at -3.5 -0.5) (size 0.25 0.25) (layers "F.Cu" "F.Paste" "F.Mask") (tstamp f9ea9bac-d884-4bfc-a573-ddb6ca3f78c1))
  (pad "G2" smd circle (at -3 -0.5) (size 0.25 0.25) (layers "F.Cu" "F.Paste" "F.Mask") (tstamp 4fa25141-693e-4f4a-9a77-b8de2c4a03c7))
  (pad "G4" smd circle (at -2 -0.5) (size 0.25 0.25) (layers "F.Cu" "F.Paste" "F.Mask") (tstamp 5ef4e7bb-2d9f-4cd0-9730-65ccd09af47a))
  (pad "G5" smd circle (at -1.5 -0.5) (size 0.25 0.25) (layers "F.Cu" "F.Paste" "F.Mask") (tstamp 36014e69-5b05-46ca-9b90-f3bdda9f90cf))
  (pad "G7" smd circle (at -0.5 -0.5) (size 0.25 0.25) (layers "F.Cu" "F.Paste" "F.Mask") (tstamp e273cdfd-7fcb-48dc-bccf-3207fe85e9e2))
  (pad "G8" smd circle (at 0 -0.5) (size 0.25 0.25) (layers "F.Cu" "F.Paste" "F.Mask") (tstamp 43fdcc86-1cee-4d61-b96c-2823c62361cf))
  (pad "G9" smd circle (at 0.5 -0.5) (size 0.25 0.25) (layers "F.Cu" "F.Paste" "F.Mask") (tstamp f417c8fe-0da6-4b79-bd4c-dd8188d9d0e2))
  (pad "G11" smd circle (at 1.5 -0.5) (size 0.25 0.25) (layers "F.Cu" "F.Paste" "F.Mask") (tstamp 609197ae-8065-40df-93b6-dd8922afdaf2))
  (pad "G12" smd circle (at 2 -0.5) (size 0.25 0.25) (layers "F.Cu" "F.Paste" "F.Mask") (tstamp f0f51306-205b-49f4-8e28-17abe12ce359))
  (pad "G14" smd circle (at 3 -0.5) (size 0.25 0.25) (layers "F.Cu" "F.Paste" "F.Mask") (tstamp 34efa8f4-7f8b-4d8b-8de9-a62bfca9c95d))
  (pad "G15" smd circle (at 3.5 -0.5) (size 0.25 0.25) (layers "F.Cu" "F.Paste" "F.Mask") (tstamp 0862da7e-b230-40f2-b89f-2ee3286de5ac))
  (pad "H2" smd circle (at -3 0) (size 0.25 0.25) (layers "F.Cu" "F.Paste" "F.Mask") (tstamp c84dd57d-5176-481f-8365-5efe934ad947))
  (pad "H3" smd circle (at -2.5 0) (size 0.25 0.25) (layers "F.Cu" "F.Paste" "F.Mask") (tstamp bb6cbfd6-f124-4a2e-9ce5-0352b46828c5))
  (pad "H4" smd circle (at -2 0) (size 0.25 0.25) (layers "F.Cu" "F.Paste" "F.Mask") (tstamp e999ff33-d59c-4583-9e8e-ad065e3db486))
  (pad "H5" smd circle (at -1.5 0) (size 0.25 0.25) (layers "F.Cu" "F.Paste" "F.Mask") (tstamp fa4b2313-877b-42ad-b154-ec80be9dc973))
  (pad "H7" smd circle (at -0.5 0) (size 0.25 0.25) (layers "F.Cu" "F.Paste" "F.Mask") (tstamp e96dbd93-c9d2-4a55-9ad3-f95b348b339e))
  (pad "H8" smd circle (at 0 0) (size 0.25 0.25) (layers "F.Cu" "F.Paste" "F.Mask") (tstamp d434655d-fdb5-464d-9525-7ea1498e35d6))
  (pad "H9" smd circle (at 0.5 0) (size 0.25 0.25) (layers "F.Cu" "F.Paste" "F.Mask") (tstamp 16bb440c-652d-4757-b549-702825b65b5c))
  (pad "H11" smd circle (at 1.5 0) (size 0.25 0.25) (layers "F.Cu" "F.Paste" "F.Mask") (tstamp 27d1001c-b401-4ce5-9e5c-5e20f6bac08e))
  (pad "H12" smd circle (at 2 0) (size 0.25 0.25) (layers "F.Cu" "F.Paste" "F.Mask") (tstamp ffb90fc3-af47-4702-b82f-ed821ac8b8f8))
  (pad "H13" smd circle (at 2.5 0) (size 0.25 0.25) (layers "F.Cu" "F.Paste" "F.Mask") (tstamp 5c5e284a-8a59-4ffb-90ee-00d28f6379b8))
  (pad "H14" smd circle (at 3 0) (size 0.25 0.25) (layers "F.Cu" "F.Paste" "F.Mask") (tstamp df34cab8-36b7-4868-9348-a4ed78a9204a))
  (pad "J1" smd circle (at -3.5 0.5) (size 0.25 0.25) (layers "F.Cu" "F.Paste" "F.Mask") (tstamp 1c0ec51b-0422-461e-a35c-8e8aa389548d))
  (pad "J2" smd circle (at -3 0.5) (size 0.25 0.25) (layers "F.Cu" "F.Paste" "F.Mask") (tstamp 4e1d1d97-c194-4143-a7df-8f65a4ecb969))
  (pad "J4" smd circle (at -2 0.5) (size 0.25 0.25) (layers "F.Cu" "F.Paste" "F.Mask") (tstamp 2bba9f51-0acb-48e7-b210-e926d9abc917))
  (pad "J5" smd circle (at -1.5 0.5) (size 0.25 0.25) (layers "F.Cu" "F.Paste" "F.Mask") (tstamp 31971e90-3cb6-44a2-95f1-5f01a1c71d09))
  (pad "J7" smd circle (at -0.5 0.5) (size 0.25 0.25) (layers "F.Cu" "F.Paste" "F.Mask") (tstamp 0a56c9be-00d8-46b5-afd1-caa8b12bef0a))
  (pad "J8" smd circle (at 0 0.5) (size 0.25 0.25) (layers "F.Cu" "F.Paste" "F.Mask") (tstamp c3c293f0-4b3b-4246-a0c7-52a4395e3bde))
  (pad "J9" smd circle (at 0.5 0.5) (size 0.25 0.25) (layers "F.Cu" "F.Paste" "F.Mask") (tstamp 911ecd1c-4204-4e70-851b-4944737a4cba))
  (pad "J11" smd circle (at 1.5 0.5) (size 0.25 0.25) (layers "F.Cu" "F.Paste" "F.Mask") (tstamp eb899ba9-8c88-4cf8-9320-066c79644f45))
  (pad "J12" smd circle (at 2 0.5) (size 0.25 0.25) (layers "F.Cu" "F.Paste" "F.Mask") (tstamp 31aaabef-1b35-4271-840a-33c61954932b))
  (pad "J14" smd circle (at 3 0.5) (size 0.25 0.25) (layers "F.Cu" "F.Paste" "F.Mask") (tstamp af8e2321-94f8-4621-99f0-2fe1d0aed636))
  (pad "J15" smd circle (at 3.5 0.5) (size 0.25 0.25) (layers "F.Cu" "F.Paste" "F.Mask") (tstamp c2b694b8-722b-4c11-be79-1e8535b8a576))
  (pad "K2" smd circle (at -3 1) (size 0.25 0.25) (layers "F.Cu" "F.Paste" "F.Mask") (tstamp b9e1c075-23d2-40f1-b66f-74fd91c9ee0f))
  (pad "K4" smd circle (at -2 1) (size 0.25 0.25) (layers "F.Cu" "F.Paste" "F.Mask") (tstamp ebfe9948-0a54-417e-a3ef-e4c9687d6eb8))
  (pad "K5" smd circle (at -1.5 1) (size 0.25 0.25) (layers "F.Cu" "F.Paste" "F.Mask") (tstamp e34f0604-338f-431a-8ea9-e6969a122582))
  (pad "K11" smd circle (at 1.5 1) (size 0.25 0.25) (layers "F.Cu" "F.Paste" "F.Mask") (tstamp 8edee96a-8a95-42e5-8f91-be9ba964fccf))
  (pad "K12" smd circle (at 2 1) (size 0.25 0.25) (layers "F.Cu" "F.Paste" "F.Mask") (tstamp d80b82ea-5ac6-4de0-809e-46bd69a35746))
  (pad "K14" smd circle (at 3 1) (size 0.25 0.25) (layers "F.Cu" "F.Paste" "F.Mask") (tstamp 224903c1-d2ad-4be8-8ef4-a5cf9fb8cd14))
  (pad "L1" smd circle (at -3.5 1.5) (size 0.25 0.25) (layers "F.Cu" "F.Paste" "F.Mask") (tstamp edea7e62-810f-4f86-83c8-bcfa64a9df3b))
  (pad "L2" smd circle (at -3 1.5) (size 0.25 0.25) (layers "F.Cu" "F.Paste" "F.Mask") (tstamp 30e19146-5223-4e4c-8b97-765257bd9db4))
  (pad "L4" smd circle (at -2 1.5) (size 0.25 0.25) (layers "F.Cu" "F.Paste" "F.Mask") (tstamp 4c4ae7b5-ca67-442f-ae4f-a0261e52f12e))
  (pad "L5" smd circle (at -1.5 1.5) (size 0.25 0.25) (layers "F.Cu" "F.Paste" "F.Mask") (tstamp 973213d1-6ab2-4b4e-a7e8-b6f330e182c1))
  (pad "L6" smd circle (at -1 1.5) (size 0.25 0.25) (layers "F.Cu" "F.Paste" "F.Mask") (tstamp b3ea8c85-8ed8-42c4-9b0a-17b28ca997e2))
  (pad "L7" smd circle (at -0.5 1.5) (size 0.25 0.25) (layers "F.Cu" "F.Paste" "F.Mask") (tstamp 765aaa92-0407-456d-b357-c31748c2e583))
  (pad "L8" smd circle (at 0 1.5) (size 0.25 0.25) (layers "F.Cu" "F.Paste" "F.Mask") (tstamp e954a4e7-146a-4933-8943-d1fb553ecfd2))
  (pad "L9" smd circle (at 0.5 1.5) (size 0.25 0.25) (layers "F.Cu" "F.Paste" "F.Mask") (tstamp c01c5827-329f-451d-a503-ea5e235a4454))
  (pad "L10" smd circle (at 1 1.5) (size 0.25 0.25) (layers "F.Cu" "F.Paste" "F.Mask") (tstamp e1cb43f7-1519-40e7-8b0b-3845e40d15dc))
  (pad "L11" smd circle (at 1.5 1.5) (size 0.25 0.25) (layers "F.Cu" "F.Paste" "F.Mask") (tstamp 1259fc5f-e14a-4829-a67f-96d24e464e62))
  (pad "L12" smd circle (at 2 1.5) (size 0.25 0.25) (layers "F.Cu" "F.Paste" "F.Mask") (tstamp a1120f9f-e650-4bf0-b57d-b86a1fd24137))
  (pad "L14" smd circle (at 3 1.5) (size 0.25 0.25) (layers "F.Cu" "F.Paste" "F.Mask") (tstamp 26f03915-8930-40a4-8aa7-fc0394d57c0f))
  (pad "L15" smd circle (at 3.5 1.5) (size 0.25 0.25) (layers "F.Cu" "F.Paste" "F.Mask") (tstamp b166c773-5eeb-4ca5-b1ee-08e389fc20ab))
  (pad "M2" smd circle (at -3 2) (size 0.25 0.25) (layers "F.Cu" "F.Paste" "F.Mask") (tstamp b17d4847-5150-4649-8232-95929529af8d))
  (pad "M4" smd circle (at -2 2) (size 0.25 0.25) (layers "F.Cu" "F.Paste" "F.Mask") (tstamp 69bb934b-1fcf-454a-90e2-b84c3bf6ddbb))
  (pad "M5" smd circle (at -1.5 2) (size 0.25 0.25) (layers "F.Cu" "F.Paste" "F.Mask") (tstamp 2237e794-7f58-4332-bbbd-093ae5c97a97))
  (pad "M6" smd circle (at -1 2) (size 0.25 0.25) (layers "F.Cu" "F.Paste" "F.Mask") (tstamp a661b535-26ee-4a0f-ba8d-bd59b92ebf64))
  (pad "M7" smd circle (at -0.5 2) (size 0.25 0.25) (layers "F.Cu" "F.Paste" "F.Mask") (tstamp 62d210f6-8dea-4a81-9c1b-e80388d7f67b))
  (pad "M8" smd circle (at 0 2) (size 0.25 0.25) (layers "F.Cu" "F.Paste" "F.Mask") (tstamp 9eaa37d9-3bd6-4822-9890-a06410597450))
  (pad "M9" smd circle (at 0.5 2) (size 0.25 0.25) (layers "F.Cu" "F.Paste" "F.Mask") (tstamp bf030638-eafb-4a8c-a310-634e44788536))
  (pad "M10" smd circle (at 1 2) (size 0.25 0.25) (layers "F.Cu" "F.Paste" "F.Mask") (tstamp 05992dba-3a9c-49a6-854b-19ca6cf91972))
  (pad "M11" smd circle (at 1.5 2) (size 0.25 0.25) (layers "F.Cu" "F.Paste" "F.Mask") (tstamp 72e033e6-5250-4bab-b2a0-9ea728ebc862))
  (pad "M12" smd circle (at 2 2) (size 0.25 0.25) (layers "F.Cu" "F.Paste" "F.Mask") (tstamp f69b1f8f-9685-4069-a8d2-c75d9fcd76ea))
  (pad "M14" smd circle (at 3 2) (size 0.25 0.25) (layers "F.Cu" "F.Paste" "F.Mask") (tstamp 6bf2fed7-c5a3-4d49-8676-875645c5df40))
  (pad "N1" smd circle (at -3.5 2.5) (size 0.25 0.25) (layers "F.Cu" "F.Paste" "F.Mask") (tstamp 0e07e83e-ed3a-4537-87ec-ab0c93b499bf))
  (pad "N2" smd circle (at -3 2.5) (size 0.25 0.25) (layers "F.Cu" "F.Paste" "F.Mask") (tstamp d2b6c345-b971-40e0-87fa-7f0e1f2be5f3))
  (pad "N8" smd circle (at 0 2.5) (size 0.25 0.25) (layers "F.Cu" "F.Paste" "F.Mask") (tstamp 9f887ace-f7f3-4b8f-8605-22fcc24b66f7))
  (pad "N14" smd circle (at 3 2.5) (size 0.25 0.25) (layers "F.Cu" "F.Paste" "F.Mask") (tstamp 6bccbc23-ed8e-467d-a824-94e815aa057f))
  (pad "N15" smd circle (at 3.5 2.5) (size 0.25 0.25) (layers "F.Cu" "F.Paste" "F.Mask") (tstamp 4fb3bc9f-956a-43d3-a459-6ae47150b17a))
  (pad "P1" smd circle (at -3.5 3) (size 0.25 0.25) (layers "F.Cu" "F.Paste" "F.Mask") (tstamp 6fdc8c76-1a13-40a9-b3c4-5c8369e2e72e))
  (pad "P2" smd circle (at -3 3) (size 0.25 0.25) (layers "F.Cu" "F.Paste" "F.Mask") (tstamp 4fd98149-1a5d-46fd-9b8d-aa614b338077))
  (pad "P3" smd circle (at -2.5 3) (size 0.25 0.25) (layers "F.Cu" "F.Paste" "F.Mask") (tstamp 5c702b8f-de33-4638-97df-e8b38c0bb6e4))
  (pad "P4" smd circle (at -2 3) (size 0.25 0.25) (layers "F.Cu" "F.Paste" "F.Mask") (tstamp a34325a7-eae4-4342-81f2-f698f6592c9e))
  (pad "P5" smd circle (at -1.5 3) (size 0.25 0.25) (layers "F.Cu" "F.Paste" "F.Mask") (tstamp 9864ea81-b7a1-4915-9370-5e4773e82927))
  (pad "P6" smd circle (at -1 3) (size 0.25 0.25) (layers "F.Cu" "F.Paste" "F.Mask") (tstamp 8897fd37-837e-445d-9c04-23613e292f68))
  (pad "P7" smd circle (at -0.5 3) (size 0.25 0.25) (layers "F.Cu" "F.Paste" "F.Mask") (tstamp 7f07ff99-959a-4e81-8881-be0f52e1f77b))
  (pad "P8" smd circle (at 0 3) (size 0.25 0.25) (layers "F.Cu" "F.Paste" "F.Mask") (tstamp f3f2dc2c-47c9-4bdf-8a6b-8e4303b439d0))
  (pad "P9" smd circle (at 0.5 3) (size 0.25 0.25) (layers "F.Cu" "F.Paste" "F.Mask") (tstamp 8fa2c0f2-779a-4cb2-a0a4-d95df323b178))
  (pad "P10" smd circle (at 1 3) (size 0.25 0.25) (layers "F.Cu" "F.Paste" "F.Mask") (tstamp e3b9eb1c-a660-4a79-86ce-b8a2c795479a))
  (pad "P11" smd circle (at 1.5 3) (size 0.25 0.25) (layers "F.Cu" "F.Paste" "F.Mask") (tstamp d9ba6fef-5a08-478f-a3f7-590abb1cafe1))
  (pad "P12" smd circle (at 2 3) (size 0.25 0.25) (layers "F.Cu" "F.Paste" "F.Mask") (tstamp 441d8623-9503-44f0-b81c-95307226ac03))
  (pad "P13" smd circle (at 2.5 3) (size 0.25 0.25) (layers "F.Cu" "F.Paste" "F.Mask") (tstamp 6711d177-49cb-4075-a58e-d20829411eb0))
  (pad "P14" smd circle (at 3 3) (size 0.25 0.25) (layers "F.Cu" "F.Paste" "F.Mask") (tstamp 0bfbe2ab-431c-4f4e-8baa-90fc84f28321))
  (pad "P15" smd circle (at 3.5 3) (size 0.25 0.25) (layers "F.Cu" "F.Paste" "F.Mask") (tstamp 61f73412-48e8-43ac-a557-260e609f74bf))
  (pad "R1" smd circle (at -3.5 3.5) (size 0.25 0.25) (layers "F.Cu" "F.Paste" "F.Mask") (tstamp 5fce21c2-2056-4bc6-a707-a1f35c3387b7))
  (pad "R2" smd circle (at -3 3.5) (size 0.25 0.25) (layers "F.Cu" "F.Paste" "F.Mask") (tstamp 86791520-f222-43c3-9fc3-047d40638bbc))
  (pad "R3" smd circle (at -2.5 3.5) (size 0.25 0.25) (layers "F.Cu" "F.Paste" "F.Mask") (tstamp 0db27f6a-b8b6-49c6-8ecc-22de8dd77c44))
  (pad "R5" smd circle (at -1.5 3.5) (size 0.25 0.25) (layers "F.Cu" "F.Paste" "F.Mask") (tstamp 69e487ce-0a0f-4010-9c22-49ea5f054567))
  (pad "R7" smd circle (at -0.5 3.5) (size 0.25 0.25) (layers "F.Cu" "F.Paste" "F.Mask") (tstamp eeb10b9c-d4f7-43d6-9f4d-815bb11f320e))
  (pad "R9" smd circle (at 0.5 3.5) (size 0.25 0.25) (layers "F.Cu" "F.Paste" "F.Mask") (tstamp 10320021-069b-4e5e-a9a1-baaad9075c5a))
  (pad "R11" smd circle (at 1.5 3.5) (size 0.25 0.25) (layers "F.Cu" "F.Paste" "F.Mask") (tstamp 676b3d03-44f7-45f1-8a36-59c0f9036ac7))
  (pad "R13" smd circle (at 2.5 3.5) (size 0.25 0.25) (layers "F.Cu" "F.Paste" "F.Mask") (tstamp 9d89cc13-555c-4b79-b2cc-248e25da752c))
  (pad "R14" smd circle (at 3 3.5) (size 0.25 0.25) (layers "F.Cu" "F.Paste" "F.Mask") (tstamp c61b128f-847d-4751-abc8-13d413ee47d7))
  (pad "R15" smd circle (at 3.5 3.5) (size 0.25 0.25) (layers "F.Cu" "F.Paste" "F.Mask") (tstamp 43a695eb-4eaa-4fc5-98be-7ca7a626f814))
  (model "${KICAD6_3DMODEL_DIR}/Package_BGA.3dshapes/BGA-153_8.0x8.0mm_Layout15x15_P0.5mm_Ball0.3mm_Pad0.25mm_NSMD.wrl"
    (offset (xyz 0 0 0))
    (scale (xyz 1 1 1))
    (rotate (xyz 0 0 0))
  )
)
