(footprint "Maxim_WLP-9_1.595x1.415_Layout3x3_P0.4mm_Ball0.27mm_Pad0.25mm_NSMD" (version 20221018) (generator pcbnew)
  (layer "F.Cu")
  (descr "Maxim_WLP-9 W91C1+1 https://pdfserv.maximintegrated.com/package_dwgs/21-0459.PDF")
  (tags "Maxim_WLP-9")
  (attr smd)
  (fp_text reference "REF**" (at 0 -2.5) (layer "F.SilkS")
      (effects (font (size 1 1) (thickness 0.15)))
    (tstamp bc9a0c47-558c-407d-9ad5-3019fe177509)
  )
  (fp_text value "Maxim_WLP-9_1.595x1.415_Layout3x3_P0.4mm_Ball0.27mm_Pad0.25mm_NSMD" (at 0.05 2.45) (layer "F.Fab")
      (effects (font (size 1 1) (thickness 0.15)))
    (tstamp 5339dcd7-bcb4-4086-bb51-95f7d3cb5701)
  )
  (fp_text user "${REFERENCE}" (at 0 1.3) (layer "F.Fab")
      (effects (font (size 0.5 0.5) (thickness 0.075)))
    (tstamp 6e43367d-7ab0-4cf4-815c-6211b421eb4a)
  )
  (fp_line (start -0.95 -0.53) (end -0.95 0.85)
    (stroke (width 0.1) (type solid)) (layer "F.SilkS") (tstamp edc494be-4560-43cb-8fba-2b3050028e07))
  (fp_line (start -0.95 0.85) (end 0.95 0.85)
    (stroke (width 0.1) (type solid)) (layer "F.SilkS") (tstamp a0729931-e57b-4b22-8d66-5a32c0b21af2))
  (fp_line (start -0.63 -0.85) (end 0.95 -0.85)
    (stroke (width 0.1) (type solid)) (layer "F.SilkS") (tstamp 415487a6-b7ad-4e11-8b44-d8454a7a917b))
  (fp_line (start 0.95 -0.85) (end 0.95 0.85)
    (stroke (width 0.1) (type solid)) (layer "F.SilkS") (tstamp e870c1ea-dc9a-46a3-9a29-e22ce8ad3962))
  (fp_poly
    (pts
      (xy -0.95 -0.85)
      (xy -1.45 -0.85)
      (xy -0.95 -1.35)
      (xy -0.95 -0.85)
    )

    (stroke (width 0.12) (type solid)) (fill solid) (layer "F.SilkS") (tstamp eb7e6a7c-69b3-4ece-ad7a-9c812b60cc16))
  (fp_line (start -1.8 -1.7) (end 1.8 -1.7)
    (stroke (width 0.05) (type solid)) (layer "F.CrtYd") (tstamp cf9a5d2b-c98d-44ee-9b5e-d980e3ab9eb8))
  (fp_line (start -1.8 1.7) (end -1.8 -1.7)
    (stroke (width 0.05) (type solid)) (layer "F.CrtYd") (tstamp ca28fcf8-ebd3-40d0-b98f-96cfcd927d8b))
  (fp_line (start -1.8 1.7) (end 1.8 1.7)
    (stroke (width 0.05) (type solid)) (layer "F.CrtYd") (tstamp 07910461-25dc-4aef-9370-0f37ce7f571c))
  (fp_line (start 1.8 -1.7) (end 1.8 1.7)
    (stroke (width 0.05) (type solid)) (layer "F.CrtYd") (tstamp 36d2d292-924f-4c6f-b73e-3a90e7df78ff))
  (fp_line (start -0.7975 -0.3075) (end -0.7975 0.7075)
    (stroke (width 0.1) (type solid)) (layer "F.Fab") (tstamp 2f357df2-108f-4e73-b2b2-9522fca992f4))
  (fp_line (start -0.7975 0.7075) (end 0.7975 0.7075)
    (stroke (width 0.1) (type solid)) (layer "F.Fab") (tstamp 7dd59a0b-247a-4a7d-b439-28df20ec8eb2))
  (fp_line (start -0.3975 -0.7075) (end -0.7975 -0.3075)
    (stroke (width 0.1) (type solid)) (layer "F.Fab") (tstamp 5d5929bb-3752-4af4-9f4a-ec71dbab4e8a))
  (fp_line (start -0.3975 -0.7075) (end 0.7975 -0.7075)
    (stroke (width 0.1) (type solid)) (layer "F.Fab") (tstamp 22875049-1d4b-4a4b-b328-3eb9eac097af))
  (fp_line (start 0.7975 -0.7075) (end 0.7975 0.7075)
    (stroke (width 0.1) (type solid)) (layer "F.Fab") (tstamp 50a98286-17e9-4625-ba02-04e5fb8e259b))
  (pad "A1" smd circle (at -0.4 -0.4 90) (size 0.25 0.25) (layers "F.Cu" "F.Paste" "F.Mask") (tstamp 7aa74a31-f47e-4c2a-a722-44dde1011df5))
  (pad "A2" smd circle (at 0 -0.4 90) (size 0.25 0.25) (layers "F.Cu" "F.Paste" "F.Mask") (tstamp 729e9868-265a-4b99-b1a2-1d86dc8a147e))
  (pad "A3" smd circle (at 0.4 -0.4 90) (size 0.25 0.25) (layers "F.Cu" "F.Paste" "F.Mask") (tstamp 3cb7e413-1086-49db-9c8c-5b678b6f19a9))
  (pad "B1" smd circle (at -0.4 0 90) (size 0.25 0.25) (layers "F.Cu" "F.Paste" "F.Mask") (tstamp 3c9b781d-7bab-4609-bc6c-c13512f5b6cb))
  (pad "B2" smd circle (at 0 0 90) (size 0.25 0.25) (layers "F.Cu" "F.Paste" "F.Mask") (tstamp 2dc4e52f-c10b-43b2-875c-c9b334faeadd))
  (pad "B3" smd circle (at 0.4 0 90) (size 0.25 0.25) (layers "F.Cu" "F.Paste" "F.Mask") (tstamp 63296afc-71bd-44be-ba0e-357a66b39272))
  (pad "C1" smd circle (at -0.4 0.4 90) (size 0.25 0.25) (layers "F.Cu" "F.Paste" "F.Mask") (tstamp 1ee9f3e6-8da2-430d-a5ec-143b572dbef5))
  (pad "C2" smd circle (at 0 0.4 90) (size 0.25 0.25) (layers "F.Cu" "F.Paste" "F.Mask") (tstamp 1bef9474-6b6e-4e04-a167-d959ce8b6763))
  (pad "C3" smd circle (at 0.4 0.4 90) (size 0.25 0.25) (layers "F.Cu" "F.Paste" "F.Mask") (tstamp c019c2bf-2eae-4db4-b285-7fa4f7b4931d))
  (model "${KICAD6_3DMODEL_DIR}/Package_BGA.3dshapes/Maxim_WLP-9_1.595x1.415_Layout3x3_P0.4mm_Ball0.27mm_Pad0.25mm_NSMD.wrl"
    (offset (xyz 0 0 0))
    (scale (xyz 1 1 1))
    (rotate (xyz 0 0 0))
  )
)
