(footprint "Infineon_PG-TISON-8-4" (version 20221018) (generator pcbnew)
  (layer "F.Cu")
  (descr "Infineon, PG-TISON-8-4, 5x6x1.15mm, 1.27mm Pitch, Exposed Paddle, https://www.infineon.com/cms/en/product/packages/PG-TISON/PG-TISON-8-4/")
  (tags "tison")
  (solder_paste_margin -0.05)
  (attr smd)
  (fp_text reference "REF**" (at 0 -3.5) (layer "F.SilkS")
      (effects (font (size 1 1) (thickness 0.15)))
    (tstamp 365b1a4e-dbff-4622-ad83-87b6e2fec661)
  )
  (fp_text value "Infineon_PG-TISON-8-4" (at 0 3.5) (layer "F.Fab")
      (effects (font (size 1 1) (thickness 0.15)))
    (tstamp 7117b20c-8097-480e-b527-ec199e23c08c)
  )
  (fp_text user "${REFERENCE}" (at 0 0) (layer "F.Fab")
      (effects (font (size 1 1) (thickness 0.15)))
    (tstamp 5b10b1c7-d82a-4b23-b2fb-036b8bc2837b)
  )
  (fp_line (start 3 -2.61) (end 0 -2.61)
    (stroke (width 0.12) (type solid)) (layer "F.SilkS") (tstamp f45c53df-5a83-4d22-aceb-f83dbbddaa3b))
  (fp_line (start 3 2.61) (end -3 2.61)
    (stroke (width 0.12) (type solid)) (layer "F.SilkS") (tstamp 1d88e110-ac22-49a5-83b7-0d557fb6fedd))
  (fp_line (start -3.52 -2.75) (end 3.52 -2.75)
    (stroke (width 0.05) (type solid)) (layer "F.CrtYd") (tstamp e9b5496d-2244-4aa6-9d51-f32b72431951))
  (fp_line (start -3.52 2.75) (end -3.52 -2.75)
    (stroke (width 0.05) (type solid)) (layer "F.CrtYd") (tstamp 80e564b4-8ba6-4e6b-bc0c-9838c834e79d))
  (fp_line (start 3.52 -2.75) (end 3.52 2.75)
    (stroke (width 0.05) (type solid)) (layer "F.CrtYd") (tstamp 11bc1040-d269-410a-a209-8860b63411d3))
  (fp_line (start 3.52 2.75) (end -3.52 2.75)
    (stroke (width 0.05) (type solid)) (layer "F.CrtYd") (tstamp 39c60736-4591-4a91-aeb8-6b9af9cfbf14))
  (fp_line (start -3 -1.5) (end -3 2.5)
    (stroke (width 0.1) (type solid)) (layer "F.Fab") (tstamp ae7c08bf-a3ae-404e-9879-d91bb4b1aab6))
  (fp_line (start -2 -2.5) (end -3 -1.5)
    (stroke (width 0.1) (type solid)) (layer "F.Fab") (tstamp 8a75e72b-8616-4187-870e-2e42762abaeb))
  (fp_line (start -2 -2.5) (end 3 -2.5)
    (stroke (width 0.1) (type solid)) (layer "F.Fab") (tstamp 50e03205-6f03-4d25-935f-4fb1037cd0d0))
  (fp_line (start 3 -2.5) (end 3 2.5)
    (stroke (width 0.1) (type solid)) (layer "F.Fab") (tstamp b353e9a7-8592-4647-b57f-4def6613270b))
  (fp_line (start 3 2.5) (end -3 2.5)
    (stroke (width 0.1) (type solid)) (layer "F.Fab") (tstamp bf32c041-22fb-4df6-bf1b-492343766209))
  (pad "" smd rect (at -2.87 0.635) (size 0.7 0.35) (layers "F.Paste") (tstamp da52e41d-d969-493b-b7e3-b17496962cab))
  (pad "" smd rect (at -2.87 0.635) (size 0.8 0.45) (layers "F.Mask") (tstamp e4c89109-3997-405f-975a-3bf906af1d2e))
  (pad "" smd rect (at -2.87 1.905) (size 0.7 0.35) (layers "F.Paste") (tstamp 923085b1-22f5-486b-9414-0b309c58d5b9))
  (pad "" smd rect (at -2.87 1.905) (size 0.8 0.45) (layers "F.Mask") (tstamp 8deafbc6-f012-44e0-b068-3a938398c0e0))
  (pad "" smd rect (at -1.57 -1.5) (size 0.8 0.75) (layers "F.Paste") (tstamp 76cd190f-0681-4b3d-a4bc-2c888b0d84f0))
  (pad "" smd rect (at -1.57 -0.5) (size 0.8 0.75) (layers "F.Paste") (tstamp 8562adf6-a94d-41a6-9f83-ec95bd982e99))
  (pad "" smd rect (at -1.57 0) (size 1 4.25) (layers "F.Mask") (tstamp 444f403b-9586-4bdf-b877-36fbd9522ef8))
  (pad "" smd rect (at -1.57 0.5) (size 0.8 0.75) (layers "F.Paste") (tstamp 46206362-4a6f-49b0-b1fb-9c143eb6b4b6))
  (pad "" smd rect (at -1.57 1.5) (size 0.8 0.75) (layers "F.Paste") (tstamp 4c1649d0-b68f-4722-b3ef-f5d85c6605b8))
  (pad "" smd rect (at 0 -1.5) (size 0.85 0.75) (layers "F.Paste") (tstamp 4001f28d-98dc-4c51-bc24-4d61b43cfeca))
  (pad "" smd rect (at 0 -0.5) (size 0.85 0.75) (layers "F.Paste") (tstamp a9f89f31-f519-480e-a828-ef24de28b925))
  (pad "" smd rect (at 0 0.5) (size 0.85 0.75) (layers "F.Paste") (tstamp 5bcbd204-65c5-499d-8137-ede21750884e))
  (pad "" smd rect (at 0 1.5) (size 0.85 0.75) (layers "F.Paste") (tstamp 18ff3254-7163-42c8-b792-3614f4c6c5f2))
  (pad "" smd rect (at 1.1 -0.315) (size 0.85 0.38) (layers "F.Paste") (tstamp bbe8d3c9-e26a-4644-9324-729f0cbc1363))
  (pad "" smd rect (at 1.1 0.5) (size 0.85 0.75) (layers "F.Paste") (tstamp e2cb5c32-c4e2-46c2-b7bd-f0cf9d01f0c3))
  (pad "" smd rect (at 1.1 1.5) (size 0.85 0.75) (layers "F.Paste") (tstamp 00f1396f-e1c6-4d01-b130-8ab7363a7601))
  (pad "" smd rect (at 1.92 -1.905) (size 0.8 0.35) (layers "F.Paste") (tstamp 7f49e64a-d3bd-4240-9089-83f457061512))
  (pad "" smd rect (at 2.87 -1.905) (size 0.7 0.35) (layers "F.Paste") (tstamp 2f4d8620-8ef1-4bc4-aec4-b2c032898534))
  (pad "1" smd rect (at -2.87 -1.905) (size 0.8 0.45) (layers "F.Cu" "F.Paste" "F.Mask") (tstamp f0076bc9-baaf-42c6-9442-58b7d4a7a8c4))
  (pad "2" smd rect (at -2.87 -0.635) (size 0.8 0.45) (layers "F.Cu" "F.Paste" "F.Mask") (tstamp 4b5b649a-4e20-4596-ab85-1116f498d762))
  (pad "3" smd custom (at -1.57 0) (size 1 4.25) (layers "F.Cu")
    (zone_connect 2) (thermal_bridge_angle 45)
    (options (clearance outline) (anchor rect))
    (primitives
      (gr_poly
        (pts
          (xy -0.5 2.13)
          (xy -1.7 2.13)
          (xy -1.7 0.41)
          (xy -0.5 0.41)
        )
        (width 0) (fill yes))
    ) (tstamp 157b7ee4-9c0f-4698-8eb9-109dbccf7ab7))
  (pad "4" smd rect (at 2.87 1.905) (size 0.8 0.45) (layers "F.Cu" "F.Paste" "F.Mask") (tstamp a9e81747-af0d-4cb8-87f3-6345caff947d))
  (pad "5" smd rect (at 2.87 0.635) (size 0.8 0.45) (layers "F.Cu" "F.Paste" "F.Mask") (tstamp 801525c6-9703-4fc6-94fb-343a03515529))
  (pad "6" smd rect (at 2.87 -0.635) (size 0.8 0.45) (layers "F.Cu" "F.Paste" "F.Mask") (tstamp 55b4c63d-3794-41e0-9c4e-2402eadcccad))
  (pad "7" smd rect (at 2.37 -1.905) (size 1.8 0.45) (layers "F.Cu" "F.Mask") (tstamp 0223a092-0796-4026-8f88-da1c0242f99d))
  (pad "8" smd custom (at 0.077 0) (size 1.4 4.25) (layers "F.Cu" "F.Mask")
    (zone_connect 2) (thermal_bridge_angle 45)
    (options (clearance outline) (anchor rect))
    (primitives
      (gr_poly
        (pts
          (xy 1.65 2.125)
          (xy 0.7 2.125)
          (xy 0.7 -0.675)
          (xy 1.65 -0.675)
        )
        (width 0) (fill yes))
    ) (tstamp f53993ff-c6d5-46aa-ac9f-5f388c8e06b3))
  (model "${KICAD6_3DMODEL_DIR}/Package_SON.3dshapes/Infineon_PG-TISON-8-4.wrl"
    (offset (xyz 0 0 0))
    (scale (xyz 1 1 1))
    (rotate (xyz 0 0 0))
  )
)
