(footprint "SOT-886" (version 20221018) (generator pcbnew)
  (layer "F.Cu")
  (descr "SOT-886")
  (tags "SOT-886")
  (attr smd)
  (fp_text reference "REF**" (at 0 -1.7 180) (layer "F.SilkS")
      (effects (font (size 1 1) (thickness 0.15)))
    (tstamp a3e20436-f43e-49da-891c-53e517e841e3)
  )
  (fp_text value "SOT-886" (at 0 1.8 180) (layer "F.Fab")
      (effects (font (size 1 1) (thickness 0.15)))
    (tstamp 3d05c4cd-6860-4118-9400-9fe559c9d1aa)
  )
  (fp_text user "${REFERENCE}" (at 0 0 90) (layer "F.Fab")
      (effects (font (size 0.4 0.4) (thickness 0.0625)))
    (tstamp 70299c17-909e-4b01-a55d-60107fe816fe)
  )
  (fp_line (start -0.65 -0.5) (end -0.65 0.9)
    (stroke (width 0.12) (type solid)) (layer "F.SilkS") (tstamp aa147c1d-d669-4753-885b-076bd56d0800))
  (fp_line (start -0.65 0.9) (end 0.65 0.9)
    (stroke (width 0.12) (type solid)) (layer "F.SilkS") (tstamp b3f1aa99-d648-4247-965d-6a329ae7a3cb))
  (fp_line (start 0.65 -0.9) (end -0.35 -0.9)
    (stroke (width 0.12) (type solid)) (layer "F.SilkS") (tstamp 67fb8d79-3208-44f8-a44e-dc5840a14226))
  (fp_line (start 0.65 0.9) (end 0.65 -0.9)
    (stroke (width 0.12) (type solid)) (layer "F.SilkS") (tstamp f7d7b06d-9517-4bfb-a785-b5e28576531f))
  (fp_line (start -0.75 -1) (end -0.75 1)
    (stroke (width 0.05) (type solid)) (layer "F.CrtYd") (tstamp 4076bccb-8308-4de6-95f9-869f31558523))
  (fp_line (start -0.75 -1) (end 0.75 -1)
    (stroke (width 0.05) (type solid)) (layer "F.CrtYd") (tstamp 934baca0-4d06-4f49-b27d-138cf5cb4703))
  (fp_line (start 0.75 1) (end -0.75 1)
    (stroke (width 0.05) (type solid)) (layer "F.CrtYd") (tstamp a7f0fdea-bfb2-4af2-ae94-98a263522b23))
  (fp_line (start 0.75 1) (end 0.75 -1)
    (stroke (width 0.05) (type solid)) (layer "F.CrtYd") (tstamp b196a6cd-4459-4087-8f0b-70a71283405f))
  (fp_line (start -0.5 -0.45) (end -0.5 0.75)
    (stroke (width 0.1) (type solid)) (layer "F.Fab") (tstamp 1b12fba8-bf68-49ae-bd86-7469ff9ea89b))
  (fp_line (start -0.5 0.75) (end 0.5 0.75)
    (stroke (width 0.1) (type solid)) (layer "F.Fab") (tstamp 1f2c8d03-c9dc-432d-840b-2c86eff0f3bd))
  (fp_line (start -0.2 -0.75) (end -0.5 -0.45)
    (stroke (width 0.1) (type solid)) (layer "F.Fab") (tstamp ac09a3e8-4017-461b-86fb-717bdfb30657))
  (fp_line (start 0.5 -0.75) (end -0.2 -0.75)
    (stroke (width 0.1) (type solid)) (layer "F.Fab") (tstamp b7d8764f-4b24-4125-87dc-c79d02ec613a))
  (fp_line (start 0.5 0.75) (end 0.5 -0.75)
    (stroke (width 0.1) (type solid)) (layer "F.Fab") (tstamp 28fee9c5-00f6-4b8a-ba02-6155d0f4ce5f))
  (pad "1" smd rect (at -0.34 -0.5) (size 0.33 0.27) (layers "F.Cu" "F.Paste" "F.Mask") (tstamp 6a63b232-0d90-484e-90c0-64a591c4bffa))
  (pad "2" smd rect (at -0.34 0) (size 0.33 0.27) (layers "F.Cu" "F.Paste" "F.Mask") (tstamp b9ce1309-fd3b-4b9c-b150-22afabafbb95))
  (pad "3" smd rect (at -0.34 0.5) (size 0.33 0.27) (layers "F.Cu" "F.Paste" "F.Mask") (tstamp 3f36e560-13d7-4be3-808c-a0152861ebb9))
  (pad "4" smd rect (at 0.34 0.5) (size 0.33 0.27) (layers "F.Cu" "F.Paste" "F.Mask") (tstamp 7abf72ef-c1ff-4a5b-a0d4-ff374dbe3356))
  (pad "5" smd rect (at 0.34 0) (size 0.33 0.27) (layers "F.Cu" "F.Paste" "F.Mask") (tstamp c702568e-5ac1-4a52-98a7-835c72b5fbeb))
  (pad "6" smd rect (at 0.34 -0.5) (size 0.33 0.27) (layers "F.Cu" "F.Paste" "F.Mask") (tstamp 9e8f98e7-5f89-468f-a673-569aa2c09a79))
  (model "${KICAD6_3DMODEL_DIR}/Package_TO_SOT_SMD.3dshapes/SOT-886.wrl"
    (offset (xyz 0 0 0))
    (scale (xyz 1 1 1))
    (rotate (xyz 0 0 0))
  )
)
