(footprint "Texas_S-PVSON-N8_ThermalVias" (version 20221018) (generator pcbnew)
  (layer "F.Cu")
  (descr "8-Lead Plastic VSON, 3x3mm Body, 0.65mm Pitch, S-PVSON-N8, http://www.ti.com/lit/ds/symlink/opa2333.pdf")
  (tags "DFN 0.65 S-PVSON-N8")
  (attr smd)
  (fp_text reference "REF**" (at 0 -2.5) (layer "F.SilkS")
      (effects (font (size 1 1) (thickness 0.15)))
    (tstamp 5d6b99d5-a68f-4598-a041-2da4fb7540aa)
  )
  (fp_text value "Texas_S-PVSON-N8_ThermalVias" (at 0 2.6) (layer "F.Fab")
      (effects (font (size 1 1) (thickness 0.15)))
    (tstamp e1225898-dd08-4ef2-b5cd-f68d8e32ec6f)
  )
  (fp_text user "${REFERENCE}" (at 0 0) (layer "F.Fab")
      (effects (font (size 0.7 0.7) (thickness 0.1)))
    (tstamp 6444ccd4-db83-4957-9060-f0560f2a79db)
  )
  (fp_line (start -2 -1.65) (end -0.7 -1.65)
    (stroke (width 0.12) (type solid)) (layer "F.SilkS") (tstamp b675c2c5-0632-47d6-b974-90b0d359c864))
  (fp_line (start -1.65 1.65) (end -1.65 1.45)
    (stroke (width 0.12) (type solid)) (layer "F.SilkS") (tstamp de721756-b5f0-4235-ac64-8d51d869093a))
  (fp_line (start -1.65 1.65) (end -0.7 1.65)
    (stroke (width 0.12) (type solid)) (layer "F.SilkS") (tstamp c538a0a8-98f3-455d-a4a4-63356edd4e78))
  (fp_line (start 0.7 -1.65) (end 1.65 -1.65)
    (stroke (width 0.12) (type solid)) (layer "F.SilkS") (tstamp 7f667a5d-812f-4ffc-ac46-2e1dcfb0f1f8))
  (fp_line (start 0.7 1.65) (end 1.65 1.65)
    (stroke (width 0.12) (type solid)) (layer "F.SilkS") (tstamp 036e60b2-711f-408f-9af5-36a32ab8dba9))
  (fp_line (start 1.65 -1.45) (end 1.65 -1.65)
    (stroke (width 0.12) (type solid)) (layer "F.SilkS") (tstamp 440c0080-dd9f-49d0-b513-1530ebf05a26))
  (fp_line (start 1.65 1.45) (end 1.65 1.65)
    (stroke (width 0.12) (type solid)) (layer "F.SilkS") (tstamp ba4ceff5-caf8-48d4-b61b-9de16fa98a12))
  (fp_line (start -2.1 -1.8) (end -2.1 1.8)
    (stroke (width 0.05) (type solid)) (layer "F.CrtYd") (tstamp c0e07e2a-7ff6-4e6e-aa3b-bc9f99543fba))
  (fp_line (start -2.1 -1.8) (end 2.1 -1.8)
    (stroke (width 0.05) (type solid)) (layer "F.CrtYd") (tstamp 13080ecc-f02a-4fd0-8b41-b49a62521741))
  (fp_line (start -2.1 1.8) (end 2.1 1.8)
    (stroke (width 0.05) (type solid)) (layer "F.CrtYd") (tstamp a5f286bb-0712-48e0-b968-d13183022f5c))
  (fp_line (start 2.1 -1.8) (end 2.1 1.8)
    (stroke (width 0.05) (type solid)) (layer "F.CrtYd") (tstamp 45bc2299-ec98-4acd-a5c8-7607e87349e0))
  (fp_line (start -1.5 1.5) (end -1.5 -0.5)
    (stroke (width 0.1) (type solid)) (layer "F.Fab") (tstamp 7b5cacd4-ab64-49a2-ad7a-330286ba24d1))
  (fp_line (start -0.5 -1.5) (end -1.5 -0.5)
    (stroke (width 0.1) (type solid)) (layer "F.Fab") (tstamp bde56550-6fec-4fdf-8ba7-9208281a5d21))
  (fp_line (start -0.5 -1.5) (end 1.5 -1.5)
    (stroke (width 0.1) (type solid)) (layer "F.Fab") (tstamp b23ac183-e526-4edf-ba91-a0a66d765632))
  (fp_line (start 1.5 -1.5) (end 1.5 1.5)
    (stroke (width 0.1) (type solid)) (layer "F.Fab") (tstamp b757b464-1a51-4827-b223-5f4a89d07b4d))
  (fp_line (start 1.5 1.5) (end -1.5 1.5)
    (stroke (width 0.1) (type solid)) (layer "F.Fab") (tstamp 3acd6d89-5f78-4470-b551-761a1557a5fc))
  (pad "1" smd rect (at -1.75 -0.975) (size 0.3 0.4) (layers "F.Cu" "F.Paste" "F.Mask")
    (solder_paste_margin -0.05) (tstamp 6ad6cdf9-a3af-471c-beeb-d41add496bfe))
  (pad "1" smd oval (at -1.55 -0.975) (size 0.65 0.4) (layers "F.Cu" "F.Paste" "F.Mask")
    (solder_paste_margin -0.05) (tstamp dd888c89-6a80-4f7f-80e1-06b03c930ffd))
  (pad "2" smd rect (at -1.75 -0.325) (size 0.3 0.4) (layers "F.Cu" "F.Paste" "F.Mask")
    (solder_paste_margin -0.05) (tstamp 055e6d66-056a-486c-8ebe-29310c94380c))
  (pad "2" smd oval (at -1.55 -0.325) (size 0.65 0.4) (layers "F.Cu" "F.Paste" "F.Mask")
    (solder_paste_margin -0.05) (tstamp 4dc8464c-0c4b-48fe-ac1f-2960914914e3))
  (pad "3" smd rect (at -1.75 0.325) (size 0.3 0.4) (layers "F.Cu" "F.Paste" "F.Mask")
    (solder_paste_margin -0.05) (tstamp b09c9dff-52a9-496f-b09f-04a1d0921a16))
  (pad "3" smd oval (at -1.55 0.325) (size 0.65 0.4) (layers "F.Cu" "F.Paste" "F.Mask")
    (solder_paste_margin -0.05) (tstamp 7e492c80-06ad-4c50-964c-4480cd6ceb5d))
  (pad "4" smd rect (at -1.75 0.975) (size 0.3 0.4) (layers "F.Cu" "F.Paste" "F.Mask")
    (solder_paste_margin -0.05) (tstamp d7625c4b-6d02-4080-8404-b608017e3976))
  (pad "4" smd oval (at -1.55 0.975) (size 0.65 0.4) (layers "F.Cu" "F.Paste" "F.Mask")
    (solder_paste_margin -0.05) (tstamp 371288c5-144f-416b-9a46-daba5db001aa))
  (pad "5" smd oval (at 1.55 0.975) (size 0.65 0.4) (layers "F.Cu" "F.Paste" "F.Mask")
    (solder_paste_margin -0.05) (tstamp f340ef99-3cc5-4fb0-b1cf-60f7017f7803))
  (pad "5" smd rect (at 1.75 0.975) (size 0.3 0.4) (layers "F.Cu" "F.Paste" "F.Mask")
    (solder_paste_margin -0.05) (tstamp 4b8bda64-5c07-4b55-b088-c82d4d200287))
  (pad "6" smd oval (at 1.55 0.325) (size 0.65 0.4) (layers "F.Cu" "F.Paste" "F.Mask")
    (solder_paste_margin -0.05) (tstamp 098bd98f-7364-4923-bd39-71526e052590))
  (pad "6" smd rect (at 1.75 0.325) (size 0.3 0.4) (layers "F.Cu" "F.Paste" "F.Mask")
    (solder_paste_margin -0.05) (tstamp 62a24cd9-5715-4010-8fca-14ecbc5cf156))
  (pad "7" smd oval (at 1.55 -0.325) (size 0.65 0.4) (layers "F.Cu" "F.Paste" "F.Mask")
    (solder_paste_margin -0.05) (tstamp 043bb6dd-a4c4-41bf-98db-a9a0193f6ff3))
  (pad "7" smd rect (at 1.75 -0.325) (size 0.3 0.4) (layers "F.Cu" "F.Paste" "F.Mask")
    (solder_paste_margin -0.05) (tstamp 432f0c76-8dab-4b6b-9851-a18cc82adc3c))
  (pad "8" smd oval (at 1.55 -0.975) (size 0.65 0.4) (layers "F.Cu" "F.Paste" "F.Mask")
    (solder_paste_margin -0.05) (tstamp 138d50e9-372e-4e88-809f-c437ded157a9))
  (pad "8" smd rect (at 1.75 -0.975) (size 0.3 0.4) (layers "F.Cu" "F.Paste" "F.Mask")
    (solder_paste_margin -0.05) (tstamp fb9d6bf2-faa7-4725-ac64-ce69936be269))
  (pad "9" thru_hole circle (at -0.5 -0.75) (size 0.6 0.6) (drill 0.25) (layers "*.Cu") (tstamp db189a39-297e-4a6d-ac4e-30125d7e9b51))
  (pad "9" thru_hole circle (at -0.5 0.75) (size 0.6 0.6) (drill 0.25) (layers "*.Cu") (tstamp f4bb8942-96a0-430b-b884-0a2797df9add))
  (pad "9" smd rect (at -0.45 -0.625) (size 0.65 1) (layers "F.Cu" "F.Paste" "F.Mask") (tstamp 827a930a-03bd-4986-9c00-bd08532b2930))
  (pad "9" smd rect (at -0.45 0.625) (size 0.65 1) (layers "F.Cu" "F.Paste" "F.Mask") (tstamp 0b0aeb82-0aaa-416a-b0c4-d9a0ae438928))
  (pad "9" thru_hole circle (at 0 0) (size 0.6 0.6) (drill 0.25) (layers "*.Cu") (tstamp 4f440d9a-7647-4bb1-ae61-1fa5f8e69548))
  (pad "9" smd rect (at 0 0) (size 1.65 2.4) (layers "F.Cu" "F.Mask") (tstamp d8f86752-41c5-4d28-a93b-cd20687cab62))
  (pad "9" smd rect (at 0 0) (size 1.65 2.4) (layers "B.Cu") (tstamp 420cd4fd-27fd-47c3-9ebe-2b3715c166b9))
  (pad "9" smd rect (at 0.45 -0.625) (size 0.65 1) (layers "F.Cu" "F.Paste" "F.Mask") (tstamp 753ed8ec-ee18-4910-93e1-b895bcf25cb8))
  (pad "9" smd rect (at 0.45 0.625) (size 0.65 1) (layers "F.Cu" "F.Paste" "F.Mask") (tstamp fd29fb93-720a-45bb-8fdf-57ed0f849782))
  (pad "9" thru_hole circle (at 0.5 -0.75) (size 0.6 0.6) (drill 0.25) (layers "*.Cu") (tstamp f6e7197b-4ec0-438f-bece-7522711c28ff))
  (pad "9" thru_hole circle (at 0.5 0.75) (size 0.6 0.6) (drill 0.25) (layers "*.Cu") (tstamp 676323cf-daa3-4b32-b817-13beaa566853))
  (model "${KICAD6_3DMODEL_DIR}/Package_SON.3dshapes/Texas_S-PVSON-N8.wrl"
    (offset (xyz 0 0 0))
    (scale (xyz 1 1 1))
    (rotate (xyz 0 0 0))
  )
)
