(footprint "WSON-6-1EP_3x3mm_P0.95mm" (version 20221018) (generator pcbnew)
  (layer "F.Cu")
  (descr "WSON6 3*3 MM, 0.95 PITCH; http://www.ti.com/lit/ds/symlink/lmr62421.pdf")
  (tags "WSON6 0.95")
  (attr smd)
  (fp_text reference "REF**" (at 0 -2.575) (layer "F.SilkS")
      (effects (font (size 1 1) (thickness 0.15)))
    (tstamp b2b97f88-6ad9-45f9-875f-3b99f22ff03f)
  )
  (fp_text value "WSON-6-1EP_3x3mm_P0.95mm" (at 0 2.575) (layer "F.Fab")
      (effects (font (size 1 1) (thickness 0.15)))
    (tstamp b0649ee6-9681-4d78-be4a-f81d200fa64d)
  )
  (fp_text user "${REFERENCE}" (at 0 0) (layer "F.Fab")
      (effects (font (size 0.6 0.6) (thickness 0.1)))
    (tstamp 16a93503-9da6-4408-bd39-d1b22ebe6bef)
  )
  (fp_line (start -1.73 -1.65) (end 1.025 -1.65)
    (stroke (width 0.15) (type solid)) (layer "F.SilkS") (tstamp feb38cf0-1f78-44d2-ad6a-44de9d057168))
  (fp_line (start -1.025 1.65) (end 1.025 1.65)
    (stroke (width 0.15) (type solid)) (layer "F.SilkS") (tstamp c01ccda3-b6ff-4fb9-beb4-63b213835aff))
  (fp_line (start -1.9 -1.85) (end -1.9 1.85)
    (stroke (width 0.05) (type solid)) (layer "F.CrtYd") (tstamp 4bbbcfb2-709a-48a0-860a-a4213c9bded6))
  (fp_line (start -1.9 -1.85) (end 1.9 -1.85)
    (stroke (width 0.05) (type solid)) (layer "F.CrtYd") (tstamp 8897878d-35f4-4dc7-bd43-c1ab88ebbdac))
  (fp_line (start -1.9 1.85) (end 1.9 1.85)
    (stroke (width 0.05) (type solid)) (layer "F.CrtYd") (tstamp 5fd1ab57-6088-4fdf-afa9-aa1ee163f1e4))
  (fp_line (start 1.9 -1.85) (end 1.9 1.85)
    (stroke (width 0.05) (type solid)) (layer "F.CrtYd") (tstamp 671b6ab2-b47a-4806-99c0-8d8c798039a3))
  (fp_line (start -1.5 -0.5) (end -0.5 -1.5)
    (stroke (width 0.15) (type solid)) (layer "F.Fab") (tstamp 4320c999-4a4c-420e-9c11-dbce8dee6a8c))
  (fp_line (start -1.5 1.5) (end -1.5 -0.5)
    (stroke (width 0.15) (type solid)) (layer "F.Fab") (tstamp 18ecd85f-aa99-4d32-9680-0c96617684eb))
  (fp_line (start -0.5 -1.5) (end 1.5 -1.5)
    (stroke (width 0.15) (type solid)) (layer "F.Fab") (tstamp 858e280e-bd35-4f5b-be06-cf5374f5a854))
  (fp_line (start 1.5 -1.5) (end 1.5 1.5)
    (stroke (width 0.15) (type solid)) (layer "F.Fab") (tstamp d043ae52-b47b-4e60-ba4d-9b4247a3fbd7))
  (fp_line (start 1.5 1.5) (end -1.5 1.5)
    (stroke (width 0.15) (type solid)) (layer "F.Fab") (tstamp 338a38cf-f8d6-42d3-a8da-164c3a3e510e))
  (pad "1" smd rect (at -1.34 -0.95) (size 0.63 0.45) (layers "F.Cu" "F.Paste" "F.Mask") (tstamp 35aab8e9-183d-4e81-9856-6bafc81ee778))
  (pad "2" smd rect (at -1.34 0) (size 0.63 0.45) (layers "F.Cu" "F.Paste" "F.Mask") (tstamp 7346bc88-db9f-4993-a034-a287424f7e2b))
  (pad "3" smd rect (at -1.34 0.95) (size 0.63 0.45) (layers "F.Cu" "F.Paste" "F.Mask") (tstamp 0fc18af1-a865-42e6-98e7-1778625d8e3f))
  (pad "4" smd rect (at 1.34 0.95) (size 0.63 0.45) (layers "F.Cu" "F.Paste" "F.Mask") (tstamp 05b246b6-c2c8-4d08-b9d6-6b054e73e7b0))
  (pad "5" smd rect (at 1.34 0) (size 0.63 0.45) (layers "F.Cu" "F.Paste" "F.Mask") (tstamp 9ed04122-0fc5-4530-86e3-0cc3f705c3e3))
  (pad "6" smd rect (at 1.34 -0.95) (size 0.63 0.45) (layers "F.Cu" "F.Paste" "F.Mask") (tstamp 8c3e6869-9deb-467b-bf11-f9ba0353f2e2))
  (pad "7" smd rect (at -0.4 -0.525) (size 0.8 1.05) (layers "F.Cu" "F.Paste" "F.Mask")
    (solder_paste_margin_ratio -0.2) (tstamp 73076aa2-7adc-47bb-b7b1-4173a0d2c881))
  (pad "7" smd rect (at -0.4 0.525) (size 0.8 1.05) (layers "F.Cu" "F.Paste" "F.Mask")
    (solder_paste_margin_ratio -0.2) (tstamp e126126c-15b1-4e8f-ab70-c0dc17c8b8c4))
  (pad "7" smd rect (at 0.4 -0.525) (size 0.8 1.05) (layers "F.Cu" "F.Paste" "F.Mask")
    (solder_paste_margin_ratio -0.2) (tstamp a2cf0cb9-9f47-4465-ab1a-dce8eef0db4e))
  (pad "7" smd rect (at 0.4 0.525) (size 0.8 1.05) (layers "F.Cu" "F.Paste" "F.Mask")
    (solder_paste_margin_ratio -0.2) (tstamp 8036ddb0-36d2-4683-8b3e-2437ca956588))
  (model "${KICAD6_3DMODEL_DIR}/Package_SON.3dshapes/WSON-6-1EP_3x3mm_P0.95mm.wrl"
    (offset (xyz 0 0 0))
    (scale (xyz 1 1 1))
    (rotate (xyz 0 0 0))
  )
)
