(footprint "Linear_BGA-133_15.0x15.0mm_Layout12x12_P1.27mm" (version 20221018) (generator pcbnew)
  (layer "F.Cu")
  (descr "Analog Devices (Linear Tech), 133-pin BGA uModule, 15.0x15.0x4.92mm, https://www.analog.com/media/en/technical-documentation/data-sheets/4637fc.pdf")
  (tags "133 pin bga")
  (attr smd)
  (fp_text reference "REF**" (at 0 -8.5) (layer "F.SilkS")
      (effects (font (size 1 1) (thickness 0.15)))
    (tstamp 5aaf93a6-0fac-430b-ad03-ddb68036db02)
  )
  (fp_text value "Linear_BGA-133_15.0x15.0mm_Layout12x12_P1.27mm" (at 0 8.5) (layer "F.Fab")
      (effects (font (size 1 1) (thickness 0.15)))
    (tstamp 81905f88-e1c4-4115-bd16-755ad41e018a)
  )
  (fp_text user "${REFERENCE}" (at 0 0) (layer "F.Fab")
      (effects (font (size 1 1) (thickness 0.15)))
    (tstamp 36506967-56dc-4d15-acb8-720be836cd41)
  )
  (fp_line (start -7.61 7.61) (end -7.61 -7.29)
    (stroke (width 0.12) (type solid)) (layer "F.SilkS") (tstamp e185f8d9-6105-4852-8126-e1c6203f5717))
  (fp_line (start -7.61 7.61) (end 7.61 7.61)
    (stroke (width 0.12) (type solid)) (layer "F.SilkS") (tstamp 9f68d9ed-22bc-425a-a8c8-e638f97e161d))
  (fp_line (start 7.61 -7.61) (end -7.29 -7.61)
    (stroke (width 0.12) (type solid)) (layer "F.SilkS") (tstamp 86b34231-011a-4d61-9d79-b7dbc6a3138f))
  (fp_line (start 7.61 -7.61) (end 7.61 7.61)
    (stroke (width 0.12) (type solid)) (layer "F.SilkS") (tstamp a03d12e1-e8a7-45ca-8f8e-80b32cdf31e5))
  (fp_poly
    (pts
      (xy -7.61 -7.61)
      (xy -8.11 -7.61)
      (xy -7.61 -8.11)
      (xy -7.61 -7.61)
    )

    (stroke (width 0.12) (type solid)) (fill solid) (layer "F.SilkS") (tstamp 83dd5330-c664-4c4c-b2fb-2d349fe036bc))
  (fp_line (start -8.5 -8.5) (end -8.5 8.5)
    (stroke (width 0.05) (type solid)) (layer "F.CrtYd") (tstamp 17fbe028-8ac8-4471-9519-68142ad36245))
  (fp_line (start -8.5 -8.5) (end 8.5 -8.5)
    (stroke (width 0.05) (type solid)) (layer "F.CrtYd") (tstamp 07604206-cb4b-4cfe-8a91-f95c45e0f2a2))
  (fp_line (start 8.5 8.5) (end -8.5 8.5)
    (stroke (width 0.05) (type solid)) (layer "F.CrtYd") (tstamp 0528c9d7-6d91-420b-a14e-e8a70f36b54a))
  (fp_line (start 8.5 8.5) (end 8.5 -8.5)
    (stroke (width 0.05) (type solid)) (layer "F.CrtYd") (tstamp 4b7d14fe-bf2c-4b9b-aaf6-578f242a7df3))
  (fp_line (start -7.5 -6.5) (end -6.5 -7.5)
    (stroke (width 0.1) (type solid)) (layer "F.Fab") (tstamp 1de66f8e-a689-4dcc-a26a-71e8168693e8))
  (fp_line (start -7.5 7.5) (end -7.5 -6.5)
    (stroke (width 0.1) (type solid)) (layer "F.Fab") (tstamp 0e341626-4156-4d1f-8b87-bfff4e3615f7))
  (fp_line (start -6.5 -7.5) (end 7.5 -7.5)
    (stroke (width 0.1) (type solid)) (layer "F.Fab") (tstamp 5c212326-7489-4bed-be0d-b56f1c557b94))
  (fp_line (start 7.5 -7.5) (end 7.5 7.5)
    (stroke (width 0.1) (type solid)) (layer "F.Fab") (tstamp 59a96f2b-dd60-4bc3-9792-fee5843309b3))
  (fp_line (start 7.5 7.5) (end -7.5 7.5)
    (stroke (width 0.1) (type solid)) (layer "F.Fab") (tstamp 708d5e6c-fb31-4c84-b72a-fb9c40eb96f2))
  (pad "A1" smd circle (at -6.985 -6.985) (size 0.63 0.63) (layers "F.Cu" "F.Paste" "F.Mask") (tstamp 0e94da99-879c-45a0-861a-6867067fd82e))
  (pad "A2" smd circle (at -5.715 -6.985) (size 0.63 0.63) (layers "F.Cu" "F.Paste" "F.Mask") (tstamp edd407e9-0dc1-4273-92d3-d40280808bd6))
  (pad "A3" smd circle (at -4.445 -6.985) (size 0.63 0.63) (layers "F.Cu" "F.Paste" "F.Mask") (tstamp f713e836-dd81-4d7d-bed1-dc5dfd2a57cd))
  (pad "A4" smd circle (at -3.175 -6.985) (size 0.63 0.63) (layers "F.Cu" "F.Paste" "F.Mask") (tstamp d3b28134-6419-441a-921a-3c4b6a0911b9))
  (pad "A5" smd circle (at -1.905 -6.985) (size 0.63 0.63) (layers "F.Cu" "F.Paste" "F.Mask") (tstamp 407866fe-1487-4d15-a671-6d5142c186b5))
  (pad "A6" smd circle (at -0.635 -6.985) (size 0.63 0.63) (layers "F.Cu" "F.Paste" "F.Mask") (tstamp 8100f0dd-3216-4e93-b39e-417e6b60d379))
  (pad "A7" smd circle (at 0.635 -6.985) (size 0.63 0.63) (layers "F.Cu" "F.Paste" "F.Mask") (tstamp 799430dd-356b-433d-989e-15d641fe7599))
  (pad "A8" smd circle (at 1.905 -6.985) (size 0.63 0.63) (layers "F.Cu" "F.Paste" "F.Mask") (tstamp a3247056-d814-4e5d-b105-207ed95711d0))
  (pad "A9" smd circle (at 3.175 -6.985) (size 0.63 0.63) (layers "F.Cu" "F.Paste" "F.Mask") (tstamp a5bd048a-5e31-4b66-b795-b30c7fb32f6d))
  (pad "A10" smd circle (at 4.445 -6.985) (size 0.63 0.63) (layers "F.Cu" "F.Paste" "F.Mask") (tstamp 355700bf-2d45-4ab0-8d94-1128e770e2ae))
  (pad "A11" smd circle (at 5.715 -6.985) (size 0.63 0.63) (layers "F.Cu" "F.Paste" "F.Mask") (tstamp d16b2d01-e011-4b77-a3fb-2454b3768a16))
  (pad "A12" smd circle (at 6.985 -6.985) (size 0.63 0.63) (layers "F.Cu" "F.Paste" "F.Mask") (tstamp 9e121e90-51b2-4462-a987-a4bf63c3de36))
  (pad "B1" smd circle (at -6.985 -5.715) (size 0.63 0.63) (layers "F.Cu" "F.Paste" "F.Mask") (tstamp 0d1e7869-dd68-4a8b-9783-80edbbecb191))
  (pad "B2" smd circle (at -5.715 -5.715) (size 0.63 0.63) (layers "F.Cu" "F.Paste" "F.Mask") (tstamp 8cc725be-23d3-4995-85c5-c2cf7a1c2165))
  (pad "B3" smd circle (at -4.445 -5.715) (size 0.63 0.63) (layers "F.Cu" "F.Paste" "F.Mask") (tstamp 2eab20d7-dbbf-455f-8892-34c7fa106c3f))
  (pad "B4" smd circle (at -3.175 -5.715) (size 0.63 0.63) (layers "F.Cu" "F.Paste" "F.Mask") (tstamp 27bbcf67-d2c5-4ba5-b682-61216849db73))
  (pad "B5" smd circle (at -1.905 -5.715) (size 0.63 0.63) (layers "F.Cu" "F.Paste" "F.Mask") (tstamp e4669b94-67c1-47b8-b3cc-14a27ea32ae8))
  (pad "B6" smd circle (at -0.635 -5.715) (size 0.63 0.63) (layers "F.Cu" "F.Paste" "F.Mask") (tstamp 98947aa2-54b7-40f0-b81e-dc61d5c876a1))
  (pad "B7" smd circle (at 0.635 -5.715) (size 0.63 0.63) (layers "F.Cu" "F.Paste" "F.Mask") (tstamp 7df66901-ae63-4ecb-b138-b453ce985e4a))
  (pad "B9" smd circle (at 3.175 -5.715) (size 0.63 0.63) (layers "F.Cu" "F.Paste" "F.Mask") (tstamp 960c8528-a350-4ffd-8a9a-e90e108bc7cc))
  (pad "B11" smd circle (at 5.715 -5.715) (size 0.63 0.63) (layers "F.Cu" "F.Paste" "F.Mask") (tstamp e04f537c-5c8d-4272-8631-2a49817a3176))
  (pad "B12" smd circle (at 6.985 -5.715) (size 0.63 0.63) (layers "F.Cu" "F.Paste" "F.Mask") (tstamp 705d7ca5-39ae-4c2c-8a77-0e5f08a00ac6))
  (pad "C1" smd circle (at -6.985 -4.445) (size 0.63 0.63) (layers "F.Cu" "F.Paste" "F.Mask") (tstamp cc6dbb54-9071-4314-b2bb-ca354117911d))
  (pad "C2" smd circle (at -5.715 -4.445) (size 0.63 0.63) (layers "F.Cu" "F.Paste" "F.Mask") (tstamp 800e361f-3cf2-43bd-acf8-eaeaa82b2cf0))
  (pad "C3" smd circle (at -4.445 -4.445) (size 0.63 0.63) (layers "F.Cu" "F.Paste" "F.Mask") (tstamp 0e0f03e7-b320-41dd-a0a0-93277d25ddea))
  (pad "C4" smd circle (at -3.175 -4.445) (size 0.63 0.63) (layers "F.Cu" "F.Paste" "F.Mask") (tstamp 8ea27c6b-30c5-4ec1-96ce-f7e3f07b7fe8))
  (pad "C5" smd circle (at -1.905 -4.445) (size 0.63 0.63) (layers "F.Cu" "F.Paste" "F.Mask") (tstamp 4daabcd4-0b2f-43bd-a385-d57621fec235))
  (pad "C6" smd circle (at -0.635 -4.445) (size 0.63 0.63) (layers "F.Cu" "F.Paste" "F.Mask") (tstamp 0c4d36b1-bfda-4262-9a82-ce139adea87e))
  (pad "C7" smd circle (at 0.635 -4.445) (size 0.63 0.63) (layers "F.Cu" "F.Paste" "F.Mask") (tstamp 74eb4f7c-92c0-4475-bbc8-75fbeb49fe1e))
  (pad "C9" smd circle (at 3.175 -4.445) (size 0.63 0.63) (layers "F.Cu" "F.Paste" "F.Mask") (tstamp bfb4e971-5ce5-4a8a-9d5c-3545bbdfac78))
  (pad "C10" smd circle (at 4.445 -4.445) (size 0.63 0.63) (layers "F.Cu" "F.Paste" "F.Mask") (tstamp a6d6d1ea-ffea-4224-b7e0-df0220f84d18))
  (pad "C11" smd circle (at 5.715 -4.445) (size 0.63 0.63) (layers "F.Cu" "F.Paste" "F.Mask") (tstamp 25454c55-d38a-41af-96d3-e8c0772779e9))
  (pad "C12" smd circle (at 6.985 -4.445) (size 0.63 0.63) (layers "F.Cu" "F.Paste" "F.Mask") (tstamp 98437ec5-5514-4377-895e-324ac60025d3))
  (pad "D1" smd circle (at -6.985 -3.175) (size 0.63 0.63) (layers "F.Cu" "F.Paste" "F.Mask") (tstamp 8766f6da-1d7d-4270-a2dd-51f2a43a8028))
  (pad "D2" smd circle (at -5.715 -3.175) (size 0.63 0.63) (layers "F.Cu" "F.Paste" "F.Mask") (tstamp bdb96709-1eca-47a5-8efe-cf631a1db0f1))
  (pad "D3" smd circle (at -4.445 -3.175) (size 0.63 0.63) (layers "F.Cu" "F.Paste" "F.Mask") (tstamp 88755486-006e-406f-8b69-7322af6161f8))
  (pad "D4" smd circle (at -3.175 -3.175) (size 0.63 0.63) (layers "F.Cu" "F.Paste" "F.Mask") (tstamp 4dc75644-84ed-4eb1-90b1-cda82bf8fec2))
  (pad "D5" smd circle (at -1.905 -3.175) (size 0.63 0.63) (layers "F.Cu" "F.Paste" "F.Mask") (tstamp 6ecbc9cf-591c-4c00-bbf4-afebcea74e2b))
  (pad "D6" smd circle (at -0.635 -3.175) (size 0.63 0.63) (layers "F.Cu" "F.Paste" "F.Mask") (tstamp 305c48b3-fee4-4bcb-9270-73cd6753a603))
  (pad "D8" smd circle (at 1.905 -3.175) (size 0.63 0.63) (layers "F.Cu" "F.Paste" "F.Mask") (tstamp 9a3c7f62-cfba-4a9a-928b-6dc3af4dcb2e))
  (pad "D9" smd circle (at 3.175 -3.175) (size 0.63 0.63) (layers "F.Cu" "F.Paste" "F.Mask") (tstamp 58f3609f-11eb-4993-b2ee-5ec4785abbfc))
  (pad "D10" smd circle (at 4.445 -3.175) (size 0.63 0.63) (layers "F.Cu" "F.Paste" "F.Mask") (tstamp 71f1de8b-15dd-4652-b091-01c3b0de9f61))
  (pad "D11" smd circle (at 5.715 -3.175) (size 0.63 0.63) (layers "F.Cu" "F.Paste" "F.Mask") (tstamp cd4a54f4-11ff-4603-8532-8746c215c7db))
  (pad "D12" smd circle (at 6.985 -3.175) (size 0.63 0.63) (layers "F.Cu" "F.Paste" "F.Mask") (tstamp a83bfa78-bb51-4c8a-813f-fc44520275a0))
  (pad "E1" smd circle (at -6.985 -1.905) (size 0.63 0.63) (layers "F.Cu" "F.Paste" "F.Mask") (tstamp fd0971af-03d0-46a6-aa14-72423732bf34))
  (pad "E2" smd circle (at -5.715 -1.905) (size 0.63 0.63) (layers "F.Cu" "F.Paste" "F.Mask") (tstamp 408ea209-6695-49ff-97ea-5020fd6c896d))
  (pad "E3" smd circle (at -4.445 -1.905) (size 0.63 0.63) (layers "F.Cu" "F.Paste" "F.Mask") (tstamp ee8c25d6-2195-4b9c-9fbe-b508cccd2e32))
  (pad "E4" smd circle (at -3.175 -1.905) (size 0.63 0.63) (layers "F.Cu" "F.Paste" "F.Mask") (tstamp 2481df22-3c83-4eac-9f65-2cb77869a2d7))
  (pad "E5" smd circle (at -1.905 -1.905) (size 0.63 0.63) (layers "F.Cu" "F.Paste" "F.Mask") (tstamp af565e1f-ed31-4544-b808-a5ba21f18b53))
  (pad "E6" smd circle (at -0.635 -1.905) (size 0.63 0.63) (layers "F.Cu" "F.Paste" "F.Mask") (tstamp 31423985-c059-4797-9329-99b9816cd2be))
  (pad "E7" smd circle (at 0.635 -1.905) (size 0.63 0.63) (layers "F.Cu" "F.Paste" "F.Mask") (tstamp 9bc303c4-4ec9-4cce-a85e-f287cc0a4505))
  (pad "E8" smd circle (at 1.905 -1.905) (size 0.63 0.63) (layers "F.Cu" "F.Paste" "F.Mask") (tstamp 9466d3a5-0175-46b1-b469-cab9b554303e))
  (pad "E9" smd circle (at 3.175 -1.905) (size 0.63 0.63) (layers "F.Cu" "F.Paste" "F.Mask") (tstamp 68578936-87e0-4dd8-894d-b5178e5a2f6b))
  (pad "E12" smd circle (at 6.985 -1.905) (size 0.63 0.63) (layers "F.Cu" "F.Paste" "F.Mask") (tstamp 8146e4fc-b7fe-47a8-a074-cf95d93e44bd))
  (pad "F1" smd circle (at -6.985 -0.635) (size 0.63 0.63) (layers "F.Cu" "F.Paste" "F.Mask") (tstamp 86a005f5-4293-488c-bb22-9f8a57d6309c))
  (pad "F2" smd circle (at -5.715 -0.635) (size 0.63 0.63) (layers "F.Cu" "F.Paste" "F.Mask") (tstamp c2f687e0-512a-467a-94e7-c704a73b8e6b))
  (pad "F3" smd circle (at -4.445 -0.635) (size 0.63 0.63) (layers "F.Cu" "F.Paste" "F.Mask") (tstamp fae3639b-05b7-4dba-bbe3-32e81356c1c7))
  (pad "F4" smd circle (at -3.175 -0.635) (size 0.63 0.63) (layers "F.Cu" "F.Paste" "F.Mask") (tstamp 8c844ad3-1ac0-41f3-a2de-0646f5168eb9))
  (pad "F5" smd circle (at -1.905 -0.635) (size 0.63 0.63) (layers "F.Cu" "F.Paste" "F.Mask") (tstamp 0c5fb8ae-0d03-4dc0-9cd7-f7e9c012c302))
  (pad "F6" smd circle (at -0.635 -0.635) (size 0.63 0.63) (layers "F.Cu" "F.Paste" "F.Mask") (tstamp 1161e15f-3d7f-496c-8187-250966d5db66))
  (pad "F7" smd circle (at 0.635 -0.635) (size 0.63 0.63) (layers "F.Cu" "F.Paste" "F.Mask") (tstamp 5dc9e322-10df-4d63-9e8b-a3d4b793a259))
  (pad "F8" smd circle (at 1.905 -0.635) (size 0.63 0.63) (layers "F.Cu" "F.Paste" "F.Mask") (tstamp d1021f73-b6a2-4ba6-b2dd-0557c48f931b))
  (pad "F9" smd circle (at 3.175 -0.635) (size 0.63 0.63) (layers "F.Cu" "F.Paste" "F.Mask") (tstamp a3b804bc-84d5-40c6-8db0-139f74463327))
  (pad "F11" smd circle (at 5.715 -0.635) (size 0.63 0.63) (layers "F.Cu" "F.Paste" "F.Mask") (tstamp 89eb157a-d8e7-4599-b544-fdee2e5d996e))
  (pad "F12" smd circle (at 6.985 -0.635) (size 0.63 0.63) (layers "F.Cu" "F.Paste" "F.Mask") (tstamp a54f02bf-d0e6-4d7a-854a-37702dca0194))
  (pad "G1" smd circle (at -6.985 0.635) (size 0.63 0.63) (layers "F.Cu" "F.Paste" "F.Mask") (tstamp e0a5c222-951d-456d-ba82-68124da0cf0e))
  (pad "G2" smd circle (at -5.715 0.635) (size 0.63 0.63) (layers "F.Cu" "F.Paste" "F.Mask") (tstamp cae55508-8f78-4ecb-baae-e0427bc0cc4d))
  (pad "G3" smd circle (at -4.445 0.635) (size 0.63 0.63) (layers "F.Cu" "F.Paste" "F.Mask") (tstamp a3ccec5b-aa6b-4241-a612-8dcf852f7d13))
  (pad "G4" smd circle (at -3.175 0.635) (size 0.63 0.63) (layers "F.Cu" "F.Paste" "F.Mask") (tstamp 80443886-8c9c-4f42-8747-c40317555ed2))
  (pad "G5" smd circle (at -1.905 0.635) (size 0.63 0.63) (layers "F.Cu" "F.Paste" "F.Mask") (tstamp 358b1e45-80ec-471b-8880-64329c13c2ec))
  (pad "G6" smd circle (at -0.635 0.635) (size 0.63 0.63) (layers "F.Cu" "F.Paste" "F.Mask") (tstamp 544c93e5-2034-43c7-94f4-8c81d633f566))
  (pad "G7" smd circle (at 0.635 0.635) (size 0.63 0.63) (layers "F.Cu" "F.Paste" "F.Mask") (tstamp ed4e3286-7309-4fa1-85d9-620424ffe62b))
  (pad "G8" smd circle (at 1.905 0.635) (size 0.63 0.63) (layers "F.Cu" "F.Paste" "F.Mask") (tstamp 168e402d-3b7a-410a-8610-b06235c573a2))
  (pad "G9" smd circle (at 3.175 0.635) (size 0.63 0.63) (layers "F.Cu" "F.Paste" "F.Mask") (tstamp a968b0cc-c0d9-427b-ae3c-36e7f5f43ffa))
  (pad "G11" smd circle (at 5.715 0.635) (size 0.63 0.63) (layers "F.Cu" "F.Paste" "F.Mask") (tstamp 002b9815-4891-4b78-ad76-ecad7ebe2cc3))
  (pad "G12" smd circle (at 6.985 0.635) (size 0.63 0.63) (layers "F.Cu" "F.Paste" "F.Mask") (tstamp 33bde0dc-d1ed-4e96-b109-f06d72a49ca1))
  (pad "H1" smd circle (at -6.985 1.905) (size 0.63 0.63) (layers "F.Cu" "F.Paste" "F.Mask") (tstamp 4a250866-cc73-42fb-ae8e-1b437eadc5e1))
  (pad "H2" smd circle (at -5.715 1.905) (size 0.63 0.63) (layers "F.Cu" "F.Paste" "F.Mask") (tstamp 8daab02f-a922-4f5e-b515-faf1becaa745))
  (pad "H3" smd circle (at -4.445 1.905) (size 0.63 0.63) (layers "F.Cu" "F.Paste" "F.Mask") (tstamp 55346d9f-b336-4f96-acad-40c3b80c93f3))
  (pad "H4" smd circle (at -3.175 1.905) (size 0.63 0.63) (layers "F.Cu" "F.Paste" "F.Mask") (tstamp 6bbf26cc-07ff-4a5e-a3ce-c0a0bfaa804c))
  (pad "H5" smd circle (at -1.905 1.905) (size 0.63 0.63) (layers "F.Cu" "F.Paste" "F.Mask") (tstamp efc00db8-6415-4fd9-9389-8bc89e98a493))
  (pad "H6" smd circle (at -0.635 1.905) (size 0.63 0.63) (layers "F.Cu" "F.Paste" "F.Mask") (tstamp 5f1ec91b-3716-428c-aef1-4948a4f2ac9e))
  (pad "H7" smd circle (at 0.635 1.905) (size 0.63 0.63) (layers "F.Cu" "F.Paste" "F.Mask") (tstamp 8bb6a7e5-477f-45f4-842e-3f1a6ceae82a))
  (pad "H8" smd circle (at 1.905 1.905) (size 0.63 0.63) (layers "F.Cu" "F.Paste" "F.Mask") (tstamp 480c0da3-6ef1-4e1b-8c4b-673e2c4439c8))
  (pad "H9" smd circle (at 3.175 1.905) (size 0.63 0.63) (layers "F.Cu" "F.Paste" "F.Mask") (tstamp 7c94fd8e-1192-432b-8655-352ba03ce7f8))
  (pad "H11" smd circle (at 5.715 1.905) (size 0.63 0.63) (layers "F.Cu" "F.Paste" "F.Mask") (tstamp 32511b85-bdfa-400c-97b2-56a78776c768))
  (pad "H12" smd circle (at 6.985 1.905) (size 0.63 0.63) (layers "F.Cu" "F.Paste" "F.Mask") (tstamp db205b98-f4d0-4696-bdbb-b402916976ef))
  (pad "J1" smd circle (at -6.985 3.175) (size 0.63 0.63) (layers "F.Cu" "F.Paste" "F.Mask") (tstamp 7d55100a-6c09-4ca8-9d47-6c20b91d46e7))
  (pad "J2" smd circle (at -5.715 3.175) (size 0.63 0.63) (layers "F.Cu" "F.Paste" "F.Mask") (tstamp 62f31309-9635-473d-b1bf-6aa3ee741f8f))
  (pad "J3" smd circle (at -4.445 3.175) (size 0.63 0.63) (layers "F.Cu" "F.Paste" "F.Mask") (tstamp 25f7cfc0-661a-40ed-9920-eb89daec9634))
  (pad "J4" smd circle (at -3.175 3.175) (size 0.63 0.63) (layers "F.Cu" "F.Paste" "F.Mask") (tstamp 87196675-6ac9-4d26-b677-59339bede3d3))
  (pad "J5" smd circle (at -1.905 3.175) (size 0.63 0.63) (layers "F.Cu" "F.Paste" "F.Mask") (tstamp 35d7d50d-2e00-4fff-9d0d-b47df89b86d0))
  (pad "J6" smd circle (at -0.635 3.175) (size 0.63 0.63) (layers "F.Cu" "F.Paste" "F.Mask") (tstamp 9958d736-cd92-4567-ac37-70efb9cdc455))
  (pad "J7" smd circle (at 0.635 3.175) (size 0.63 0.63) (layers "F.Cu" "F.Paste" "F.Mask") (tstamp 480bca89-558e-4220-a54e-7fc04c68cd63))
  (pad "J8" smd circle (at 1.905 3.175) (size 0.63 0.63) (layers "F.Cu" "F.Paste" "F.Mask") (tstamp 5b39cce2-b2f7-462f-aa89-52d26e6d7a6a))
  (pad "J9" smd circle (at 3.175 3.175) (size 0.63 0.63) (layers "F.Cu" "F.Paste" "F.Mask") (tstamp 7365fa20-ab58-45ce-bbbb-5d4a5814cb9f))
  (pad "J10" smd circle (at 4.445 3.175) (size 0.63 0.63) (layers "F.Cu" "F.Paste" "F.Mask") (tstamp f0c4a2e7-ead3-40f2-ac76-ae57c9a79eb7))
  (pad "J12" smd circle (at 6.985 3.175) (size 0.63 0.63) (layers "F.Cu" "F.Paste" "F.Mask") (tstamp 7e6220ba-ee69-40ec-95e6-75a07bff1b33))
  (pad "K1" smd circle (at -6.985 4.445) (size 0.63 0.63) (layers "F.Cu" "F.Paste" "F.Mask") (tstamp bdd7e9cd-61ca-46ce-a926-e3c003997091))
  (pad "K2" smd circle (at -5.715 4.445) (size 0.63 0.63) (layers "F.Cu" "F.Paste" "F.Mask") (tstamp 428038ab-3767-4568-97f2-38e39978378f))
  (pad "K3" smd circle (at -4.445 4.445) (size 0.63 0.63) (layers "F.Cu" "F.Paste" "F.Mask") (tstamp 8739d0a6-72f4-4484-86c9-4d2ad610a380))
  (pad "K4" smd circle (at -3.175 4.445) (size 0.63 0.63) (layers "F.Cu" "F.Paste" "F.Mask") (tstamp 3b97172e-1180-458a-8b80-c606d90cd44c))
  (pad "K5" smd circle (at -1.905 4.445) (size 0.63 0.63) (layers "F.Cu" "F.Paste" "F.Mask") (tstamp be6a0c79-020f-45d0-829d-9c4284d7f11d))
  (pad "K6" smd circle (at -0.635 4.445) (size 0.63 0.63) (layers "F.Cu" "F.Paste" "F.Mask") (tstamp 4407a60f-62cc-41ca-9945-504ed00aa711))
  (pad "K7" smd circle (at 0.635 4.445) (size 0.63 0.63) (layers "F.Cu" "F.Paste" "F.Mask") (tstamp b2fa465e-a8c2-4399-9524-b6cf464efddf))
  (pad "K8" smd circle (at 1.905 4.445) (size 0.63 0.63) (layers "F.Cu" "F.Paste" "F.Mask") (tstamp ce6a877c-0782-46c6-baaa-16896d337ea6))
  (pad "K9" smd circle (at 3.175 4.445) (size 0.63 0.63) (layers "F.Cu" "F.Paste" "F.Mask") (tstamp 8c7e16c3-f7d2-442a-b9d0-00f1b09a768f))
  (pad "K10" smd circle (at 4.445 4.445) (size 0.63 0.63) (layers "F.Cu" "F.Paste" "F.Mask") (tstamp 014883a5-2c94-44dc-ac8a-af776022dafe))
  (pad "K11" smd circle (at 5.715 4.445) (size 0.63 0.63) (layers "F.Cu" "F.Paste" "F.Mask") (tstamp 64ff7360-cf16-4eb6-b0af-6aac31f3e198))
  (pad "K12" smd circle (at 6.985 4.445) (size 0.63 0.63) (layers "F.Cu" "F.Paste" "F.Mask") (tstamp 326db3bf-eaff-467d-abef-801318f88bf9))
  (pad "L1" smd circle (at -6.985 5.715) (size 0.63 0.63) (layers "F.Cu" "F.Paste" "F.Mask") (tstamp 998062ab-86d4-4ea1-baa8-8f0498f0846e))
  (pad "L2" smd circle (at -5.715 5.715) (size 0.63 0.63) (layers "F.Cu" "F.Paste" "F.Mask") (tstamp 947c38df-c579-43e4-a38f-a19efe6463cb))
  (pad "L3" smd circle (at -4.445 5.715) (size 0.63 0.63) (layers "F.Cu" "F.Paste" "F.Mask") (tstamp 7a4771f6-d62b-4c18-ab76-4be4b675595e))
  (pad "L4" smd circle (at -3.175 5.715) (size 0.63 0.63) (layers "F.Cu" "F.Paste" "F.Mask") (tstamp 415090f1-6566-459b-80bb-c8fe6e48b659))
  (pad "L5" smd circle (at -1.905 5.715) (size 0.63 0.63) (layers "F.Cu" "F.Paste" "F.Mask") (tstamp dec27063-4b88-419f-9548-7658004385f5))
  (pad "L6" smd circle (at -0.635 5.715) (size 0.63 0.63) (layers "F.Cu" "F.Paste" "F.Mask") (tstamp c57aeb3b-c7c7-4a49-9135-40c204669255))
  (pad "L7" smd circle (at 0.635 5.715) (size 0.63 0.63) (layers "F.Cu" "F.Paste" "F.Mask") (tstamp 1f13eb1e-125b-46c1-9877-115a6eb2d921))
  (pad "L8" smd circle (at 1.905 5.715) (size 0.63 0.63) (layers "F.Cu" "F.Paste" "F.Mask") (tstamp f67be1e0-35c4-4a7c-aea0-b6311fbbb692))
  (pad "L9" smd circle (at 3.175 5.715) (size 0.63 0.63) (layers "F.Cu" "F.Paste" "F.Mask") (tstamp d76dff60-9926-4c78-b7c6-9600ef3ff197))
  (pad "L10" smd circle (at 4.445 5.715) (size 0.63 0.63) (layers "F.Cu" "F.Paste" "F.Mask") (tstamp 2e31175f-2c56-44be-b7d1-707e1c24a332))
  (pad "L11" smd circle (at 5.715 5.715) (size 0.63 0.63) (layers "F.Cu" "F.Paste" "F.Mask") (tstamp d70b83f6-5a5f-4208-aff0-56231f69c19e))
  (pad "L12" smd circle (at 6.985 5.715) (size 0.63 0.63) (layers "F.Cu" "F.Paste" "F.Mask") (tstamp eaae48ad-a55d-41f9-b629-a30c4c6c94d7))
  (pad "M1" smd circle (at -6.985 6.985) (size 0.63 0.63) (layers "F.Cu" "F.Paste" "F.Mask") (tstamp b63238d5-48d0-4d01-a3fa-533a48a62d3e))
  (pad "M2" smd circle (at -5.715 6.985) (size 0.63 0.63) (layers "F.Cu" "F.Paste" "F.Mask") (tstamp fdfd7040-08fe-405d-a34f-6cebcff1d73c))
  (pad "M3" smd circle (at -4.445 6.985) (size 0.63 0.63) (layers "F.Cu" "F.Paste" "F.Mask") (tstamp dcd38f54-7c6c-43b4-92e3-b4a5510fb070))
  (pad "M4" smd circle (at -3.175 6.985) (size 0.63 0.63) (layers "F.Cu" "F.Paste" "F.Mask") (tstamp d9a91120-f8fa-47f1-b91f-89e443e89fae))
  (pad "M5" smd circle (at -1.905 6.985) (size 0.63 0.63) (layers "F.Cu" "F.Paste" "F.Mask") (tstamp 715df95a-7cb1-4426-925c-6a52cf944da6))
  (pad "M6" smd circle (at -0.635 6.985) (size 0.63 0.63) (layers "F.Cu" "F.Paste" "F.Mask") (tstamp 39a5d89f-1cc4-4095-ac14-a1454391bbe6))
  (pad "M7" smd circle (at 0.635 6.985) (size 0.63 0.63) (layers "F.Cu" "F.Paste" "F.Mask") (tstamp f640de08-7cd5-4a11-a22d-cb695fe5b388))
  (pad "M8" smd circle (at 1.905 6.985) (size 0.63 0.63) (layers "F.Cu" "F.Paste" "F.Mask") (tstamp 0cfa6250-2f2b-4a7c-b2f5-8802149bd640))
  (pad "M9" smd circle (at 3.175 6.985) (size 0.63 0.63) (layers "F.Cu" "F.Paste" "F.Mask") (tstamp e33e0db4-9fe0-42a6-9910-ba4b68bc6802))
  (pad "M10" smd circle (at 4.445 6.985) (size 0.63 0.63) (layers "F.Cu" "F.Paste" "F.Mask") (tstamp 26c580f8-1382-4111-947e-488e7e3fc713))
  (pad "M11" smd circle (at 5.715 6.985) (size 0.63 0.63) (layers "F.Cu" "F.Paste" "F.Mask") (tstamp 44862e07-8fd2-4507-b6c2-9ef0577ac153))
  (pad "M12" smd circle (at 6.985 6.985) (size 0.63 0.63) (layers "F.Cu" "F.Paste" "F.Mask") (tstamp 62bf03f4-8af4-4d1c-9ec9-0a850802f921))
  (model "${KICAD6_3DMODEL_DIR}/Package_BGA.3dshapes/Linear_BGA-133_15.0x15.0mm_Layout12x12_P1.27mm.wrl"
    (offset (xyz 0 0 0))
    (scale (xyz 1 1 1))
    (rotate (xyz 0 0 0))
  )
)
