(footprint "Infineon_PG-HSOF-8-3_ThermalVias" (version 20221018) (generator pcbnew)
  (layer "F.Cu")
  (descr "HSOF-8-3 power MOSFET (http://www.infineon.com/cms/en/product/packages/PG-HSOF/PG-HSOF-8-3/)")
  (tags "mosfet hsof")
  (solder_paste_margin -0.05)
  (attr smd)
  (fp_text reference "REF**" (at 0 -6) (layer "F.SilkS")
      (effects (font (size 1 1) (thickness 0.15)))
    (tstamp db1893f4-6df6-45e9-9e85-bc0436c4e5f7)
  )
  (fp_text value "Infineon_PG-HSOF-8-3_ThermalVias" (at 0 6) (layer "F.Fab")
      (effects (font (size 1 1) (thickness 0.15)))
    (tstamp fa976507-ed30-4077-b7e7-12e435cc7efb)
  )
  (fp_text user "${REFERENCE}" (at 0 0) (layer "F.Fab")
      (effects (font (size 1 1) (thickness 0.15)))
    (tstamp 7ebc3061-0420-4c36-9417-b37d9225ec0c)
  )
  (fp_line (start -5.2 5.06) (end 4.755 5.06)
    (stroke (width 0.12) (type solid)) (layer "F.SilkS") (tstamp 5eceb62d-e048-4401-bf88-8dd704b69816))
  (fp_line (start 4.755 -5.06) (end -6.33 -5.06)
    (stroke (width 0.12) (type solid)) (layer "F.SilkS") (tstamp 6da9c330-e3bd-499a-bf9e-baedeb3729ef))
  (fp_line (start -6.64 5.25) (end -6.64 -5.25)
    (stroke (width 0.05) (type solid)) (layer "F.CrtYd") (tstamp 7d69620b-c33a-45b2-ac50-7ca9693bc229))
  (fp_line (start -6.64 5.25) (end 6.64 5.25)
    (stroke (width 0.05) (type solid)) (layer "F.CrtYd") (tstamp c1ab3c7e-25ad-4b36-802b-a8b3b8c4bc27))
  (fp_line (start 6.64 -5.25) (end -6.64 -5.25)
    (stroke (width 0.05) (type solid)) (layer "F.CrtYd") (tstamp 6ee68c35-c7d1-4957-a4eb-0e59cf307349))
  (fp_line (start 6.64 -5.25) (end 6.64 5.25)
    (stroke (width 0.05) (type solid)) (layer "F.CrtYd") (tstamp b861cbc8-6a70-4928-af4a-c5be6910658c))
  (fp_line (start -5.1875 4.95) (end -5.1875 -3.95)
    (stroke (width 0.1) (type solid)) (layer "F.Fab") (tstamp 046fe471-af08-4f21-8b64-1e067df2e838))
  (fp_line (start -4.1875 -4.95) (end -5.1875 -3.95)
    (stroke (width 0.1) (type solid)) (layer "F.Fab") (tstamp 92c2d12f-2c8e-41b1-be70-e5eba61e2526))
  (fp_line (start -4.1875 -4.95) (end 5.1875 -4.95)
    (stroke (width 0.1) (type solid)) (layer "F.Fab") (tstamp c4ac62d8-dc1a-40e4-b4e3-03fc772531dc))
  (fp_line (start 5.1875 -4.95) (end 5.1875 4.95)
    (stroke (width 0.1) (type solid)) (layer "F.Fab") (tstamp 07045871-e064-402e-9f36-262b2d3eaef4))
  (fp_line (start 5.1875 4.95) (end -5.1875 4.95)
    (stroke (width 0.1) (type solid)) (layer "F.Fab") (tstamp e5929fc4-f6fe-4d27-9ae5-70e0045fb4fc))
  (pad "" smd rect (at -5.44 -4.2) (size 1.8 0.8) (layers "F.Paste") (tstamp 0b0e5ff4-f3e1-47fd-81d3-b8a631c4f547))
  (pad "" smd rect (at -5.44 -3) (size 1.8 0.8) (layers "F.Paste") (tstamp 80e1a3d5-0eb4-4738-b9e0-f292b9a41838))
  (pad "" smd rect (at -5.44 -1.8) (size 1.8 0.8) (layers "F.Paste") (tstamp d1845296-a66f-4a89-bdf9-292400cfdf89))
  (pad "" smd rect (at -5.44 -0.6) (size 1.8 0.8) (layers "F.Paste") (tstamp 00d49aea-709d-4197-bb9d-a559e831e759))
  (pad "" smd rect (at -5.44 0.6) (size 1.8 0.8) (layers "F.Paste") (tstamp c0e6d6bd-0847-40d4-86b9-aa2fb442380f))
  (pad "" smd rect (at -5.44 1.8) (size 1.8 0.8) (layers "F.Paste") (tstamp db95df16-9d59-476b-b963-87299f8f3703))
  (pad "" smd rect (at -3.6 -2.25) (size 0.8 4.1) (layers "F.Paste") (tstamp 533aef90-f4d9-46a3-9e5b-85abb6aa09cc))
  (pad "" smd rect (at -3.6 1.15) (size 0.8 1.9) (layers "F.Paste") (tstamp 98493429-bf1c-4806-a657-8422efb13f29))
  (pad "" smd rect (at -2.4 -2.25) (size 0.8 4.1) (layers "F.Paste") (tstamp 433aa879-b7ee-4115-9ab5-3c1cf8253df1))
  (pad "" smd rect (at -2.4 2.25) (size 0.8 4.1) (layers "F.Paste") (tstamp 7f3faaab-9ea3-4798-a35d-85e573ad8cfc))
  (pad "" smd rect (at -1.2 -2.25) (size 0.8 4.1) (layers "F.Paste") (tstamp 1112effb-4fc3-4678-a89c-8714c260283d))
  (pad "" smd rect (at -1.2 2.25) (size 0.8 4.1) (layers "F.Paste") (tstamp 5d81b327-2bbb-4fb4-80fd-18cc19c1d3ac))
  (pad "" smd rect (at 0 -2.45) (size 0.8 4.5) (layers "F.Paste") (tstamp 4c2a5a94-9e99-4da1-909d-241e5a870499))
  (pad "" smd rect (at 0 2.45) (size 0.8 4.5) (layers "F.Paste") (tstamp 4e9c259d-708d-4973-bfad-fd5c2dfb2e57))
  (pad "" smd rect (at 1.26 -2.45) (size 0.8 4.5) (layers "F.Paste") (tstamp 5dec5881-a453-4254-bca4-b36318526759))
  (pad "" smd rect (at 1.26 2.45) (size 0.8 4.5) (layers "F.Paste") (tstamp e635c337-1032-4996-9691-33710d864f2f))
  (pad "" smd rect (at 5.65 -4) (size 1.35 1.5) (layers "F.Paste") (tstamp 5fb76d92-1f90-4d26-b7f3-8215a9d983a3))
  (pad "" smd rect (at 5.65 4) (size 1.35 1.5) (layers "F.Paste") (tstamp 50cc39f9-2557-4425-ab2c-57ae27f89ae3))
  (pad "" smd rect (at 5.66 -2) (size 1.35 1.5) (layers "F.Paste") (tstamp 7bb1842d-5b61-4e49-98a5-7eb58ed46c02))
  (pad "" smd rect (at 5.66 0) (size 1.35 1.5) (layers "F.Paste") (tstamp 6df22708-aab3-4cb1-80ae-4db5b6dc8380))
  (pad "" smd rect (at 5.66 2) (size 1.35 1.5) (layers "F.Paste") (tstamp 469a4300-c923-4daa-b39c-3a1e4165121a))
  (pad "1" thru_hole circle (at -4.2 -4) (size 0.6 0.6) (drill 0.3) (layers "*.Cu") (tstamp 167abcea-55fa-4065-ab67-94ae80907757))
  (pad "1" thru_hole circle (at -4.2 -3) (size 0.6 0.6) (drill 0.3) (layers "*.Cu") (tstamp 152ebfd4-ca27-4857-b81a-fa81d1fba515))
  (pad "1" thru_hole circle (at -4.2 -2) (size 0.6 0.6) (drill 0.3) (layers "*.Cu") (tstamp b997d542-aa67-47e5-9edc-97635d5d1ea7))
  (pad "1" thru_hole circle (at -4.2 -1) (size 0.6 0.6) (drill 0.3) (layers "*.Cu") (tstamp 11220aaf-fffa-4ba6-9414-da68a1e7571b))
  (pad "1" thru_hole circle (at -4.2 0) (size 0.6 0.6) (drill 0.3) (layers "*.Cu") (tstamp 1a65283a-831a-4762-9194-8dcb8a63a599))
  (pad "1" thru_hole circle (at -4.2 1) (size 0.6 0.6) (drill 0.3) (layers "*.Cu") (tstamp 479e432d-9c2c-427d-8010-05a54c66da47))
  (pad "1" thru_hole circle (at -3 -4) (size 0.6 0.6) (drill 0.3) (layers "*.Cu") (tstamp 670597bc-74f6-4301-bbc3-c320bfab5772))
  (pad "1" thru_hole circle (at -3 -3) (size 0.6 0.6) (drill 0.3) (layers "*.Cu") (tstamp 2ad53d1f-ecff-4b32-8e12-fecd96d844ce))
  (pad "1" thru_hole circle (at -3 -2) (size 0.6 0.6) (drill 0.3) (layers "*.Cu") (tstamp 6a914090-6116-4350-a4ea-9654cc7eef30))
  (pad "1" thru_hole circle (at -3 -1) (size 0.6 0.6) (drill 0.3) (layers "*.Cu") (tstamp 2dbea72d-2c59-4a60-82bb-d5086d6c717b))
  (pad "1" thru_hole circle (at -3 0) (size 0.6 0.6) (drill 0.3) (layers "*.Cu") (tstamp 4d8afc7a-90df-4cc2-9a37-481c602c30e1))
  (pad "1" thru_hole circle (at -3 1) (size 0.6 0.6) (drill 0.3) (layers "*.Cu") (tstamp f22d4a7a-a1c7-400d-8d96-ed8c02e562b7))
  (pad "1" thru_hole circle (at -1.8 -4) (size 0.6 0.6) (drill 0.3) (layers "*.Cu") (tstamp 19d8ab68-1b89-4f51-a094-0f3fe05afc6b))
  (pad "1" thru_hole circle (at -1.8 -3) (size 0.6 0.6) (drill 0.3) (layers "*.Cu") (tstamp 42fe101b-6acf-4e19-b6eb-234c16f3a638))
  (pad "1" thru_hole circle (at -1.8 -2) (size 0.6 0.6) (drill 0.3) (layers "*.Cu") (tstamp 7c064599-527f-4eaa-9796-7cbcced9e4a0))
  (pad "1" thru_hole circle (at -1.8 -1) (size 0.6 0.6) (drill 0.3) (layers "*.Cu") (tstamp 3bec4012-94e5-42dc-810c-f26f5e3780b4))
  (pad "1" thru_hole circle (at -1.8 0) (size 0.6 0.6) (drill 0.3) (layers "*.Cu") (tstamp c1304f56-7590-43e2-bb6f-ebb831b4c0c7))
  (pad "1" thru_hole circle (at -1.8 1) (size 0.6 0.6) (drill 0.3) (layers "*.Cu") (tstamp 27e6509d-eeb3-46fd-a1fc-21032d8c4395))
  (pad "1" thru_hole circle (at -1.8 2) (size 0.6 0.6) (drill 0.3) (layers "*.Cu") (tstamp ee50eb86-931a-4361-a68d-0ff5d50b15ce))
  (pad "1" thru_hole circle (at -1.8 3) (size 0.6 0.6) (drill 0.3) (layers "*.Cu") (tstamp e7d416c7-c1ac-4275-8e05-9ce4549f216f))
  (pad "1" thru_hole circle (at -1.8 4) (size 0.6 0.6) (drill 0.3) (layers "*.Cu") (tstamp ce51d095-6cfe-4b6b-a286-84b7b4b08aac))
  (pad "1" thru_hole circle (at -0.6 -4) (size 0.6 0.6) (drill 0.3) (layers "*.Cu") (tstamp b6398f1e-e80b-4d0d-84f9-48ac912d877d))
  (pad "1" thru_hole circle (at -0.6 -3) (size 0.6 0.6) (drill 0.3) (layers "*.Cu") (tstamp 52de897b-f95c-445f-b5b1-9dc719a067de))
  (pad "1" thru_hole circle (at -0.6 -2) (size 0.6 0.6) (drill 0.3) (layers "*.Cu") (tstamp 30ebbb26-728f-4198-bc33-2c96fe1c352f))
  (pad "1" thru_hole circle (at -0.6 -1) (size 0.6 0.6) (drill 0.3) (layers "*.Cu") (tstamp 96113c89-b70c-476c-8165-2b8b7288f671))
  (pad "1" thru_hole circle (at -0.6 0) (size 0.6 0.6) (drill 0.3) (layers "*.Cu") (tstamp 7ce46b21-d519-4d7a-afd4-3e8b156b9401))
  (pad "1" thru_hole circle (at -0.6 1) (size 0.6 0.6) (drill 0.3) (layers "*.Cu") (tstamp f126ec05-7323-4b7f-85b0-d23e56a186f8))
  (pad "1" thru_hole circle (at -0.6 2) (size 0.6 0.6) (drill 0.3) (layers "*.Cu") (tstamp 2f40c2bb-fdf7-4306-bc03-0e91b353de96))
  (pad "1" thru_hole circle (at -0.6 3) (size 0.6 0.6) (drill 0.3) (layers "*.Cu") (tstamp 85e68d51-615a-4e50-9220-ff8d3a3bdd29))
  (pad "1" thru_hole circle (at -0.6 4) (size 0.6 0.6) (drill 0.3) (layers "*.Cu") (tstamp aeb4dcf5-6c7b-4fe7-8715-b51ea56c436a))
  (pad "1" smd custom (at 0.385 0) (size 2.85 9.6) (layers "F.Cu" "F.Mask")
    (zone_connect 2) (thermal_bridge_angle 45)
    (options (clearance outline) (anchor rect))
    (primitives
      (gr_poly
        (pts
          (xy -4.775 -4.4)
          (xy -1.425 -4.4)
          (xy -1.425 4.4)
          (xy -3.625 4.4)
          (xy -3.625 2.2)
          (xy -6.775 2.2)
          (xy -6.775 1.4)
          (xy -5.075 1.4)
          (xy -5.075 1)
          (xy -6.775 1)
          (xy -6.775 0.2)
          (xy -5.075 0.2)
          (xy -5.075 -0.2)
          (xy -6.775 -0.2)
          (xy -6.775 -1)
          (xy -5.075 -1)
          (xy -5.075 -1.4)
          (xy -6.775 -1.4)
          (xy -6.775 -2.2)
          (xy -5.075 -2.2)
          (xy -5.075 -2.6)
          (xy -6.775 -2.6)
          (xy -6.775 -3.4)
          (xy -5.075 -3.4)
          (xy -5.075 -3.8)
          (xy -6.775 -3.8)
          (xy -6.775 -4.6)
          (xy -4.775 -4.6)
        )
        (width 0) (fill yes))
    ) (tstamp 8d55d095-4f17-4f32-9576-9c9f8f7502cc))
  (pad "1" thru_hole circle (at 0.6 -4) (size 0.6 0.6) (drill 0.3) (layers "*.Cu") (tstamp 34346cb1-a1a8-4e72-9bec-482993a03168))
  (pad "1" thru_hole circle (at 0.6 -3) (size 0.6 0.6) (drill 0.3) (layers "*.Cu") (tstamp b7c7eddb-aad6-48c4-95bf-ecc80dc7a388))
  (pad "1" thru_hole circle (at 0.6 -2) (size 0.6 0.6) (drill 0.3) (layers "*.Cu") (tstamp bb98ffe2-af54-488a-aa5a-d14d93793cf0))
  (pad "1" thru_hole circle (at 0.6 -1) (size 0.6 0.6) (drill 0.3) (layers "*.Cu") (tstamp 8a4d6d8c-227c-4700-8b45-a0e0dac795ee))
  (pad "1" thru_hole circle (at 0.6 0) (size 0.6 0.6) (drill 0.3) (layers "*.Cu") (tstamp 63f61a1a-4816-436e-bc0a-12a14aa386f3))
  (pad "1" thru_hole circle (at 0.6 1) (size 0.6 0.6) (drill 0.3) (layers "*.Cu") (tstamp 95cbd6c1-c90e-488f-9187-884467bb9488))
  (pad "1" thru_hole circle (at 0.6 2) (size 0.6 0.6) (drill 0.3) (layers "*.Cu") (tstamp 47f3ebd4-8bcd-460d-9411-42bdf5112cf5))
  (pad "1" thru_hole circle (at 0.6 3) (size 0.6 0.6) (drill 0.3) (layers "*.Cu") (tstamp 5e1bd206-ccf9-4acc-b941-e7848681776c))
  (pad "1" thru_hole circle (at 0.6 4) (size 0.6 0.6) (drill 0.3) (layers "*.Cu") (tstamp 4ee27234-5e48-4c5b-a622-aa17cde5c552))
  (pad "2" smd rect (at -5.64 3) (size 1.5 0.8) (layers "F.Cu" "F.Paste" "F.Mask") (tstamp fb2a16f2-356d-4d35-960b-08834bfeeb4a))
  (pad "3" smd rect (at -5.65 4.2) (size 1.5 0.8) (layers "F.Cu" "F.Paste" "F.Mask") (tstamp 9a8b07e1-e61d-4c3f-8000-33cf4f1fb87c))
  (pad "4" smd rect (at 5.66 0) (size 1.45 10) (layers "F.Cu" "F.Mask") (tstamp fe5c98cf-5586-4570-b840-20eec6ad02c0))
  (model "${KICAD6_3DMODEL_DIR}/Package_TO_SOT_SMD.3dshapes/Infineon_PG-HSOF-8-3.wrl"
    (offset (xyz 0 0 0))
    (scale (xyz 1 1 1))
    (rotate (xyz 0 0 0))
  )
)
