(footprint "WLCSP-36_2.374x2.459mm_Layout6x6_P0.35mm" (version 20221018) (generator pcbnew)
  (layer "F.Cu")
  (descr "WLCSP-36, https://www.nxp.com/docs/en/package-information/98ASA00604D.pdf")
  (tags "WLCSP-36")
  (attr smd)
  (fp_text reference "REF**" (at 0 -3.34) (layer "F.SilkS")
      (effects (font (size 1 1) (thickness 0.15)))
    (tstamp 382201c7-b574-4a9a-aff1-6674914aa452)
  )
  (fp_text value "WLCSP-36_2.374x2.459mm_Layout6x6_P0.35mm" (at 0 3.43) (layer "F.Fab")
      (effects (font (size 1 1) (thickness 0.15)))
    (tstamp 44bc9c66-9042-42a0-8c6e-b05686332c0d)
  )
  (fp_text user "${REFERENCE}" (at 0 0) (layer "F.Fab")
      (effects (font (size 0.5 0.5) (thickness 0.125)))
    (tstamp 7fb9dfa1-a714-45d5-9ee6-fae95ce831f1)
  )
  (fp_line (start -1.287 1.287) (end -1.287 -0.96)
    (stroke (width 0.1) (type solid)) (layer "F.SilkS") (tstamp 5a2cafcc-695c-4236-8315-03a553dbaf60))
  (fp_line (start -1.287 1.287) (end 1.287 1.287)
    (stroke (width 0.1) (type solid)) (layer "F.SilkS") (tstamp a8394d31-5cc8-4510-8834-680dcda14772))
  (fp_line (start -0.95 -1.287) (end 1.287 -1.287)
    (stroke (width 0.1) (type solid)) (layer "F.SilkS") (tstamp a3b74436-ee6f-49f3-90d0-31446ad39bdf))
  (fp_line (start 1.287 1.287) (end 1.287 -1.287)
    (stroke (width 0.1) (type solid)) (layer "F.SilkS") (tstamp 3fc2bfba-4a8c-4c3c-9253-c98cef13a623))
  (fp_poly
    (pts
      (xy -1.287 -1.287)
      (xy -1.787 -1.287)
      (xy -1.287 -1.787)
      (xy -1.287 -1.287)
    )

    (stroke (width 0.12) (type solid)) (fill solid) (layer "F.SilkS") (tstamp 7f4905e6-cd57-45a1-bc38-c0aff1db35da))
  (fp_line (start -2.28 -2.28) (end 2.28 -2.28)
    (stroke (width 0.05) (type solid)) (layer "F.CrtYd") (tstamp c411a7a2-e2fe-4a48-af17-268ea9e7b7ea))
  (fp_line (start -2.28 2.28) (end -2.28 -2.28)
    (stroke (width 0.05) (type solid)) (layer "F.CrtYd") (tstamp 1035ba98-f392-4a5d-a9fc-8e019a3d8fcf))
  (fp_line (start -2.28 2.28) (end 2.28 2.28)
    (stroke (width 0.05) (type solid)) (layer "F.CrtYd") (tstamp 932559cd-80c7-4fbf-a94d-a60c37250b7b))
  (fp_line (start 2.28 2.28) (end 2.28 -2.28)
    (stroke (width 0.05) (type solid)) (layer "F.CrtYd") (tstamp a3c44b71-5ca2-4851-9e5f-623d6787f68b))
  (fp_line (start -1.187 -0.88) (end -0.88 -1.187)
    (stroke (width 0.1) (type solid)) (layer "F.Fab") (tstamp 7e9fbe71-a341-41fa-930b-153309e733cd))
  (fp_line (start -1.187 1.187) (end -1.187 -0.88)
    (stroke (width 0.1) (type solid)) (layer "F.Fab") (tstamp c52aabe1-b134-4591-849d-46b0a1ed7b1f))
  (fp_line (start -1.187 1.187) (end 1.187 1.187)
    (stroke (width 0.1) (type solid)) (layer "F.Fab") (tstamp f45cf971-7863-4e3e-a1c8-bd33c54f2c29))
  (fp_line (start -0.88 -1.187) (end 1.187 -1.187)
    (stroke (width 0.1) (type solid)) (layer "F.Fab") (tstamp 65f89e3a-24ae-4597-a8cc-ccd738f58dc6))
  (fp_line (start 1.187 1.187) (end 1.187 -1.187)
    (stroke (width 0.1) (type solid)) (layer "F.Fab") (tstamp 56ed9142-1e17-45af-a0ed-5c73f85ed74b))
  (pad "A1" smd circle (at -0.875 -0.875) (size 0.274 0.274) (layers "F.Cu" "F.Paste" "F.Mask") (tstamp b1f969c3-9930-43b9-90cc-07bcccf701bb))
  (pad "A2" smd circle (at -0.525 -0.875) (size 0.274 0.274) (layers "F.Cu" "F.Paste" "F.Mask") (tstamp c760ed46-c614-4d3a-a453-9738e1e45b05))
  (pad "A3" smd circle (at -0.175 -0.875) (size 0.274 0.274) (layers "F.Cu" "F.Paste" "F.Mask") (tstamp e864a5af-c6ed-4076-a881-70a3e578117c))
  (pad "A4" smd circle (at 0.175 -0.875) (size 0.274 0.274) (layers "F.Cu" "F.Paste" "F.Mask") (tstamp 33243bcb-f9ef-472a-9bb2-4ef95bd4be6b))
  (pad "A5" smd circle (at 0.525 -0.875) (size 0.274 0.274) (layers "F.Cu" "F.Paste" "F.Mask") (tstamp 48d48b05-bea0-4752-9e36-036f5132456d))
  (pad "A6" smd circle (at 0.875 -0.875) (size 0.274 0.274) (layers "F.Cu" "F.Paste" "F.Mask") (tstamp 5ea5fadc-1011-48f0-8633-e9e40a34e843))
  (pad "B1" smd circle (at -0.875 -0.525) (size 0.274 0.274) (layers "F.Cu" "F.Paste" "F.Mask") (tstamp 5ceaee90-52e8-4666-b18f-03cd40bb0e82))
  (pad "B2" smd circle (at -0.525 -0.525) (size 0.274 0.274) (layers "F.Cu" "F.Paste" "F.Mask") (tstamp c3dab9b9-d7d3-4d77-a1f2-1538dac21340))
  (pad "B3" smd circle (at -0.175 -0.525) (size 0.274 0.274) (layers "F.Cu" "F.Paste" "F.Mask") (tstamp 84da917b-cb5c-4574-869c-166ba8fb71bf))
  (pad "B4" smd circle (at 0.175 -0.525) (size 0.274 0.274) (layers "F.Cu" "F.Paste" "F.Mask") (tstamp c72bc03a-4039-4815-8e8d-f263b6d60664))
  (pad "B5" smd circle (at 0.525 -0.525) (size 0.274 0.274) (layers "F.Cu" "F.Paste" "F.Mask") (tstamp 37406ebd-ed64-4fbf-a0dd-57b32a85760f))
  (pad "B6" smd circle (at 0.875 -0.525) (size 0.274 0.274) (layers "F.Cu" "F.Paste" "F.Mask") (tstamp 6c216459-a089-4d2c-9e21-323e3468e682))
  (pad "C1" smd circle (at -0.875 -0.175) (size 0.274 0.274) (layers "F.Cu" "F.Paste" "F.Mask") (tstamp 818cffce-f20d-4e66-918f-247511eb7a5a))
  (pad "C2" smd circle (at -0.525 -0.175) (size 0.274 0.274) (layers "F.Cu" "F.Paste" "F.Mask") (tstamp d69b8017-a240-48cf-9f33-9fee7f7fc704))
  (pad "C3" smd circle (at -0.175 -0.175) (size 0.274 0.274) (layers "F.Cu" "F.Paste" "F.Mask") (tstamp 4f31b168-4255-4e6a-90ce-cc72862cb782))
  (pad "C4" smd circle (at 0.175 -0.175) (size 0.274 0.274) (layers "F.Cu" "F.Paste" "F.Mask") (tstamp c20d3a36-f792-46f8-83c1-2db0d8555b52))
  (pad "C5" smd circle (at 0.525 -0.175) (size 0.274 0.274) (layers "F.Cu" "F.Paste" "F.Mask") (tstamp b463fca8-6bab-479d-a9a2-25d770866030))
  (pad "C6" smd circle (at 0.875 -0.175) (size 0.274 0.274) (layers "F.Cu" "F.Paste" "F.Mask") (tstamp b368e9ae-7ef0-45ad-84af-917346a0c198))
  (pad "D1" smd circle (at -0.875 0.175) (size 0.274 0.274) (layers "F.Cu" "F.Paste" "F.Mask") (tstamp 2d58c0b8-228b-42c7-912d-c728425ad9ba))
  (pad "D2" smd circle (at -0.525 0.175) (size 0.274 0.274) (layers "F.Cu" "F.Paste" "F.Mask") (tstamp 89c3a729-c4b7-42ff-934f-fbb61b1adb8b))
  (pad "D3" smd circle (at -0.175 0.175) (size 0.274 0.274) (layers "F.Cu" "F.Paste" "F.Mask") (tstamp de39b15c-17db-40ad-a63d-3ec4a57f83ac))
  (pad "D4" smd circle (at 0.175 0.175) (size 0.274 0.274) (layers "F.Cu" "F.Paste" "F.Mask") (tstamp 548c5c09-d8a2-497f-97b1-3ffc3d1dc72d))
  (pad "D5" smd circle (at 0.525 0.175) (size 0.274 0.274) (layers "F.Cu" "F.Paste" "F.Mask") (tstamp cb75c2f8-870a-4ca3-a33f-540d87fa0a62))
  (pad "D6" smd circle (at 0.875 0.175) (size 0.274 0.274) (layers "F.Cu" "F.Paste" "F.Mask") (tstamp 0d9bd7da-fb34-479c-b4c6-06410468a268))
  (pad "E1" smd circle (at -0.875 0.525) (size 0.274 0.274) (layers "F.Cu" "F.Paste" "F.Mask") (tstamp ae7fa168-375d-4b8a-8b24-b004fb3116e3))
  (pad "E2" smd circle (at -0.525 0.525) (size 0.274 0.274) (layers "F.Cu" "F.Paste" "F.Mask") (tstamp 7a71762d-096f-472e-bed6-8de65ec50f4b))
  (pad "E3" smd circle (at -0.175 0.525) (size 0.274 0.274) (layers "F.Cu" "F.Paste" "F.Mask") (tstamp da9a62dd-a8b5-4903-abd3-989e06621ec0))
  (pad "E4" smd circle (at 0.175 0.525) (size 0.274 0.274) (layers "F.Cu" "F.Paste" "F.Mask") (tstamp 62ed103a-a05a-433e-a41f-609b684c53be))
  (pad "E5" smd circle (at 0.525 0.525) (size 0.274 0.274) (layers "F.Cu" "F.Paste" "F.Mask") (tstamp 8fb6ee8e-0ff4-4a2a-8334-dff06e7544f8))
  (pad "E6" smd circle (at 0.875 0.525) (size 0.274 0.274) (layers "F.Cu" "F.Paste" "F.Mask") (tstamp cd65edd6-1026-44d4-9f41-692723fc408d))
  (pad "F1" smd circle (at -0.875 0.875) (size 0.274 0.274) (layers "F.Cu" "F.Paste" "F.Mask") (tstamp f21d0dff-a31e-4b77-b0dd-78c8b3f0a63e))
  (pad "F2" smd circle (at -0.525 0.875) (size 0.274 0.274) (layers "F.Cu" "F.Paste" "F.Mask") (tstamp 1af086e1-c954-4ca5-9647-e4e9777c2f26))
  (pad "F3" smd circle (at -0.175 0.875) (size 0.274 0.274) (layers "F.Cu" "F.Paste" "F.Mask") (tstamp 6f1f94b0-3e59-48a7-ad34-72656b8f3c55))
  (pad "F4" smd circle (at 0.175 0.875) (size 0.274 0.274) (layers "F.Cu" "F.Paste" "F.Mask") (tstamp dc3d7aef-4501-4c1e-815f-16c20f3c8700))
  (pad "F5" smd circle (at 0.525 0.875) (size 0.274 0.274) (layers "F.Cu" "F.Paste" "F.Mask") (tstamp 176df59b-010c-4697-9f8f-1c08887a1f3a))
  (pad "F6" smd circle (at 0.875 0.875) (size 0.274 0.274) (layers "F.Cu" "F.Paste" "F.Mask") (tstamp 7f55e883-6803-4c93-8c53-ece1d3288bdf))
  (model "${KICAD6_3DMODEL_DIR}/Package_CSP.3dshapes/WLCSP-36_2.374x2.459mm_Layout6x6_P0.35mm.wrl"
    (offset (xyz 0 0 0))
    (scale (xyz 1 1 1))
    (rotate (xyz 0 0 0))
  )
)
