(footprint "EPSON_CE-USON-10_USON-10_3.2x2.5mm_P0.7mm" (version 20221018) (generator pcbnew)
  (layer "F.Cu")
  (descr "EPSON 2.5x3.7mm, https://www.microcrystal.com/fileadmin/Media/Products/RTC/Datasheet/RV-1805-C3.pdf")
  (tags "RTC")
  (attr smd)
  (fp_text reference "REF**" (at 0 -2.8) (layer "F.SilkS")
      (effects (font (size 1 1) (thickness 0.15)))
    (tstamp 00ca0322-feeb-4867-99ff-960ff67e5a60)
  )
  (fp_text value "EPSON_CE-USON-10_USON-10_3.2x2.5mm_P0.7mm" (at 0 2.8) (layer "F.Fab")
      (effects (font (size 1 1) (thickness 0.15)))
    (tstamp d62a8d79-16bc-4906-abca-bc53d6ab349f)
  )
  (fp_text user "${REFERENCE}" (at 0 0) (layer "F.Fab")
      (effects (font (size 0.5 0.5) (thickness 0.08)))
    (tstamp a9544190-38d8-45a9-9cc2-5a05a46c5dd9)
  )
  (fp_line (start -1.5 -2.03) (end -0.5 -2.03)
    (stroke (width 0.12) (type solid)) (layer "F.SilkS") (tstamp ec8a6f32-d74d-4e31-a8bc-7bd046ac60d7))
  (fp_line (start -0.5 -2.03) (end -0.5 -1.7)
    (stroke (width 0.12) (type solid)) (layer "F.SilkS") (tstamp e73bc9ae-485e-4fa2-a3c0-8e532a0c49d3))
  (fp_line (start -0.5 -1.7) (end 0.5 -1.7)
    (stroke (width 0.12) (type solid)) (layer "F.SilkS") (tstamp 0235bb4d-ed83-408f-b0a4-ee7ed1735a68))
  (fp_line (start -0.5 1.7) (end 0.5 1.7)
    (stroke (width 0.12) (type solid)) (layer "F.SilkS") (tstamp 7cee6283-00ac-4076-9c01-468c1c9c428f))
  (fp_line (start -1.75 -2.15) (end -1.75 2.15)
    (stroke (width 0.05) (type solid)) (layer "F.CrtYd") (tstamp a378cca6-92b1-4ce9-9bc9-5e9e26bd4a08))
  (fp_line (start -1.75 -2.15) (end 1.75 -2.15)
    (stroke (width 0.05) (type solid)) (layer "F.CrtYd") (tstamp b77cef92-bb85-44e1-9603-0896b59499d9))
  (fp_line (start -1.75 2.15) (end 1.75 2.15)
    (stroke (width 0.05) (type solid)) (layer "F.CrtYd") (tstamp a9a03598-3402-4e74-9f24-b40bb9cffdd1))
  (fp_line (start 1.75 -2.15) (end 1.75 2.15)
    (stroke (width 0.05) (type solid)) (layer "F.CrtYd") (tstamp c3890e35-50a9-4aba-bd9e-a07c34064d52))
  (fp_line (start -1.25 -1.1) (end -1.25 1.6)
    (stroke (width 0.1) (type solid)) (layer "F.Fab") (tstamp 396a2feb-cc72-4050-9df4-de6e45f8c7c9))
  (fp_line (start -1.25 -1.1) (end -0.75 -1.6)
    (stroke (width 0.1) (type default)) (layer "F.Fab") (tstamp 200eb88f-5bf1-4e79-b803-6cf55af60884))
  (fp_line (start -1.25 1.6) (end 1.25 1.6)
    (stroke (width 0.1) (type solid)) (layer "F.Fab") (tstamp ce660d83-c9cd-4206-b954-568d8ca0fcdb))
  (fp_line (start -0.75 -1.6) (end 1.25 -1.6)
    (stroke (width 0.1) (type solid)) (layer "F.Fab") (tstamp 3cc9a48f-51ef-4058-857c-b75f098ce53e))
  (fp_line (start 1.25 -1.6) (end 1.25 1.6)
    (stroke (width 0.1) (type solid)) (layer "F.Fab") (tstamp fdd95bba-99fe-4d3e-bc7e-9ca0eb301976))
  (pad "1" smd roundrect (at -1.05 -1.55) (size 0.9 0.7) (layers "F.Cu" "F.Paste" "F.Mask") (roundrect_rratio 0.25) (tstamp 669af7d5-6b6e-4b5f-96bf-52b5124fbf9d))
  (pad "2" smd roundrect (at -1.05 -0.7) (size 0.9 0.4) (layers "F.Cu" "F.Paste" "F.Mask") (roundrect_rratio 0.25) (tstamp c85b1c90-28de-4958-81fd-110b0a33eee0))
  (pad "3" smd roundrect (at -1.05 0) (size 0.9 0.4) (layers "F.Cu" "F.Paste" "F.Mask") (roundrect_rratio 0.25) (tstamp 30157a60-6e40-4585-8bf8-b3bb5a5fa920))
  (pad "4" smd roundrect (at -1.05 0.7) (size 0.9 0.4) (layers "F.Cu" "F.Paste" "F.Mask") (roundrect_rratio 0.25) (tstamp 88369fb4-bcd9-405a-a428-035502cbd4d3))
  (pad "5" smd roundrect (at -1.05 1.55) (size 0.9 0.7) (layers "F.Cu" "F.Paste" "F.Mask") (roundrect_rratio 0.25) (tstamp 98a30cbc-4f73-4bdc-9f96-66d8a1e11edb))
  (pad "6" smd roundrect (at 1.05 1.55) (size 0.9 0.7) (layers "F.Cu" "F.Paste" "F.Mask") (roundrect_rratio 0.25) (tstamp 4c7909f7-9565-43f3-a26b-616e7ed86d66))
  (pad "7" smd roundrect (at 1.05 0.7) (size 0.9 0.4) (layers "F.Cu" "F.Paste" "F.Mask") (roundrect_rratio 0.25) (tstamp 72ec5ab5-c09a-4a11-991d-e094f217b543))
  (pad "8" smd roundrect (at 1.05 0) (size 0.9 0.4) (layers "F.Cu" "F.Paste" "F.Mask") (roundrect_rratio 0.25) (tstamp f9074e83-8046-4dd1-99b4-531fdc45e0e2))
  (pad "9" smd roundrect (at 1.05 -0.7) (size 0.9 0.4) (layers "F.Cu" "F.Paste" "F.Mask") (roundrect_rratio 0.25) (tstamp ecc60578-29a4-455d-93ae-8fd90c0e26ae))
  (pad "10" smd roundrect (at 1.05 -1.55) (size 0.9 0.7) (layers "F.Cu" "F.Paste" "F.Mask") (roundrect_rratio 0.25) (tstamp 58e08c9f-7f18-4517-ad33-c230c73026db))
  (model "${KICAD7_3DMODEL_DIR}/Package_SON.3dshapes/EPSON_CE-USON-10_USON-10_3.2x2.5mm_P0.7mm.wrl"
    (offset (xyz 0 0 0))
    (scale (xyz 1 1 1))
    (rotate (xyz 0 0 0))
  )
)
