(footprint "Texas_S-PWSON-N10_ThermalVias" (version 20221018) (generator pcbnew)
  (layer "F.Cu")
  (descr "3x3mm Body, 0.5mm Pitch, S-PWSON-N10, DSC, http://www.ti.com/lit/ds/symlink/tps63060.pdf")
  (tags "0.5 S-PWSON-N10 DSC")
  (attr smd)
  (fp_text reference "REF**" (at 0 -2.8) (layer "F.SilkS")
      (effects (font (size 1 1) (thickness 0.15)))
    (tstamp f4f5bba5-bded-458d-b96b-27caafcdc817)
  )
  (fp_text value "Texas_S-PWSON-N10_ThermalVias" (at 0 2.8) (layer "F.Fab")
      (effects (font (size 1 1) (thickness 0.15)))
    (tstamp 3e6e007f-49d8-4eaa-893b-298a0bc0cc24)
  )
  (fp_text user "${REFERENCE}" (at 0 0) (layer "F.Fab")
      (effects (font (size 0.6 0.6) (thickness 0.09)))
    (tstamp e30e97de-b53e-4f37-99ad-cf2ada358786)
  )
  (fp_line (start -1.65 -1.65) (end -0.985 -1.65)
    (stroke (width 0.12) (type solid)) (layer "F.SilkS") (tstamp a33ea6c2-bb5b-4159-b6f5-e1dc61f788d3))
  (fp_line (start -1.65 1.65) (end -1.65 1.4)
    (stroke (width 0.12) (type solid)) (layer "F.SilkS") (tstamp 802561b4-81b5-4df9-92ca-e60eadcb8332))
  (fp_line (start -1.65 1.65) (end -0.985 1.65)
    (stroke (width 0.12) (type solid)) (layer "F.SilkS") (tstamp 927a6dc7-61ea-41ba-8d5c-d8af5df2a5b9))
  (fp_line (start 0.985 -1.65) (end 1.65 -1.65)
    (stroke (width 0.12) (type solid)) (layer "F.SilkS") (tstamp 5881999d-0e35-4297-b702-4e8392d9738f))
  (fp_line (start 0.985 1.65) (end 1.65 1.65)
    (stroke (width 0.12) (type solid)) (layer "F.SilkS") (tstamp 22331a38-5436-4b31-8df2-e213c668d782))
  (fp_line (start 1.65 -1.4) (end 1.65 -1.65)
    (stroke (width 0.12) (type solid)) (layer "F.SilkS") (tstamp b838c5a2-4f8b-4257-9ebb-26dfa2592144))
  (fp_line (start 1.65 1.4) (end 1.65 1.65)
    (stroke (width 0.12) (type solid)) (layer "F.SilkS") (tstamp 35e4d32f-2998-455c-9263-676f9d9b4535))
  (fp_line (start -2.15 -2.03) (end -2.15 2.03)
    (stroke (width 0.05) (type solid)) (layer "F.CrtYd") (tstamp 942fc640-11ec-4601-8b9a-8282238648f0))
  (fp_line (start -2.15 -2.03) (end 2.15 -2.03)
    (stroke (width 0.05) (type solid)) (layer "F.CrtYd") (tstamp f547c780-67cf-4f47-baa1-c7eee229d4a7))
  (fp_line (start -2.15 2.03) (end 2.15 2.03)
    (stroke (width 0.05) (type solid)) (layer "F.CrtYd") (tstamp 5d324f8e-df23-461f-ae53-18f76a4ba553))
  (fp_line (start 2.15 -2.03) (end 2.15 2.03)
    (stroke (width 0.05) (type solid)) (layer "F.CrtYd") (tstamp 95b13e13-c881-4239-ab7a-844024bc8634))
  (fp_line (start -1.575 1.575) (end -1.575 -0.7875)
    (stroke (width 0.1) (type solid)) (layer "F.Fab") (tstamp 143b880a-3112-4b8a-bf4b-163404b3a9d9))
  (fp_line (start -0.7875 -1.575) (end -1.575 -0.7875)
    (stroke (width 0.1) (type solid)) (layer "F.Fab") (tstamp 77f2014b-5397-4ffe-be80-084facbe3572))
  (fp_line (start -0.7875 -1.575) (end 1.575 -1.575)
    (stroke (width 0.1) (type solid)) (layer "F.Fab") (tstamp 1541ca4d-d994-4348-aef4-7612d353a409))
  (fp_line (start 1.575 -1.575) (end 1.575 1.575)
    (stroke (width 0.1) (type solid)) (layer "F.Fab") (tstamp f4600eea-77f5-4e34-90af-9ec9e84c9832))
  (fp_line (start 1.575 1.575) (end -1.575 1.575)
    (stroke (width 0.1) (type solid)) (layer "F.Fab") (tstamp 56ae2b31-b268-4f41-b1ac-f8ea0db43581))
  (pad "1" smd rect (at -1.76 -1) (size 0.28 0.28) (layers "F.Cu" "F.Paste" "F.Mask")
    (solder_mask_margin 0.07) (solder_paste_margin -0.025) (tstamp b29c5539-f867-478a-bb5a-2f61644a2b8b))
  (pad "1" smd oval (at -1.475 -1) (size 0.85 0.28) (layers "F.Cu" "F.Paste" "F.Mask")
    (solder_mask_margin 0.07) (solder_paste_margin -0.025) (tstamp debd3be5-7c39-4b46-a32c-3ac1bfc5d26e))
  (pad "2" smd rect (at -1.76 -0.5) (size 0.28 0.28) (layers "F.Cu" "F.Paste" "F.Mask")
    (solder_mask_margin 0.07) (solder_paste_margin -0.025) (tstamp 329bbde3-3f66-44c9-873c-fbf3ad04b794))
  (pad "2" smd oval (at -1.475 -0.5) (size 0.85 0.28) (layers "F.Cu" "F.Paste" "F.Mask")
    (solder_mask_margin 0.07) (solder_paste_margin -0.025) (tstamp 1eda520d-0abf-417d-9e68-ff21a3de2276))
  (pad "3" smd rect (at -1.76 0) (size 0.28 0.28) (layers "F.Cu" "F.Paste" "F.Mask")
    (solder_mask_margin 0.07) (solder_paste_margin -0.025) (tstamp 1291d83d-bb32-40cd-92a9-d424e021a6dd))
  (pad "3" smd oval (at -1.475 0) (size 0.85 0.28) (layers "F.Cu" "F.Paste" "F.Mask")
    (solder_mask_margin 0.07) (solder_paste_margin -0.025) (tstamp 0776d009-7598-4082-9f30-b4027fbe258c))
  (pad "4" smd rect (at -1.76 0.5) (size 0.28 0.28) (layers "F.Cu" "F.Paste" "F.Mask")
    (solder_mask_margin 0.07) (solder_paste_margin -0.025) (tstamp a9fbbd16-9d80-4991-abbc-c034b98ca2b0))
  (pad "4" smd oval (at -1.475 0.5) (size 0.85 0.28) (layers "F.Cu" "F.Paste" "F.Mask")
    (solder_mask_margin 0.07) (solder_paste_margin -0.025) (tstamp 4a87a1e8-a97e-4d23-9ec3-f5f50b71deb0))
  (pad "5" smd rect (at -1.76 1) (size 0.28 0.28) (layers "F.Cu" "F.Paste" "F.Mask")
    (solder_mask_margin 0.07) (solder_paste_margin -0.025) (tstamp 20b60813-72cd-4490-b361-af315142ffff))
  (pad "5" smd oval (at -1.475 1) (size 0.85 0.28) (layers "F.Cu" "F.Paste" "F.Mask")
    (solder_mask_margin 0.07) (solder_paste_margin -0.025) (tstamp c427a8b9-c0fb-4f23-894b-5324155aaf0b))
  (pad "6" smd oval (at 1.475 1) (size 0.85 0.28) (layers "F.Cu" "F.Paste" "F.Mask")
    (solder_mask_margin 0.07) (solder_paste_margin -0.025) (tstamp 0821a3f0-df5a-48f9-a660-e3438b04d572))
  (pad "6" smd rect (at 1.76 1) (size 0.28 0.28) (layers "F.Cu" "F.Paste" "F.Mask")
    (solder_mask_margin 0.07) (solder_paste_margin -0.025) (tstamp c88e6bc5-1cc9-4d59-a83f-b56a7f793f6d))
  (pad "7" smd oval (at 1.475 0.5) (size 0.85 0.28) (layers "F.Cu" "F.Paste" "F.Mask")
    (solder_mask_margin 0.07) (solder_paste_margin -0.025) (tstamp bc0c61de-b38d-4098-9286-1ab2a2493537))
  (pad "7" smd rect (at 1.76 0.5) (size 0.28 0.28) (layers "F.Cu" "F.Paste" "F.Mask")
    (solder_mask_margin 0.07) (solder_paste_margin -0.025) (tstamp 6858f51b-7a4b-411c-b29e-192f2797af5b))
  (pad "8" smd oval (at 1.475 0) (size 0.85 0.28) (layers "F.Cu" "F.Paste" "F.Mask")
    (solder_mask_margin 0.07) (solder_paste_margin -0.025) (tstamp 7e04afa7-22cf-444c-8576-1eff65b709c3))
  (pad "8" smd rect (at 1.76 0) (size 0.28 0.28) (layers "F.Cu" "F.Paste" "F.Mask")
    (solder_mask_margin 0.07) (solder_paste_margin -0.025) (tstamp 47d68b29-3c4f-4077-a482-d4a546f71019))
  (pad "9" smd oval (at 1.475 -0.5) (size 0.85 0.28) (layers "F.Cu" "F.Paste" "F.Mask")
    (solder_mask_margin 0.07) (solder_paste_margin -0.025) (tstamp 5cc371f5-e63f-41a0-b064-ce8120df9f4b))
  (pad "9" smd rect (at 1.76 -0.5) (size 0.28 0.28) (layers "F.Cu" "F.Paste" "F.Mask")
    (solder_mask_margin 0.07) (solder_paste_margin -0.025) (tstamp ef9e1fc2-0e25-4153-89a3-07ac8ce20e8c))
  (pad "10" smd oval (at 1.475 -1) (size 0.85 0.28) (layers "F.Cu" "F.Paste" "F.Mask")
    (solder_mask_margin 0.07) (solder_paste_margin -0.025) (tstamp 29f32a97-0982-419f-b0b1-b66602122b1e))
  (pad "10" smd rect (at 1.76 -1) (size 0.28 0.28) (layers "F.Cu" "F.Paste" "F.Mask")
    (solder_mask_margin 0.07) (solder_paste_margin -0.025) (tstamp aa79fa06-08bd-44c8-a39e-3e1481975bed))
  (pad "11" smd rect (at -0.6 -1.425) (size 0.23 0.6) (layers "F.Cu" "F.Paste" "F.Mask") (tstamp 58e95674-7d93-4b4c-a88c-a756b0ab6d9a))
  (pad "11" smd rect (at -0.6 -1.425) (size 0.25 0.7) (layers "F.Cu" "F.Paste" "F.Mask")
    (solder_paste_margin -0.05) (tstamp ccf650ba-35cf-40ca-bf48-e97415e16dba))
  (pad "11" smd rect (at -0.6 1.425) (size 0.23 0.6) (layers "F.Cu" "F.Paste" "F.Mask") (tstamp 9b814db7-5fa5-4281-904d-47e008935408))
  (pad "11" smd rect (at -0.6 1.425) (size 0.25 0.7) (layers "F.Cu" "F.Paste" "F.Mask")
    (solder_paste_margin -0.05) (tstamp d36446ec-d139-465e-9a91-11da2ef382c1))
  (pad "11" thru_hole circle (at -0.5 -0.5) (size 0.6 0.6) (drill 0.3) (layers "*.Cu" "*.Mask") (tstamp b4638031-4de7-4bc8-bceb-12c663c52983))
  (pad "11" thru_hole circle (at -0.5 0.5) (size 0.6 0.6) (drill 0.3) (layers "*.Cu" "*.Mask") (tstamp 49f03762-20ae-435d-a9e7-560d270f76a7))
  (pad "11" smd rect (at -0.435 -0.56) (size 0.65 0.9) (layers "F.Cu" "F.Paste" "F.Mask") (tstamp cac413c9-6533-4f4b-b7bc-e7e271656fff))
  (pad "11" smd rect (at -0.435 0.56) (size 0.65 0.9) (layers "F.Cu" "F.Paste" "F.Mask") (tstamp c30d1766-1688-48d4-9a27-c801f873841b))
  (pad "11" smd rect (at -0.2 -1.425) (size 0.23 0.6) (layers "F.Cu" "F.Paste" "F.Mask") (tstamp 2ce27dcd-03af-4479-bcaf-aefb34b901fa))
  (pad "11" smd rect (at -0.2 -1.425) (size 0.25 0.7) (layers "F.Cu" "F.Paste" "F.Mask")
    (solder_paste_margin -0.05) (tstamp d50696ac-5402-4f5a-ada2-86bd90402e11))
  (pad "11" smd rect (at -0.2 1.425) (size 0.23 0.6) (layers "F.Cu" "F.Paste" "F.Mask") (tstamp b01d5263-7327-4f65-8612-e42adae5aa15))
  (pad "11" smd rect (at -0.2 1.425) (size 0.25 0.7) (layers "F.Cu" "F.Paste" "F.Mask")
    (solder_paste_margin -0.05) (tstamp 977c2971-6507-4cca-9937-0c48333e1a90))
  (pad "11" smd rect (at -0.001 0) (size 2.3 2.3) (layers "B.Cu") (tstamp b5d5ec28-af79-4dd7-92d2-37176f60e1e9))
  (pad "11" thru_hole circle (at 0 0) (size 0.6 0.6) (drill 0.3) (layers "*.Cu" "*.Mask") (tstamp a7479ecf-ee34-4a62-8c44-f219c7f19d24))
  (pad "11" smd rect (at 0 0) (size 1.7 2.15) (layers "F.Cu" "F.Mask") (tstamp dad4326b-d7ef-4ecd-9e87-d1b914c47105))
  (pad "11" smd rect (at 0.2 -1.425) (size 0.23 0.6) (layers "F.Cu" "F.Paste" "F.Mask") (tstamp cdfb6f18-a4d7-48e9-ab8a-b373948a3a00))
  (pad "11" smd rect (at 0.2 -1.425) (size 0.25 0.7) (layers "F.Cu" "F.Paste" "F.Mask")
    (solder_paste_margin -0.05) (tstamp 2c7ed5d7-7f46-4dc7-a553-d4baf686d09f))
  (pad "11" smd rect (at 0.2 1.425) (size 0.23 0.6) (layers "F.Cu" "F.Paste" "F.Mask") (tstamp c23e36f7-2e8c-4c46-a709-d2b566268049))
  (pad "11" smd rect (at 0.2 1.425) (size 0.25 0.7) (layers "F.Cu" "F.Paste" "F.Mask")
    (solder_paste_margin -0.05) (tstamp aa44c19e-85cb-4dac-9a8f-14ebf85f3c53))
  (pad "11" smd rect (at 0.435 -0.56) (size 0.65 0.9) (layers "F.Cu" "F.Paste" "F.Mask") (tstamp 463ecb65-0954-4116-8358-aa6129838dba))
  (pad "11" smd rect (at 0.435 0.56) (size 0.65 0.9) (layers "F.Cu" "F.Paste" "F.Mask") (tstamp 96f9f99b-b533-447c-8f24-ccb2ec116d6f))
  (pad "11" thru_hole circle (at 0.5 -0.5) (size 0.6 0.6) (drill 0.3) (layers "*.Cu" "*.Mask") (tstamp caf9c448-ce07-45e6-95fd-80bd9d88703f))
  (pad "11" thru_hole circle (at 0.5 0.5) (size 0.6 0.6) (drill 0.3) (layers "*.Cu" "*.Mask") (tstamp 09c47017-46f2-4fb2-9bf3-2b621b56068f))
  (pad "11" smd rect (at 0.6 -1.425) (size 0.23 0.6) (layers "F.Cu" "F.Paste" "F.Mask") (tstamp 614b878e-58b3-4bdb-8f9f-94855b7322da))
  (pad "11" smd rect (at 0.6 -1.425) (size 0.25 0.7) (layers "F.Cu" "F.Paste" "F.Mask")
    (solder_paste_margin -0.05) (tstamp 18717939-8e9e-4f54-93e0-6851db97faab))
  (pad "11" smd rect (at 0.6 1.425) (size 0.23 0.6) (layers "F.Cu" "F.Paste" "F.Mask") (tstamp c840058d-c6a5-4052-8809-b4fabb02f976))
  (pad "11" smd rect (at 0.6 1.425) (size 0.25 0.7) (layers "F.Cu" "F.Paste" "F.Mask")
    (solder_paste_margin -0.05) (tstamp 8cdbaf91-241b-4ee2-b380-f15a57833deb))
  (model "${KICAD6_3DMODEL_DIR}/Package_SON.3dshapes/Texas_S-PWSON-N10.wrl"
    (offset (xyz 0 0 0))
    (scale (xyz 1 1 1))
    (rotate (xyz 0 0 0))
  )
)
