#FIG 3.2
Landscape
Center
Inches
Letter  
100.00
Single
-2
1200 2
1 4 0 1 0 7 50 -1 -1 0.000 1 0.0000 600 2587 188 188 600 2775 600 2400
1 4 0 1 0 7 50 -1 -1 0.000 1 0.0000 300 3187 188 188 300 3375 300 3000
1 4 0 1 0 7 50 -1 -1 0.000 1 0.0000 1200 1987 188 188 1200 2175 1200 1800
1 4 0 1 0 7 50 -1 -1 0.000 1 0.0000 1800 2587 188 188 1800 2775 1800 2400
1 4 0 1 0 7 50 -1 -1 0.000 1 0.0000 900 3187 188 188 900 3375 900 3000
1 4 0 1 0 7 50 -1 -1 0.000 1 0.0000 1500 3187 188 188 1500 3375 1500 3000
1 4 0 1 0 7 50 -1 -1 0.000 1 0.0000 2100 3187 188 188 2100 3375 2100 3000
2 1 0 2 0 7 50 -1 -1 0.000 0 0 -1 0 0 2
	 1056 2116 731 2450
2 1 0 2 0 7 50 -1 -1 0.000 0 0 -1 0 0 2
	 512 2758 370 3004
2 1 0 2 0 7 50 -1 -1 0.000 0 0 -1 0 0 2
	 1882 2764 2015 3010
2 1 0 2 0 7 50 -1 -1 0.000 0 0 -1 0 0 2
	 1349 2116 1686 2439
2 1 0 2 0 7 50 -1 -1 0.000 0 0 -1 0 0 2
	 707 2743 834 3007
2 1 0 2 0 7 50 -1 -1 0.000 0 0 -1 0 0 2
	 1719 2767 1583 3019
4 1 0 50 -1 0 24 0.0000 4 210 240 300 3300 A\001
4 1 0 50 -1 0 24 0.0000 4 210 240 600 2700 N\001
4 1 0 50 -1 0 24 0.0000 4 210 180 1200 2100 P\001
4 1 0 50 -1 0 24 0.0000 4 210 180 1800 2700 S\001
4 1 0 50 -1 0 24 0.0000 4 210 210 900 3300 B\001
4 1 0 50 -1 0 24 0.0000 4 210 210 1500 3300 C\001
4 1 0 50 -1 0 24 0.0000 4 210 240 2100 3300 D\001
