%!PS-Adobe-2.0 EPSF-2.0
%%Title: chulan-arch-1.fig
%%Creator: fig2dev Version 3.2 Patchlevel 4
%%CreationDate: Sun Oct 16 11:33:05 2005
%%For: cvs@kotik (CVS Account,,,)
%%BoundingBox: 0 0 578 510
%%Magnification: 1.0000
%%EndComments
/$F2psDict 200 dict def
$F2psDict begin
$F2psDict /mtrx matrix put
/col-1 {0 setgray} bind def
/col0 {0.000 0.000 0.000 srgb} bind def
/col1 {0.000 0.000 1.000 srgb} bind def
/col2 {0.000 1.000 0.000 srgb} bind def
/col3 {0.000 1.000 1.000 srgb} bind def
/col4 {1.000 0.000 0.000 srgb} bind def
/col5 {1.000 0.000 1.000 srgb} bind def
/col6 {1.000 1.000 0.000 srgb} bind def
/col7 {1.000 1.000 1.000 srgb} bind def
/col8 {0.000 0.000 0.560 srgb} bind def
/col9 {0.000 0.000 0.690 srgb} bind def
/col10 {0.000 0.000 0.820 srgb} bind def
/col11 {0.530 0.810 1.000 srgb} bind def
/col12 {0.000 0.560 0.000 srgb} bind def
/col13 {0.000 0.690 0.000 srgb} bind def
/col14 {0.000 0.820 0.000 srgb} bind def
/col15 {0.000 0.560 0.560 srgb} bind def
/col16 {0.000 0.690 0.690 srgb} bind def
/col17 {0.000 0.820 0.820 srgb} bind def
/col18 {0.560 0.000 0.000 srgb} bind def
/col19 {0.690 0.000 0.000 srgb} bind def
/col20 {0.820 0.000 0.000 srgb} bind def
/col21 {0.560 0.000 0.560 srgb} bind def
/col22 {0.690 0.000 0.690 srgb} bind def
/col23 {0.820 0.000 0.820 srgb} bind def
/col24 {0.500 0.190 0.000 srgb} bind def
/col25 {0.630 0.250 0.000 srgb} bind def
/col26 {0.750 0.380 0.000 srgb} bind def
/col27 {1.000 0.500 0.500 srgb} bind def
/col28 {1.000 0.630 0.630 srgb} bind def
/col29 {1.000 0.750 0.750 srgb} bind def
/col30 {1.000 0.880 0.880 srgb} bind def
/col31 {1.000 0.840 0.000 srgb} bind def
/col32 {0.773 0.715 0.590 srgb} bind def
/col33 {0.934 0.969 0.996 srgb} bind def
/col34 {0.859 0.793 0.648 srgb} bind def
/col35 {0.250 0.250 0.250 srgb} bind def
/col36 {0.500 0.500 0.500 srgb} bind def
/col37 {0.750 0.750 0.750 srgb} bind def
/col38 {0.875 0.875 0.875 srgb} bind def
/col39 {0.555 0.559 0.555 srgb} bind def
/col40 {0.664 0.664 0.664 srgb} bind def
/col41 {0.332 0.332 0.332 srgb} bind def
/col42 {0.555 0.555 0.555 srgb} bind def
/col43 {0.840 0.840 0.840 srgb} bind def
/col44 {0.680 0.680 0.680 srgb} bind def
/col45 {0.742 0.742 0.742 srgb} bind def
/col46 {0.316 0.316 0.316 srgb} bind def
/col47 {0.902 0.887 0.902 srgb} bind def
/col48 {0.000 0.000 0.285 srgb} bind def
/col49 {0.473 0.473 0.473 srgb} bind def
/col50 {0.188 0.203 0.188 srgb} bind def
/col51 {0.254 0.254 0.254 srgb} bind def
/col52 {0.777 0.711 0.586 srgb} bind def
/col53 {0.254 0.270 0.254 srgb} bind def
/col54 {0.266 0.266 0.266 srgb} bind def
/col55 {0.797 0.797 0.797 srgb} bind def
/col56 {0.996 0.945 0.824 srgb} bind def
/col57 {0.996 0.891 0.680 srgb} bind def
/col58 {0.996 0.820 0.473 srgb} bind def
/col59 {0.809 0.809 0.809 srgb} bind def
/col60 {0.598 0.598 0.598 srgb} bind def
/col61 {0.695 0.695 0.695 srgb} bind def
/col62 {0.863 0.613 0.574 srgb} bind def
/col63 {0.941 0.922 0.875 srgb} bind def
/col64 {0.762 0.762 0.762 srgb} bind def
/col65 {0.883 0.781 0.656 srgb} bind def
/col66 {0.879 0.879 0.879 srgb} bind def
/col67 {0.820 0.820 0.820 srgb} bind def
/col68 {0.926 0.926 0.926 srgb} bind def
/col69 {0.852 0.477 0.102 srgb} bind def
/col70 {0.941 0.891 0.102 srgb} bind def
/col71 {0.531 0.488 0.758 srgb} bind def
/col72 {0.836 0.836 0.836 srgb} bind def
/col73 {0.547 0.547 0.645 srgb} bind def
/col74 {0.289 0.289 0.289 srgb} bind def
/col75 {0.547 0.418 0.418 srgb} bind def
/col76 {0.352 0.352 0.352 srgb} bind def
/col77 {0.387 0.387 0.387 srgb} bind def
/col78 {0.715 0.605 0.449 srgb} bind def
/col79 {0.254 0.574 0.996 srgb} bind def
/col80 {0.746 0.438 0.230 srgb} bind def
/col81 {0.855 0.465 0.000 srgb} bind def
/col82 {0.852 0.719 0.000 srgb} bind def
/col83 {0.000 0.391 0.000 srgb} bind def
/col84 {0.352 0.418 0.230 srgb} bind def
/col85 {0.824 0.824 0.824 srgb} bind def
/col86 {0.555 0.555 0.641 srgb} bind def
/col87 {0.949 0.723 0.363 srgb} bind def
/col88 {0.535 0.598 0.418 srgb} bind def
/col89 {0.391 0.391 0.391 srgb} bind def
/col90 {0.715 0.898 0.996 srgb} bind def
/col91 {0.523 0.750 0.922 srgb} bind def
/col92 {0.738 0.738 0.738 srgb} bind def
/col93 {0.824 0.582 0.320 srgb} bind def
/col94 {0.594 0.820 0.992 srgb} bind def
/col95 {0.547 0.609 0.418 srgb} bind def
/col96 {0.965 0.418 0.000 srgb} bind def
/col97 {0.352 0.418 0.223 srgb} bind def
/col98 {0.547 0.609 0.418 srgb} bind def
/col99 {0.547 0.609 0.480 srgb} bind def
/col100 {0.094 0.289 0.094 srgb} bind def
/col101 {0.676 0.676 0.676 srgb} bind def
/col102 {0.965 0.738 0.352 srgb} bind def
/col103 {0.387 0.418 0.609 srgb} bind def
/col104 {0.965 0.965 0.965 srgb} bind def
/col105 {0.867 0.000 0.000 srgb} bind def
/col106 {0.676 0.676 0.676 srgb} bind def
/col107 {0.965 0.738 0.352 srgb} bind def
/col108 {0.676 0.676 0.676 srgb} bind def
/col109 {0.965 0.738 0.352 srgb} bind def
/col110 {0.387 0.418 0.609 srgb} bind def
/col111 {0.320 0.418 0.160 srgb} bind def
/col112 {0.578 0.578 0.578 srgb} bind def
/col113 {0.000 0.387 0.000 srgb} bind def
/col114 {0.000 0.387 0.289 srgb} bind def
/col115 {0.480 0.516 0.289 srgb} bind def
/col116 {0.902 0.738 0.480 srgb} bind def
/col117 {0.645 0.707 0.773 srgb} bind def
/col118 {0.418 0.418 0.578 srgb} bind def
/col119 {0.516 0.418 0.418 srgb} bind def
/col120 {0.320 0.609 0.289 srgb} bind def
/col121 {0.836 0.902 0.902 srgb} bind def
/col122 {0.320 0.387 0.387 srgb} bind def
/col123 {0.094 0.418 0.289 srgb} bind def
/col124 {0.609 0.645 0.707 srgb} bind def
/col125 {0.996 0.578 0.000 srgb} bind def
/col126 {0.996 0.578 0.000 srgb} bind def
/col127 {0.000 0.387 0.289 srgb} bind def
/col128 {0.480 0.516 0.289 srgb} bind def
/col129 {0.387 0.449 0.480 srgb} bind def
/col130 {0.902 0.738 0.480 srgb} bind def
/col131 {0.094 0.289 0.094 srgb} bind def
/col132 {0.965 0.738 0.352 srgb} bind def
/col133 {0.867 0.867 0.867 srgb} bind def
/col134 {0.949 0.930 0.824 srgb} bind def
/col135 {0.957 0.680 0.363 srgb} bind def
/col136 {0.582 0.805 0.598 srgb} bind def
/col137 {0.707 0.082 0.488 srgb} bind def
/col138 {0.930 0.930 0.930 srgb} bind def
/col139 {0.516 0.516 0.516 srgb} bind def
/col140 {0.480 0.480 0.480 srgb} bind def
/col141 {0.000 0.352 0.000 srgb} bind def
/col142 {0.902 0.449 0.449 srgb} bind def
/col143 {0.996 0.793 0.191 srgb} bind def
/col144 {0.160 0.473 0.289 srgb} bind def
/col145 {0.867 0.156 0.129 srgb} bind def
/col146 {0.129 0.348 0.773 srgb} bind def
/col147 {0.969 0.969 0.969 srgb} bind def
/col148 {0.898 0.898 0.898 srgb} bind def
/col149 {0.129 0.516 0.352 srgb} bind def
/col150 {0.523 0.508 0.523 srgb} bind def
/col151 {0.777 0.762 0.777 srgb} bind def
/col152 {0.523 0.523 0.523 srgb} bind def
/col153 {0.777 0.777 0.777 srgb} bind def
/col154 {0.902 0.902 0.902 srgb} bind def
/col155 {0.617 0.617 0.617 srgb} bind def
/col156 {0.441 0.457 0.441 srgb} bind def
/col157 {0.457 0.457 0.457 srgb} bind def
/col158 {0.934 0.980 0.996 srgb} bind def
/col159 {0.949 0.949 0.949 srgb} bind def
/col160 {0.840 0.824 0.840 srgb} bind def
/col161 {0.680 0.664 0.680 srgb} bind def
/col162 {0.758 0.758 0.758 srgb} bind def
/col163 {0.188 0.188 0.188 srgb} bind def
/col164 {0.316 0.332 0.316 srgb} bind def
/col165 {0.965 0.949 0.965 srgb} bind def
/col166 {0.398 0.398 0.398 srgb} bind def
/col167 {0.441 0.441 0.441 srgb} bind def

end
save
newpath 0 510 moveto 0 0 lineto 578 0 lineto 578 510 lineto closepath clip newpath
-53.3 527.2 translate
1 -1 scale

/cp {closepath} bind def
/ef {eofill} bind def
/gr {grestore} bind def
/gs {gsave} bind def
/sa {save} bind def
/rs {restore} bind def
/l {lineto} bind def
/m {moveto} bind def
/rm {rmoveto} bind def
/n {newpath} bind def
/s {stroke} bind def
/sh {show} bind def
/slc {setlinecap} bind def
/slj {setlinejoin} bind def
/slw {setlinewidth} bind def
/srgb {setrgbcolor} bind def
/rot {rotate} bind def
/sc {scale} bind def
/sd {setdash} bind def
/ff {findfont} bind def
/sf {setfont} bind def
/scf {scalefont} bind def
/sw {stringwidth} bind def
/tr {translate} bind def
/tnt {dup dup currentrgbcolor
  4 -2 roll dup 1 exch sub 3 -1 roll mul add
  4 -2 roll dup 1 exch sub 3 -1 roll mul add
  4 -2 roll dup 1 exch sub 3 -1 roll mul add srgb}
  bind def
/shd {dup dup currentrgbcolor 4 -2 roll mul 4 -2 roll mul
  4 -2 roll mul srgb} bind def
/reencdict 12 dict def /ReEncode { reencdict begin
/newcodesandnames exch def /newfontname exch def /basefontname exch def
/basefontdict basefontname findfont def /newfont basefontdict maxlength dict def
basefontdict { exch dup /FID ne { dup /Encoding eq
{ exch dup length array copy newfont 3 1 roll put }
{ exch newfont 3 1 roll put } ifelse } { pop pop } ifelse } forall
newfont /FontName newfontname put newcodesandnames aload pop
128 1 255 { newfont /Encoding get exch /.notdef put } for
newcodesandnames length 2 idiv { newfont /Encoding get 3 1 roll put } repeat
newfontname newfont definefont pop end } def
/isovec [
8#055 /minus 8#200 /grave 8#201 /acute 8#202 /circumflex 8#203 /tilde
8#204 /macron 8#205 /breve 8#206 /dotaccent 8#207 /dieresis
8#210 /ring 8#211 /cedilla 8#212 /hungarumlaut 8#213 /ogonek 8#214 /caron
8#220 /dotlessi 8#230 /oe 8#231 /OE
8#240 /space 8#241 /exclamdown 8#242 /cent 8#243 /sterling
8#244 /currency 8#245 /yen 8#246 /brokenbar 8#247 /section 8#250 /dieresis
8#251 /copyright 8#252 /ordfeminine 8#253 /guillemotleft 8#254 /logicalnot
8#255 /hyphen 8#256 /registered 8#257 /macron 8#260 /degree 8#261 /plusminus
8#262 /twosuperior 8#263 /threesuperior 8#264 /acute 8#265 /mu 8#266 /paragraph
8#267 /periodcentered 8#270 /cedilla 8#271 /onesuperior 8#272 /ordmasculine
8#273 /guillemotright 8#274 /onequarter 8#275 /onehalf
8#276 /threequarters 8#277 /questiondown 8#300 /Agrave 8#301 /Aacute
8#302 /Acircumflex 8#303 /Atilde 8#304 /Adieresis 8#305 /Aring
8#306 /AE 8#307 /Ccedilla 8#310 /Egrave 8#311 /Eacute
8#312 /Ecircumflex 8#313 /Edieresis 8#314 /Igrave 8#315 /Iacute
8#316 /Icircumflex 8#317 /Idieresis 8#320 /Eth 8#321 /Ntilde 8#322 /Ograve
8#323 /Oacute 8#324 /Ocircumflex 8#325 /Otilde 8#326 /Odieresis 8#327 /multiply
8#330 /Oslash 8#331 /Ugrave 8#332 /Uacute 8#333 /Ucircumflex
8#334 /Udieresis 8#335 /Yacute 8#336 /Thorn 8#337 /germandbls 8#340 /agrave
8#341 /aacute 8#342 /acircumflex 8#343 /atilde 8#344 /adieresis 8#345 /aring
8#346 /ae 8#347 /ccedilla 8#350 /egrave 8#351 /eacute
8#352 /ecircumflex 8#353 /edieresis 8#354 /igrave 8#355 /iacute
8#356 /icircumflex 8#357 /idieresis 8#360 /eth 8#361 /ntilde 8#362 /ograve
8#363 /oacute 8#364 /ocircumflex 8#365 /otilde 8#366 /odieresis 8#367 /divide
8#370 /oslash 8#371 /ugrave 8#372 /uacute 8#373 /ucircumflex
8#374 /udieresis 8#375 /yacute 8#376 /thorn 8#377 /ydieresis] def
/Times-Roman /Times-Roman-iso isovec ReEncode
 /DrawEllipse {
	/endangle exch def
	/startangle exch def
	/yrad exch def
	/xrad exch def
	/y exch def
	/x exch def
	/savematrix mtrx currentmatrix def
	x y tr xrad yrad sc 0 0 1 startangle endangle arc
	closepath
	savematrix setmatrix
	} def

/$F2psBegin {$F2psDict begin /$F2psEnteredState save def} def
/$F2psEnd {$F2psEnteredState restore end} def

$F2psBegin
10 setmiterlimit
0 slj 0 slc
 0.06000 0.06000 sc
%
% Fig objects follow
%
% 
% here starts figure with depth 70
% Polyline
15.000 slw
n 4800 7650 m 4950 7650 l 4950 7800 l 4800 7800 l
 cp gs col40 1.00 shd ef gr gs col40 s gr 
% Polyline
n 4200 5775 m 4350 5775 l 4350 6000 l 4200 6000 l
 cp gs col40 1.00 shd ef gr gs col40 s gr 
% Polyline
n 2925 5775 m 3075 5775 l 3075 6000 l 2925 6000 l
 cp gs col40 1.00 shd ef gr gs col40 s gr 
% Polyline
n 4200 5250 m 4350 5250 l 4350 5400 l 4200 5400 l
 cp gs col40 1.00 shd ef gr gs col40 s gr 
% Polyline
n 4125 4650 m 4275 4650 l 4275 4800 l 4125 4800 l
 cp gs col40 1.00 shd ef gr gs col40 s gr 
% Polyline
n 5250 4650 m 5400 4650 l 5400 4800 l 5250 4800 l
 cp gs col40 1.00 shd ef gr gs col40 s gr 
% Polyline
n 4200 6300 m 4350 6300 l 4350 6450 l 4200 6450 l
 cp gs col40 1.00 shd ef gr gs col40 s gr 
% Polyline
n 4200 7200 m 4350 7200 l 4350 7350 l 4200 7350 l
 cp gs col40 1.00 shd ef gr gs col40 s gr 
% Polyline
n 7125 5250 m 7275 5250 l 7275 5400 l 7125 5400 l
 cp gs col40 1.00 shd ef gr gs col40 s gr 
% Polyline
n 7125 7200 m 7275 7200 l 7275 7350 l 7125 7350 l
 cp gs col40 1.00 shd ef gr gs col40 s gr 
% Polyline
n 8625 7200 m 8775 7200 l 8775 7350 l 8625 7350 l
 cp gs col40 1.00 shd ef gr gs col40 s gr 
% Polyline
n 8625 5250 m 8775 5250 l 8775 5400 l 8625 5400 l
 cp gs col40 1.00 shd ef gr gs col40 s gr 
% Polyline
n 9750 7200 m 9900 7200 l 9900 7350 l 9750 7350 l
 cp gs col40 1.00 shd ef gr gs col40 s gr 
% Polyline
n 2325 7200 m 2625 7200 l 2625 7350 l 2325 7350 l
 cp gs col40 1.00 shd ef gr gs col40 s gr 
% Polyline
n 1425 5700 m 1650 6000 l 1875 5700 l 1800 5700 l 1800 5400 l 1875 5400 l
 1650 5100 l 1425 5400 l 1500 5400 l 1500 5700 l
 1425 5700 l  cp gs col40 1.00 shd ef gr gs col40 s gr 
% here ends figure;
% 
% here starts figure with depth 50
% Polyline
15.000 slw
n 4800 7200 m 3600 7200 l 3600 6450 l 4800 6450 l
 cp gs col0 s gr 
/Times-Roman-iso ff 270.00 scf sf
4200 6750 m
gs 1 -1 sc (uLan) dup sw pop 2 div neg 0 rm  col0 sh gr
/Times-Roman-iso ff 270.00 scf sf
4200 7050 m
gs 1 -1 sc (driver) dup sw pop 2 div neg 0 rm  col0 sh gr
% Polyline
n 4950 7350 m 6000 7350 l 6000 8100 l 4950 8100 l
 cp gs col0 s gr 
/Times-Roman-iso ff 270.00 scf sf
5400 7650 m
gs 1 -1 sc (RS485) dup sw pop 2 div neg 0 rm  col0 sh gr
/Times-Roman-iso ff 270.00 scf sf
5400 7950 m
gs 1 -1 sc (buffer) dup sw pop 2 div neg 0 rm  col0 sh gr
% Polyline
n 3600 7350 m 4800 7350 l 4800 8100 l 3600 8100 l
 cp gs col0 s gr 
/Times-Roman-iso ff 270.00 scf sf
4200 7650 m
gs 1 -1 sc (UART) dup sw pop 2 div neg 0 rm  col0 sh gr
/Times-Roman-iso ff 270.00 scf sf
4200 7950 m
gs 1 -1 sc (chip) dup sw pop 2 div neg 0 rm  col0 sh gr
% Polyline
n 6750 7350 m 7800 7350 l 7800 8100 l 6750 8100 l
 cp gs col0 s gr 
/Times-Roman-iso ff 270.00 scf sf
7200 7650 m
gs 1 -1 sc (UART) dup sw pop 2 div neg 0 rm  col0 sh gr
/Times-Roman-iso ff 270.00 scf sf
7200 7950 m
gs 1 -1 sc (RS485) dup sw pop 2 div neg 0 rm  col0 sh gr
% Polyline
n 8250 7350 m 9300 7350 l 9300 8100 l 8250 8100 l
 cp gs col0 s gr 
/Times-Roman-iso ff 270.00 scf sf
8700 7650 m
gs 1 -1 sc (UART) dup sw pop 2 div neg 0 rm  col0 sh gr
/Times-Roman-iso ff 270.00 scf sf
8700 7950 m
gs 1 -1 sc (RS485) dup sw pop 2 div neg 0 rm  col0 sh gr
% Polyline
n 6750 5400 m 7800 5400 l 7800 7200 l 6750 7200 l
 cp gs col0 s gr 
/Times-Roman-iso ff 270.00 scf sf
7275 5775 m
gs 1 -1 sc (uLan) dup sw pop 2 div neg 0 rm  col0 sh gr
/Times-Roman-iso ff 270.00 scf sf
7275 6075 m
gs 1 -1 sc (API and) dup sw pop 2 div neg 0 rm  col0 sh gr
/Times-Roman-iso ff 270.00 scf sf
7275 6375 m
gs 1 -1 sc (MCU) dup sw pop 2 div neg 0 rm  col0 sh gr
/Times-Roman-iso ff 270.00 scf sf
7275 6600 m
gs 1 -1 sc (support) dup sw pop 2 div neg 0 rm  col0 sh gr
/Times-Roman-iso ff 270.00 scf sf
7275 6900 m
gs 1 -1 sc (libraries) dup sw pop 2 div neg 0 rm  col0 sh gr
% Polyline
n 8250 5400 m 9300 5400 l 9300 7200 l 8250 7200 l
 cp gs col0 s gr 
/Times-Roman-iso ff 270.00 scf sf
8775 5775 m
gs 1 -1 sc (uLan) dup sw pop 2 div neg 0 rm  col0 sh gr
/Times-Roman-iso ff 270.00 scf sf
8775 6075 m
gs 1 -1 sc (API and) dup sw pop 2 div neg 0 rm  col0 sh gr
/Times-Roman-iso ff 270.00 scf sf
8775 6375 m
gs 1 -1 sc (MCU) dup sw pop 2 div neg 0 rm  col0 sh gr
/Times-Roman-iso ff 270.00 scf sf
8775 6600 m
gs 1 -1 sc (support) dup sw pop 2 div neg 0 rm  col0 sh gr
/Times-Roman-iso ff 270.00 scf sf
8775 6900 m
gs 1 -1 sc (libraries) dup sw pop 2 div neg 0 rm  col0 sh gr
% Polyline
n 6750 4200 m 7800 4200 l 7800 5250 l 6750 5250 l
 cp gs col0 s gr 
/Times-Roman-iso ff 270.00 scf sf
7275 5100 m
gs 1 -1 sc (interface) dup sw pop 2 div neg 0 rm  col0 sh gr
/Times-Roman-iso ff 270.00 scf sf
7275 4800 m
gs 1 -1 sc (object) dup sw pop 2 div neg 0 rm  col0 sh gr
/Times-Roman-iso ff 270.00 scf sf
7275 4500 m
gs 1 -1 sc (uLan) dup sw pop 2 div neg 0 rm  col0 sh gr
% Polyline
n 8250 4200 m 9300 4200 l 9300 5250 l 8250 5250 l
 cp gs col0 s gr 
/Times-Roman-iso ff 270.00 scf sf
8775 5100 m
gs 1 -1 sc (interface) dup sw pop 2 div neg 0 rm  col0 sh gr
/Times-Roman-iso ff 270.00 scf sf
8775 4800 m
gs 1 -1 sc (object) dup sw pop 2 div neg 0 rm  col0 sh gr
/Times-Roman-iso ff 270.00 scf sf
8775 4500 m
gs 1 -1 sc (uLan) dup sw pop 2 div neg 0 rm  col0 sh gr
% Polyline
n 4950 4125 m 5850 4125 l 5850 4650 l 4950 4650 l
 cp gs col0 s gr 
/Times-Roman-iso ff 270.00 scf sf
5400 4575 m
gs 1 -1 sc (model) dup sw pop 2 div neg 0 rm  col0 sh gr
/Times-Roman-iso ff 270.00 scf sf
5400 4350 m
gs 1 -1 sc (Dev 2) dup sw pop 2 div neg 0 rm  col0 sh gr
% Polyline
n 3750 4125 m 4650 4125 l 4650 4650 l 3750 4650 l
 cp gs col0 s gr 
/Times-Roman-iso ff 270.00 scf sf
4200 4575 m
gs 1 -1 sc (model) dup sw pop 2 div neg 0 rm  col0 sh gr
/Times-Roman-iso ff 270.00 scf sf
4200 4350 m
gs 1 -1 sc (Dev 1) dup sw pop 2 div neg 0 rm  col0 sh gr
% Polyline
n 4875 1575 m 5925 1575 l 5925 2400 l 4875 2400 l
 cp gs col0 s gr 
/Times-Roman-iso ff 270.00 scf sf
5400 2325 m
gs 1 -1 sc (Interface) dup sw pop 2 div neg 0 rm  col0 sh gr
/Times-Roman-iso ff 270.00 scf sf
5400 2100 m
gs 1 -1 sc (User) dup sw pop 2 div neg 0 rm  col0 sh gr
/Times-Roman-iso ff 270.00 scf sf
5400 1875 m
gs 1 -1 sc (Graphic) dup sw pop 2 div neg 0 rm  col0 sh gr
% Polyline
n 6750 900 m 7800 900 l 7800 2100 l 6750 2100 l
 cp gs col0 s gr 
/Times-Roman-iso ff 270.00 scf sf
7275 1125 m
gs 1 -1 sc (Local) dup sw pop 2 div neg 0 rm  col0 sh gr
/Times-Roman-iso ff 270.00 scf sf
7275 2025 m
gs 1 -1 sc (and UI) dup sw pop 2 div neg 0 rm  col0 sh gr
/Times-Roman-iso ff 270.00 scf sf
7275 1725 m
gs 1 -1 sc (keyboard) dup sw pop 2 div neg 0 rm  col0 sh gr
/Times-Roman-iso ff 270.00 scf sf
7275 1425 m
gs 1 -1 sc (display) dup sw pop 2 div neg 0 rm  col0 sh gr
% Polyline
n 6750 2175 m 7800 2175 l 7800 3675 l 6750 3675 l
 cp gs col0 s gr 
/Times-Roman-iso ff 270.00 scf sf
7275 3450 m
gs 1 -1 sc (cation) dup sw pop 2 div neg 0 rm  col0 sh gr
/Times-Roman-iso ff 270.00 scf sf
7275 3150 m
gs 1 -1 sc (appli-) dup sw pop 2 div neg 0 rm  col0 sh gr
/Times-Roman-iso ff 270.00 scf sf
7275 2850 m
gs 1 -1 sc (function) dup sw pop 2 div neg 0 rm  col0 sh gr
/Times-Roman-iso ff 270.00 scf sf
7275 2550 m
gs 1 -1 sc (Device) dup sw pop 2 div neg 0 rm  col0 sh gr
% Ellipse
n 3525 3675 75 75 0 360 DrawEllipse gs col0 s gr

% Ellipse
n 3825 3825 75 75 0 360 DrawEllipse gs col0 s gr

% Ellipse
n 4050 3600 75 75 0 360 DrawEllipse gs col0 s gr

% Ellipse
n 4350 3825 75 75 0 360 DrawEllipse gs col0 s gr

% Ellipse
n 4575 3525 75 75 0 360 DrawEllipse gs col0 s gr

% Ellipse
n 5025 3750 75 75 0 360 DrawEllipse gs col0 s gr

% Ellipse
n 5325 3525 75 75 0 360 DrawEllipse gs col0 s gr

% Ellipse
n 5625 3600 75 75 0 360 DrawEllipse gs col0 s gr

% Ellipse
n 1800 3525 75 75 0 360 DrawEllipse gs col0 s gr

% Ellipse
n 2025 3150 75 75 0 360 DrawEllipse gs col0 s gr

% Ellipse
n 2475 3450 75 75 0 360 DrawEllipse gs col0 s gr

% Ellipse
n 2775 3600 75 75 0 360 DrawEllipse gs col0 s gr

% Ellipse
n 3150 3375 75 75 0 360 DrawEllipse gs col0 s gr

% Ellipse
n 5400 3825 75 75 0 360 DrawEllipse gs col0 s gr

% Ellipse
n 1125 2325 75 75 0 360 DrawEllipse gs col0 s gr

% Ellipse
n 1650 2475 75 75 0 360 DrawEllipse gs col0 s gr

% Ellipse
n 1200 3525 75 75 0 360 DrawEllipse gs col0 s gr

% Ellipse
n 6772 3953 75 75 0 360 DrawEllipse gs col0 s gr

% Ellipse
n 6975 3825 75 75 0 360 DrawEllipse gs col0 s gr

% Ellipse
n 7200 3975 75 75 0 360 DrawEllipse gs col0 s gr

% Ellipse
n 7500 3900 75 75 0 360 DrawEllipse gs col0 s gr

% Ellipse
n 9525 4725 75 75 0 360 DrawEllipse gs col0 s gr

% Ellipse
n 9675 5625 75 75 0 360 DrawEllipse gs col0 s gr

% Ellipse
n 8400 3975 75 75 0 360 DrawEllipse gs col0 s gr

% Ellipse
n 8625 3825 75 75 0 360 DrawEllipse gs col0 s gr

% Polyline
n 1200 7200 m 1200 6000 l 4500 6000 l 4500 6300 l 3450 6300 l 3450 7200 l
 2250 7200 l
 cp gs col0 s gr 
% Polyline
n 1200 7350 m 1200 8550 l 4500 8550 l 4500 8250 l 3450 8250 l 3450 7350 l
 2250 7350 l
 cp gs col0 s gr 
% Polyline
30.000 slw
n 5400 8100 m 5400 8400 l 8700 8400 l
 8700 8100 l gs col0 s gr 
% Polyline
n 7200 8100 m
 7200 8400 l gs col0 s gr 
% Polyline
7.500 slw
 [60] 0 sd
n 6525 300 m 7950 300 l 7950 8775 l 6525 8775 l
 cp gs col0 s gr  [] 0 sd
% Polyline
 [60] 0 sd
n 8100 300 m 10500 300 l 10500 8775 l 8100 8775 l
 cp gs col0 s gr  [] 0 sd
% Polyline
 [60] 0 sd
n 975 975 m 6075 975 l 6075 5850 l 975 5850 l
 cp gs col0 s gr  [] 0 sd
% Polyline
 [60] 0 sd
n 900 300 m 6225 300 l 6225 8775 l 900 8775 l
 cp gs col0 s gr  [] 0 sd
% Polyline
15.000 slw
n 2475 5400 m 4950 5400 l 4950 5775 l 2475 5775 l
 cp gs col0 s gr 
% Polyline
n 9450 7350 m 10350 7350 l 10350 8100 l 9450 8100 l
 cp gs col0 s gr 
% Polyline
n 9450 5400 m 10350 5400 l 10350 7200 l 9450 7200 l
 cp gs col0 s gr 
% Polyline
n 3675 4800 m 5925 4800 l 5925 5250 l 3675 5250 l
 cp gs col0 s gr 
% Polyline
7.500 slw
n 5625 3675 m
 5550 4125 l gs col0 s gr 
% Polyline
n 5400 3900 m
 5400 4125 l gs col0 s gr 
% Polyline
n 5025 3825 m
 5175 4125 l gs col0 s gr 
% Polyline
n 4575 3600 m
 4500 4125 l gs col0 s gr 
% Polyline
n 4350 3900 m
 4350 4125 l gs col0 s gr 
% Polyline
n 4050 3675 m
 4125 4125 l gs col0 s gr 
% Polyline
n 3900 3900 m
 3975 4125 l gs col0 s gr 
% Polyline
n 3600 3750 m
 3825 4125 l gs col0 s gr 
% Polyline
n 5325 3600 m
 5325 4125 l gs col0 s gr 
% Polyline
15.000 slw
n 1050 3900 m 2250 3900 l 2250 5100 l 1050 5100 l
 cp gs col0 s gr 
% Polyline
n 2400 4050 m 3300 4050 l 3300 5100 l 2400 5100 l
 cp gs col0 s gr 
% Polyline
7.500 slw
n 1275 3600 m
 1425 3900 l gs col0 s gr 
% Polyline
n 1800 3600 m
 1725 3900 l gs col0 s gr 
% Polyline
n 2025 3225 m
 1875 3900 l gs col0 s gr 
% Polyline
n 2475 3525 m
 2625 4050 l gs col0 s gr 
% Polyline
n 2775 3675 m
 2775 4050 l gs col0 s gr 
% Polyline
n 3150 3375 m
 3000 4050 l gs col0 s gr 
% Polyline
15.000 slw
n 2850 1575 m 4800 1575 l 4800 2400 l 2850 2400 l
 cp gs col0 s gr 
% Polyline
n 1050 1575 m 2775 1575 l 2775 2400 l 1050 2400 l
 cp gs col0 s gr 
% Polyline
7.500 slw
n 1650 2550 m
 1575 3900 l gs col0 s gr 
% Polyline
n 1125 2400 m
 1500 3900 l gs col0 s gr 
% Polyline
15.000 slw
n 1950 2475 m 5625 2475 l 5625 2850 l 1950 2850 l
 cp gs col0 s gr 
% Polyline
7.500 slw
n 8475 4050 m
 8625 4200 l gs col0 s gr 
% Polyline
n 8625 3900 m
 8775 4200 l gs col0 s gr 
% Polyline
n 9450 4800 m
 9300 4875 l gs col0 s gr 
% Polyline
n 9300 4950 m
 9600 5550 l gs col0 s gr 
% Polyline
n 6825 4050 m
 6900 4200 l gs col0 s gr 
% Polyline
n 6975 3900 m
 7050 4200 l gs col0 s gr 
% Polyline
n 7200 4050 m
 7200 4200 l gs col0 s gr 
% Polyline
n 7500 3975 m
 7425 4200 l gs col0 s gr 
% Polyline
15.000 slw
n 8250 900 m 10350 900 l 10350 2100 l 8250 2100 l
 cp gs col0 s gr 
% Polyline
n 8250 2175 m 10350 2175 l 10350 3675 l 8250 3675 l
 cp gs col0 s gr 
/Times-Roman-iso ff 270.00 scf sf
2400 6450 m
gs 1 -1 sc (Operating System) dup sw pop 2 div neg 0 rm  col0 sh gr
/Times-Roman-iso ff 270.00 scf sf
2400 6780 m
gs 1 -1 sc (Linux/Windows) dup sw pop 2 div neg 0 rm  col0 sh gr
/Times-Roman-iso ff 270.00 scf sf
2400 7110 m
gs 1 -1 sc (DOS) dup sw pop 2 div neg 0 rm  col0 sh gr
/Times-Roman-iso ff 270.00 scf sf
2250 7800 m
gs 1 -1 sc (Control Computer) dup sw pop 2 div neg 0 rm  col0 sh gr
/Times-Roman-iso ff 270.00 scf sf
2250 8130 m
gs 1 -1 sc (Hardware \(PC\)) dup sw pop 2 div neg 0 rm  col0 sh gr
/Times-Roman-iso ff 360.00 scf sf
3150 675 m
gs 1 -1 sc (Control System) dup sw pop 2 div neg 0 rm  col0 sh gr
/Times-Roman-iso ff 360.00 scf sf
7200 675 m
gs 1 -1 sc (Device 1) dup sw pop 2 div neg 0 rm  col0 sh gr
/Times-Roman-iso ff 360.00 scf sf
9000 675 m
gs 1 -1 sc (Device 2) dup sw pop 2 div neg 0 rm  col0 sh gr
/Times-Roman-iso ff 360.00 scf sf
3150 1425 m
gs 1 -1 sc (CHROMuLAN) dup sw pop 2 div neg 0 rm  col0 sh gr
/Times-Roman-iso ff 270.00 scf sf
3675 5700 m
gs 1 -1 sc (uLan API) dup sw pop 2 div neg 0 rm  col0 sh gr
/Times-Roman-iso ff 270.00 scf sf
9825 7650 m
gs 1 -1 sc (more) dup sw pop 2 div neg 0 rm  col0 sh gr
/Times-Roman-iso ff 270.00 scf sf
9825 7980 m
gs 1 -1 sc (HW) dup sw pop 2 div neg 0 rm  col0 sh gr
/Times-Roman-iso ff 270.00 scf sf
4725 5100 m
gs 1 -1 sc (uLan net. model) dup sw pop 2 div neg 0 rm  col0 sh gr
/Times-Roman-iso ff 270.00 scf sf
1650 4950 m
gs 1 -1 sc (ULD files) dup sw pop 2 div neg 0 rm  col0 sh gr
/Times-Roman-iso ff 270.00 scf sf
1650 4650 m
gs 1 -1 sc (ULF, ULC) dup sw pop 2 div neg 0 rm  col0 sh gr
/Times-Roman-iso ff 270.00 scf sf
1650 4350 m
gs 1 -1 sc (storage) dup sw pop 2 div neg 0 rm  col0 sh gr
/Times-Roman-iso ff 270.00 scf sf
2850 4950 m
gs 1 -1 sc (\(mem\)) dup sw pop 2 div neg 0 rm  col0 sh gr
/Times-Roman-iso ff 270.00 scf sf
2850 4650 m
gs 1 -1 sc (storage) dup sw pop 2 div neg 0 rm  col0 sh gr
/Times-Roman-iso ff 270.00 scf sf
2850 4350 m
gs 1 -1 sc (Temp.) dup sw pop 2 div neg 0 rm  col0 sh gr
/Times-Roman-iso ff 270.00 scf sf
1650 4125 m
gs 1 -1 sc (Persistent) dup sw pop 2 div neg 0 rm  col0 sh gr
/Times-Roman-iso ff 270.00 scf sf
3825 1875 m
gs 1 -1 sc (Control logic) dup sw pop 2 div neg 0 rm  col0 sh gr
/Times-Roman-iso ff 270.00 scf sf
3825 2175 m
gs 1 -1 sc (IFPS interpretter) dup sw pop 2 div neg 0 rm  col0 sh gr
/Times-Roman-iso ff 270.00 scf sf
1950 1800 m
gs 1 -1 sc (User scripts) dup sw pop 2 div neg 0 rm  col0 sh gr
/Times-Roman-iso ff 270.00 scf sf
1950 2025 m
gs 1 -1 sc (parameters and) dup sw pop 2 div neg 0 rm  col0 sh gr
/Times-Roman-iso ff 270.00 scf sf
1950 2250 m
gs 1 -1 sc (acquired data) dup sw pop 2 div neg 0 rm  col0 sh gr
/Times-Roman-iso ff 270.00 scf sf
3750 2775 m
gs 1 -1 sc (Object tree browser and handler) dup sw pop 2 div neg 0 rm  col0 sh gr
/Times-Roman-iso ff 270.00 scf sf
4125 3150 m
gs 1 -1 sc (Object tree of branches, properties) dup sw pop 2 div neg 0 rm  col0 sh gr
/Times-Roman-iso ff 270.00 scf sf
4725 3375 m
gs 1 -1 sc (and process variables) dup sw pop 2 div neg 0 rm  col0 sh gr
/Times-Roman-iso ff 270.00 scf sf
9900 6600 m
gs 1 -1 sc (sensors) dup sw pop 2 div neg 0 rm  col0 sh gr
/Times-Roman-iso ff 270.00 scf sf
9900 6900 m
gs 1 -1 sc (etc.) dup sw pop 2 div neg 0 rm  col0 sh gr
/Times-Roman-iso ff 270.00 scf sf
9900 6375 m
gs 1 -1 sc (llers) dup sw pop 2 div neg 0 rm  col0 sh gr
/Times-Roman-iso ff 270.00 scf sf
9900 6075 m
gs 1 -1 sc (Contro-) dup sw pop 2 div neg 0 rm  col0 sh gr
/Times-Roman-iso ff 270.00 scf sf
9975 5025 m
gs 1 -1 sc (meters) dup sw pop 2 div neg 0 rm  col0 sh gr
/Times-Roman-iso ff 270.00 scf sf
9675 4125 m
gs 1 -1 sc (variables and) dup sw pop 2 div neg 0 rm  col0 sh gr
/Times-Roman-iso ff 270.00 scf sf
9975 4425 m
gs 1 -1 sc (device) dup sw pop 2 div neg 0 rm  col0 sh gr
/Times-Roman-iso ff 270.00 scf sf
9975 4725 m
gs 1 -1 sc (para-) dup sw pop 2 div neg 0 rm  col0 sh gr
/Times-Roman-iso ff 270.00 scf sf
9750 3900 m
gs 1 -1 sc (Process) dup sw pop 2 div neg 0 rm  col0 sh gr
/Times-Roman-iso ff 270.00 scf sf
9300 3525 m
gs 1 -1 sc (over uLan objects) dup sw pop 2 div neg 0 rm  col0 sh gr
/Times-Roman-iso ff 270.00 scf sf
9300 3225 m
gs 1 -1 sc (comunicating) dup sw pop 2 div neg 0 rm  col0 sh gr
/Times-Roman-iso ff 270.00 scf sf
9300 2925 m
gs 1 -1 sc (and application) dup sw pop 2 div neg 0 rm  col0 sh gr
/Times-Roman-iso ff 270.00 scf sf
9300 2625 m
gs 1 -1 sc (Device logic) dup sw pop 2 div neg 0 rm  col0 sh gr
/Times-Roman-iso ff 270.00 scf sf
9300 1275 m
gs 1 -1 sc (Local display) dup sw pop 2 div neg 0 rm  col0 sh gr
/Times-Roman-iso ff 270.00 scf sf
9300 1575 m
gs 1 -1 sc (keyboard, UI) dup sw pop 2 div neg 0 rm  col0 sh gr
/Times-Roman-iso ff 270.00 scf sf
9300 1875 m
gs 1 -1 sc (and time program) dup sw pop 2 div neg 0 rm  col0 sh gr
% here ends figure;
$F2psEnd
rs
showpage
