%!PS-Adobe-2.0 EPSF-2.0
%%Title: obr3.eps
%%Creator: fig2dev Version 3.2 Patchlevel 0-beta3
%%CreationDate: Tue Jul  7 23:02:56 1998
%%For: pisa@thor (Pavel Pisa)
%%Orientation: Portrait
%%BoundingBox: 0 0 526 99
%%Pages: 0
%%BeginSetup
%%EndSetup
%%Magnification: 1.0000
%%EndComments
/$F2psDict 200 dict def
$F2psDict begin
$F2psDict /mtrx matrix put
/col-1 {0 setgray} bind def
/col0 {0.000 0.000 0.000 srgb} bind def
/col1 {0.000 0.000 1.000 srgb} bind def
/col2 {0.000 1.000 0.000 srgb} bind def
/col3 {0.000 1.000 1.000 srgb} bind def
/col4 {1.000 0.000 0.000 srgb} bind def
/col5 {1.000 0.000 1.000 srgb} bind def
/col6 {1.000 1.000 0.000 srgb} bind def
/col7 {1.000 1.000 1.000 srgb} bind def
/col8 {0.000 0.000 0.560 srgb} bind def
/col9 {0.000 0.000 0.690 srgb} bind def
/col10 {0.000 0.000 0.820 srgb} bind def
/col11 {0.530 0.810 1.000 srgb} bind def
/col12 {0.000 0.560 0.000 srgb} bind def
/col13 {0.000 0.690 0.000 srgb} bind def
/col14 {0.000 0.820 0.000 srgb} bind def
/col15 {0.000 0.560 0.560 srgb} bind def
/col16 {0.000 0.690 0.690 srgb} bind def
/col17 {0.000 0.820 0.820 srgb} bind def
/col18 {0.560 0.000 0.000 srgb} bind def
/col19 {0.690 0.000 0.000 srgb} bind def
/col20 {0.820 0.000 0.000 srgb} bind def
/col21 {0.560 0.000 0.560 srgb} bind def
/col22 {0.690 0.000 0.690 srgb} bind def
/col23 {0.820 0.000 0.820 srgb} bind def
/col24 {0.500 0.190 0.000 srgb} bind def
/col25 {0.630 0.250 0.000 srgb} bind def
/col26 {0.750 0.380 0.000 srgb} bind def
/col27 {1.000 0.500 0.500 srgb} bind def
/col28 {1.000 0.630 0.630 srgb} bind def
/col29 {1.000 0.750 0.750 srgb} bind def
/col30 {1.000 0.880 0.880 srgb} bind def
/col31 {1.000 0.840 0.000 srgb} bind def

end
save
-17.0 109.0 translate
1 -1 scale

/cp {closepath} bind def
/ef {eofill} bind def
/gr {grestore} bind def
/gs {gsave} bind def
/sa {save} bind def
/rs {restore} bind def
/l {lineto} bind def
/m {moveto} bind def
/rm {rmoveto} bind def
/n {newpath} bind def
/s {stroke} bind def
/sh {show} bind def
/slc {setlinecap} bind def
/slj {setlinejoin} bind def
/slw {setlinewidth} bind def
/srgb {setrgbcolor} bind def
/rot {rotate} bind def
/sc {scale} bind def
/sd {setdash} bind def
/ff {findfont} bind def
/sf {setfont} bind def
/scf {scalefont} bind def
/sw {stringwidth} bind def
/tr {translate} bind def
/tnt {dup dup currentrgbcolor
  4 -2 roll dup 1 exch sub 3 -1 roll mul add
  4 -2 roll dup 1 exch sub 3 -1 roll mul add
  4 -2 roll dup 1 exch sub 3 -1 roll mul add srgb}
  bind def
/shd {dup dup currentrgbcolor 4 -2 roll mul 4 -2 roll mul
  4 -2 roll mul srgb} bind def
/reencdict 12 dict def /ReEncode { reencdict begin
/newcodesandnames exch def /newfontname exch def /basefontname exch def
/basefontdict basefontname findfont def /newfont basefontdict maxlength dict def
basefontdict { exch dup /FID ne { dup /Encoding eq
{ exch dup length array copy newfont 3 1 roll put }
{ exch newfont 3 1 roll put } ifelse } { pop pop } ifelse } forall
newfont /FontName newfontname put newcodesandnames aload pop
128 1 255 { newfont /Encoding get exch /.notdef put } for
newcodesandnames length 2 idiv { newfont /Encoding get 3 1 roll put } repeat
newfontname newfont definefont pop end } def
/isovec [
8#200 /grave 8#201 /acute 8#202 /circumflex 8#203 /tilde
8#204 /macron 8#205 /breve 8#206 /dotaccent 8#207 /dieresis
8#210 /ring 8#211 /cedilla 8#212 /hungarumlaut 8#213 /ogonek 8#214 /caron
8#220 /dotlessi 8#230 /oe 8#231 /OE
8#240 /space 8#241 /exclamdown 8#242 /cent 8#243 /sterling
8#244 /currency 8#245 /yen 8#246 /brokenbar 8#247 /section 8#250 /dieresis
8#251 /copyright 8#252 /ordfeminine 8#253 /guillemotleft 8#254 /logicalnot
8#255 /endash 8#256 /registered 8#257 /macron 8#260 /degree 8#261 /plusminus
8#262 /twosuperior 8#263 /threesuperior 8#264 /acute 8#265 /mu 8#266 /paragraph
8#267 /periodcentered 8#270 /cedilla 8#271 /onesuperior 8#272 /ordmasculine
8#273 /guillemotright 8#274 /onequarter 8#275 /onehalf
8#276 /threequarters 8#277 /questiondown 8#300 /Agrave 8#301 /Aacute
8#302 /Acircumflex 8#303 /Atilde 8#304 /Adieresis 8#305 /Aring
8#306 /AE 8#307 /Ccedilla 8#310 /Egrave 8#311 /Eacute
8#312 /Ecircumflex 8#313 /Edieresis 8#314 /Igrave 8#315 /Iacute
8#316 /Icircumflex 8#317 /Idieresis 8#320 /Eth 8#321 /Ntilde 8#322 /Ograve
8#323 /Oacute 8#324 /Ocircumflex 8#325 /Otilde 8#326 /Odieresis 8#327 /multiply
8#330 /Oslash 8#331 /Ugrave 8#332 /Uacute 8#333 /Ucircumflex
8#334 /Udieresis 8#335 /Yacute 8#336 /Thorn 8#337 /germandbls 8#340 /agrave
8#341 /aacute 8#342 /acircumflex 8#343 /atilde 8#344 /adieresis 8#345 /aring
8#346 /ae 8#347 /ccedilla 8#350 /egrave 8#351 /eacute
8#352 /ecircumflex 8#353 /edieresis 8#354 /igrave 8#355 /iacute
8#356 /icircumflex 8#357 /idieresis 8#360 /eth 8#361 /ntilde 8#362 /ograve
8#363 /oacute 8#364 /ocircumflex 8#365 /otilde 8#366 /odieresis 8#367 /divide
8#370 /oslash 8#371 /ugrave 8#372 /uacute 8#373 /ucircumflex
8#374 /udieresis 8#375 /yacute 8#376 /thorn 8#377 /ydieresis] def
/CourierNew-Bold /CourierNew-Bold-iso isovec ReEncode
 /DrawEllipse {
	/endangle exch def
	/startangle exch def
	/yrad exch def
	/xrad exch def
	/y exch def
	/x exch def
	/savematrix mtrx currentmatrix def
	x y tr xrad yrad sc 0 0 1 startangle endangle arc
	closepath
	savematrix setmatrix
	} def

/$F2psBegin {$F2psDict begin /$F2psEnteredState save def} def
/$F2psEnd {$F2psEnteredState restore end} def
%%EndProlog

$F2psBegin
10 setmiterlimit
n -1000 2815 m -1000 -1000 l 10040 -1000 l 10040 2815 l cp clip
 0.06000 0.06000 sc
% Polyline
7.500 slw
n 2116 836 m 2116 1072 l gs col0 s gr 
% Polyline
n 3464 836 m 3464 1072 l gs col0 s gr 
% Polyline
n 4120 836 m 4120 1072 l gs col0 s gr 
% Polyline
n 4820 836 m 4820 1072 l gs col0 s gr 
% Polyline
n 5472 836 m 5472 1072 l gs col0 s gr 
% Polyline
n 6172 836 m 6172 1072 l gs col0 s gr 
% Polyline
n 6804 836 m 6804 1072 l gs col0 s gr 
% Polyline
n 2764 836 m 2764 1072 l gs col0 s gr 
% Polyline
n 2808 956 m 3424 956 l gs col0 s gr 
% Polyline
0.000 slw
n 3408 916 m 3408 996 l 3464 956 l 3408 916 l  cp gs 0.00 setgray ef gr 
% Polyline
7.500 slw
n 3408 916 m 3408 996 l 3464 956 l 3408 916 l  cp gs col0 s gr 
% Polyline
0.000 slw
n 2824 996 m 2824 916 l 2764 956 l 2824 996 l  cp gs 0.00 setgray ef gr 
% Polyline
7.500 slw
n 2824 996 m 2824 916 l 2764 956 l 2824 996 l  cp gs col0 s gr 
% Polyline
n 4160 956 m 4776 956 l gs col0 s gr 
% Polyline
0.000 slw
n 4760 916 m 4760 996 l 4820 956 l 4760 916 l  cp gs 0.00 setgray ef gr 
% Polyline
7.500 slw
n 4760 916 m 4760 996 l 4820 956 l 4760 916 l  cp gs col0 s gr 
% Polyline
0.000 slw
n 4176 996 m 4176 916 l 4120 956 l 4176 996 l  cp gs 0.00 setgray ef gr 
% Polyline
7.500 slw
n 4176 996 m 4176 916 l 4120 956 l 4176 996 l  cp gs col0 s gr 
% Polyline
n 5516 956 m 6128 956 l gs col0 s gr 
% Polyline
0.000 slw
n 6112 916 m 6112 996 l 6172 956 l 6112 916 l  cp gs 0.00 setgray ef gr 
% Polyline
7.500 slw
n 6112 916 m 6112 996 l 6172 956 l 6112 916 l  cp gs col0 s gr 
% Polyline
0.000 slw
n 5532 996 m 5532 916 l 5472 956 l 5532 996 l  cp gs 0.00 setgray ef gr 
% Polyline
7.500 slw
n 5532 996 m 5532 916 l 5472 956 l 5532 996 l  cp gs col0 s gr 
% Polyline
n 2156 956 m 2252 956 l gs col0 s gr 
% Polyline
0.000 slw
n 2172 996 m 2172 916 l 2112 956 l 2172 996 l  cp gs 0.00 setgray ef gr 
% Polyline
7.500 slw
n 2172 996 m 2172 916 l 2112 956 l 2172 996 l  cp gs col0 s gr 
% Polyline
n 6828 768 m 6888 768 l gs col0 s gr 
% Polyline
n 6828 768 m 6828 720 l gs col0 s gr 
% Polyline
n 6888 768 m 6888 720 l gs col0 s gr 
% Polyline
n 6828 600 m 6828 740 l gs col0 s gr 
% Polyline
n 6888 768 m 6948 768 l gs col0 s gr 
% Polyline
n 6888 768 m 6888 600 l gs col0 s gr 
% Polyline
n 6944 768 m 6944 600 l gs col0 s gr 
% Polyline
n 6888 600 m 6948 600 l gs col0 s gr 
% Polyline
n 6944 768 m 7004 768 l gs col0 s gr 
% Polyline
n 6944 768 m 6944 600 l gs col0 s gr 
% Polyline
n 7004 768 m 7004 600 l gs col0 s gr 
% Polyline
n 6944 600 m 7004 600 l gs col0 s gr 
% Polyline
n 7004 768 m 7064 768 l gs col0 s gr 
% Polyline
n 7004 768 m 7004 600 l gs col0 s gr 
% Polyline
n 7064 768 m 7064 600 l gs col0 s gr 
% Polyline
n 7004 600 m 7064 600 l gs col0 s gr 
% Polyline
n 7064 768 m 7124 768 l gs col0 s gr 
% Polyline
n 7064 768 m 7064 600 l gs col0 s gr 
% Polyline
n 7124 768 m 7124 600 l gs col0 s gr 
% Polyline
n 7064 600 m 7124 600 l gs col0 s gr 
% Polyline
n 7124 768 m 7184 768 l gs col0 s gr 
% Polyline
n 7124 768 m 7124 600 l gs col0 s gr 
% Polyline
n 7180 768 m 7180 600 l gs col0 s gr 
% Polyline
n 7124 600 m 7184 600 l gs col0 s gr 
% Polyline
n 7180 768 m 7240 768 l gs col0 s gr 
% Polyline
n 7180 768 m 7180 600 l gs col0 s gr 
% Polyline
n 7240 768 m 7240 600 l gs col0 s gr 
% Polyline
n 7180 600 m 7240 600 l gs col0 s gr 
% Polyline
n 7240 768 m 7300 768 l gs col0 s gr 
% Polyline
n 7240 768 m 7240 600 l gs col0 s gr 
% Polyline
n 7300 768 m 7300 600 l gs col0 s gr 
% Polyline
n 7240 600 m 7300 600 l gs col0 s gr 
% Polyline
n 7300 768 m 7360 768 l gs col0 s gr 
% Polyline
n 7300 768 m 7300 720 l gs col0 s gr 
% Polyline
n 7360 768 m 7360 720 l gs col0 s gr 
% Polyline
n 7416 600 m 7476 600 l gs col0 s gr 
% Polyline
n 7416 600 m 7416 648 l gs col0 s gr 
% Polyline
n 7476 600 m 7476 648 l gs col0 s gr 
% Polyline
n 7360 600 m 7360 740 l gs col0 s gr 
% Polyline
n 7360 600 m 7420 600 l gs col0 s gr 
% Polyline
n 7360 600 m 7360 648 l gs col0 s gr 
% Polyline
n 7420 600 m 7420 648 l gs col0 s gr 
% Polyline
n 6180 600 m 6180 768 l gs col0 s gr 
% Polyline
n 6180 768 m 6768 768 l gs col0 s gr 
% Polyline
n 6828 600 m 6768 600 l gs col0 s gr 
% Polyline
n 6768 600 m 6768 768 l gs col0 s gr 
% Polyline
n 6180 600 m 6064 600 l gs col0 s gr 
% Polyline
 [15 60] 60 sd
n 6064 600 m 5472 600 l gs col0 s gr  [] 0 sd
% Polyline
n 4824 600 m 4824 768 l gs col0 s gr 
% Polyline
n 4824 768 m 5412 768 l gs col0 s gr 
% Polyline
n 5472 600 m 5416 600 l gs col0 s gr 
% Polyline
n 5416 600 m 5416 768 l gs col0 s gr 
% Polyline
n 4824 600 m 4708 600 l gs col0 s gr 
% Polyline
n 3468 600 m 3468 768 l gs col0 s gr 
% Polyline
n 3468 768 m 4056 768 l gs col0 s gr 
% Polyline
n 4116 600 m 4060 600 l gs col0 s gr 
% Polyline
n 4060 600 m 4060 768 l gs col0 s gr 
% Polyline
n 3468 600 m 3352 600 l gs col0 s gr 
% Polyline
 [15 60] 60 sd
n 4708 600 m 4116 600 l gs col0 s gr  [] 0 sd
% Polyline
 [15 60] 60 sd
n 3352 600 m 2760 600 l gs col0 s gr  [] 0 sd
% Polyline
n 2112 600 m 2116 768 l gs col0 s gr 
% Polyline
n 2112 768 m 2704 768 l gs col0 s gr 
% Polyline
n 2760 600 m 2704 600 l gs col0 s gr 
% Polyline
n 2704 600 m 2704 768 l gs col0 s gr 
% Polyline
n 2112 600 m 1640 600 l gs col0 s gr 
% Polyline
n 300 600 m 360 600 l gs col0 s gr 
% Polyline
n 300 600 m 300 648 l gs col0 s gr 
% Polyline
n 360 600 m 360 648 l gs col0 s gr 
% Polyline
n 360 768 m 420 768 l gs col0 s gr 
% Polyline
n 360 768 m 360 720 l gs col0 s gr 
% Polyline
n 420 768 m 420 720 l gs col0 s gr 
% Polyline
n 360 600 m 360 740 l gs col0 s gr 
% Polyline
n 420 768 m 480 768 l gs col0 s gr 
% Polyline
n 420 768 m 420 600 l gs col0 s gr 
% Polyline
n 480 768 m 480 600 l gs col0 s gr 
% Polyline
n 420 600 m 480 600 l gs col0 s gr 
% Polyline
n 480 768 m 540 768 l gs col0 s gr 
% Polyline
n 480 768 m 480 600 l gs col0 s gr 
% Polyline
n 540 768 m 540 600 l gs col0 s gr 
% Polyline
n 480 600 m 540 600 l gs col0 s gr 
% Polyline
n 540 768 m 600 768 l gs col0 s gr 
% Polyline
n 540 768 m 540 600 l gs col0 s gr 
% Polyline
n 600 768 m 600 600 l gs col0 s gr 
% Polyline
n 540 600 m 600 600 l gs col0 s gr 
% Polyline
n 600 768 m 660 768 l gs col0 s gr 
% Polyline
n 600 768 m 600 600 l gs col0 s gr 
% Polyline
n 660 768 m 660 600 l gs col0 s gr 
% Polyline
n 600 600 m 660 600 l gs col0 s gr 
% Polyline
n 660 768 m 720 768 l gs col0 s gr 
% Polyline
n 660 768 m 660 600 l gs col0 s gr 
% Polyline
n 720 768 m 720 600 l gs col0 s gr 
% Polyline
n 660 600 m 720 600 l gs col0 s gr 
% Polyline
n 720 768 m 780 768 l gs col0 s gr 
% Polyline
n 720 768 m 720 600 l gs col0 s gr 
% Polyline
n 780 768 m 780 600 l gs col0 s gr 
% Polyline
n 720 600 m 780 600 l gs col0 s gr 
% Polyline
n 780 768 m 840 768 l gs col0 s gr 
% Polyline
n 780 768 m 780 600 l gs col0 s gr 
% Polyline
n 840 768 m 840 600 l gs col0 s gr 
% Polyline
n 780 600 m 840 600 l gs col0 s gr 
% Polyline
n 836 600 m 896 600 l gs col0 s gr 
% Polyline
n 836 600 m 836 648 l gs col0 s gr 
% Polyline
n 896 600 m 896 648 l gs col0 s gr 
% Polyline
n 960 600 m 1020 600 l gs col0 s gr 
% Polyline
n 960 600 m 960 648 l gs col0 s gr 
% Polyline
n 1020 600 m 1020 648 l gs col0 s gr 
% Polyline
n 900 600 m 960 600 l gs col0 s gr 
% Polyline
n 900 600 m 900 648 l gs col0 s gr 
% Polyline
n 960 600 m 960 648 l gs col0 s gr 
% Polyline
 [15 60] 60 sd
n 1008 600 m 1640 600 l gs col0 s gr  [] 0 sd
% Polyline
n 1036 836 m 1036 1072 l gs col0 s gr 
% Polyline
n 1080 956 m 2064 956 l gs col0 s gr 
% Polyline
0.000 slw
n 2052 916 m 2052 996 l 2108 956 l 2052 916 l  cp gs 0.00 setgray ef gr 
% Polyline
7.500 slw
n 2052 916 m 2052 996 l 2108 956 l 2052 916 l  cp gs col0 s gr 
% Polyline
0.000 slw
n 1092 996 m 1092 916 l 1036 956 l 1092 996 l  cp gs 0.00 setgray ef gr 
% Polyline
7.500 slw
n 1092 996 m 1092 916 l 1036 956 l 1092 996 l  cp gs col0 s gr 
% Polyline
n 8164 600 m 8224 600 l gs col0 s gr 
% Polyline
n 8164 600 m 8164 648 l gs col0 s gr 
% Polyline
n 8224 600 m 8224 648 l gs col0 s gr 
% Polyline
n 8224 768 m 8284 768 l gs col0 s gr 
% Polyline
n 8224 768 m 8224 720 l gs col0 s gr 
% Polyline
n 8284 768 m 8284 720 l gs col0 s gr 
% Polyline
n 8224 600 m 8224 740 l gs col0 s gr 
% Polyline
n 8284 768 m 8344 768 l gs col0 s gr 
% Polyline
n 8284 768 m 8284 600 l gs col0 s gr 
% Polyline
n 8344 768 m 8344 600 l gs col0 s gr 
% Polyline
n 8284 600 m 8344 600 l gs col0 s gr 
% Polyline
n 8344 768 m 8404 768 l gs col0 s gr 
% Polyline
n 8344 768 m 8344 600 l gs col0 s gr 
% Polyline
n 8404 768 m 8404 600 l gs col0 s gr 
% Polyline
n 8344 600 m 8404 600 l gs col0 s gr 
% Polyline
n 8404 768 m 8464 768 l gs col0 s gr 
% Polyline
n 8404 768 m 8404 600 l gs col0 s gr 
% Polyline
n 8464 768 m 8464 600 l gs col0 s gr 
% Polyline
n 8404 600 m 8464 600 l gs col0 s gr 
% Polyline
n 8464 768 m 8524 768 l gs col0 s gr 
% Polyline
n 8464 768 m 8464 600 l gs col0 s gr 
% Polyline
n 8524 768 m 8524 600 l gs col0 s gr 
% Polyline
n 8464 600 m 8524 600 l gs col0 s gr 
% Polyline
n 8524 768 m 8584 768 l gs col0 s gr 
% Polyline
n 8524 768 m 8524 600 l gs col0 s gr 
% Polyline
n 8584 768 m 8584 600 l gs col0 s gr 
% Polyline
n 8524 600 m 8584 600 l gs col0 s gr 
% Polyline
n 8584 768 m 8644 768 l gs col0 s gr 
% Polyline
n 8584 768 m 8584 600 l gs col0 s gr 
% Polyline
n 8644 768 m 8644 600 l gs col0 s gr 
% Polyline
n 8584 600 m 8644 600 l gs col0 s gr 
% Polyline
n 8644 768 m 8704 768 l gs col0 s gr 
% Polyline
n 8644 768 m 8644 600 l gs col0 s gr 
% Polyline
n 8704 768 m 8704 600 l gs col0 s gr 
% Polyline
n 8644 600 m 8704 600 l gs col0 s gr 
% Polyline
n 8700 600 m 8760 600 l gs col0 s gr 
% Polyline
n 8700 600 m 8700 648 l gs col0 s gr 
% Polyline
n 8760 600 m 8760 648 l gs col0 s gr 
% Polyline
n 8824 600 m 8884 600 l gs col0 s gr 
% Polyline
n 8824 600 m 8824 648 l gs col0 s gr 
% Polyline
n 8884 600 m 8884 648 l gs col0 s gr 
% Polyline
n 8764 600 m 8824 600 l gs col0 s gr 
% Polyline
n 8764 600 m 8764 648 l gs col0 s gr 
% Polyline
n 8824 600 m 8824 648 l gs col0 s gr 
% Polyline
n 6876 956 m 6972 956 l gs col0 s gr 
% Polyline
0.000 slw
n 6892 996 m 6892 916 l 6832 956 l 6892 996 l  cp gs 0.00 setgray ef gr 
% Polyline
7.500 slw
n 6892 996 m 6892 916 l 6832 956 l 6892 996 l  cp gs col0 s gr 
% Polyline
n 8232 836 m 8232 1072 l gs col0 s gr 
% Polyline
n 8816 836 m 8816 1072 l gs col0 s gr 
% Polyline
n 8748 956 m 8604 956 l gs col0 s gr 
% Polyline
0.000 slw
n 8736 916 m 8736 996 l 8792 956 l 8736 916 l  cp gs 0.00 setgray ef gr 
% Polyline
7.500 slw
n 8736 916 m 8736 996 l 8792 956 l 8736 916 l  cp gs col0 s gr 
% Ellipse
n 7625 670 28 28 0 360 DrawEllipse gs 0.00 setgray ef gr gs col0 s gr

% Ellipse
n 7800 670 28 28 0 360 DrawEllipse gs 0.00 setgray ef gr gs col0 s gr

% Ellipse
n 7975 670 28 28 0 360 DrawEllipse gs 0.00 setgray ef gr gs col0 s gr

/CourierNew-Bold-iso ff 300.00 scf sf
4500 375 m
gs 1 -1 sc (Bus request and release) dup sw pop 2 div neg 0 rm  col0 sh gr
/CourierNew-Bold-iso ff 150.00 scf sf
600 1275 m
gs 1 -1 sc (LAdr) dup sw pop 2 div neg 0 rm  col0 sh gr
/CourierNew-Bold-iso ff 150.00 scf sf
1500 1275 m
gs 1 -1 sc (delay) dup sw pop 2 div neg 0 rm  col0 sh gr
/CourierNew-Bold-iso ff 150.00 scf sf
1500 1455 m
gs 1 -1 sc (\(LAdr-Adr-1\)) dup sw pop 2 div neg 0 rm  col0 sh gr
/CourierNew-Bold-iso ff 150.00 scf sf
1500 1635 m
gs 1 -1 sc (mod 16 + 4) dup sw pop 2 div neg 0 rm  col0 sh gr
/CourierNew-Bold-iso ff 150.00 scf sf
2400 1275 m
gs 1 -1 sc (first) dup sw pop 2 div neg 0 rm  col0 sh gr
/CourierNew-Bold-iso ff 150.00 scf sf
2400 1455 m
gs 1 -1 sc (connect) dup sw pop 2 div neg 0 rm  col0 sh gr
/CourierNew-Bold-iso ff 150.00 scf sf
2400 1635 m
gs 1 -1 sc (mark) dup sw pop 2 div neg 0 rm  col0 sh gr
/CourierNew-Bold-iso ff 150.00 scf sf
3150 1275 m
gs 1 -1 sc (delay) dup sw pop 2 div neg 0 rm  col0 sh gr
/CourierNew-Bold-iso ff 150.00 scf sf
3150 1455 m
gs 1 -1 sc (Adr) dup sw pop 2 div neg 0 rm  col0 sh gr
/CourierNew-Bold-iso ff 150.00 scf sf
3150 1815 m
gs 1 -1 sc (+1) dup sw pop 2 div neg 0 rm  col0 sh gr
/CourierNew-Bold-iso ff 150.00 scf sf
4425 1275 m
gs 1 -1 sc (delay) dup sw pop 2 div neg 0 rm  col0 sh gr
/CourierNew-Bold-iso ff 150.00 scf sf
4425 1635 m
gs 1 -1 sc (and 3 +1) dup sw pop 2 div neg 0 rm  col0 sh gr
/CourierNew-Bold-iso ff 150.00 scf sf
3150 1635 m
gs 1 -1 sc (and 3) dup sw pop 2 div neg 0 rm  col0 sh gr
/CourierNew-Bold-iso ff 150.00 scf sf
5775 1275 m
gs 1 -1 sc (delay) dup sw pop 2 div neg 0 rm  col0 sh gr
/CourierNew-Bold-iso ff 150.00 scf sf
4425 1455 m
gs 1 -1 sc (\(Adr shr 2\)) dup sw pop 2 div neg 0 rm  col0 sh gr
/CourierNew-Bold-iso ff 150.00 scf sf
5775 1455 m
gs 1 -1 sc (\(Adr shr 4\)) dup sw pop 2 div neg 0 rm  col0 sh gr
/CourierNew-Bold-iso ff 150.00 scf sf
5775 1635 m
gs 1 -1 sc (and 3 +1) dup sw pop 2 div neg 0 rm  col0 sh gr
/CourierNew-Bold-iso ff 150.00 scf sf
8625 1275 m
gs 1 -1 sc (release) dup sw pop 2 div neg 0 rm  col0 sh gr
/CourierNew-Bold-iso ff 150.00 scf sf
7350 1635 m
gs 1 -1 sc (with DAdr of) dup sw pop 2 div neg 0 rm  col0 sh gr
/CourierNew-Bold-iso ff 150.00 scf sf
7350 1815 m
gs 1 -1 sc (first frame) dup sw pop 2 div neg 0 rm  col0 sh gr
/CourierNew-Bold-iso ff 150.00 scf sf
7350 1275 m
gs 1 -1 sc (transfer of data) dup sw pop 2 div neg 0 rm  col0 sh gr
/CourierNew-Bold-iso ff 150.00 scf sf
7350 1455 m
gs 1 -1 sc (frames beginning) dup sw pop 2 div neg 0 rm  col0 sh gr
/CourierNew-Bold-iso ff 150.00 scf sf
8625 1455 m
gs 1 -1 sc (of bus by) dup sw pop 2 div neg 0 rm  col0 sh gr
/CourierNew-Bold-iso ff 150.00 scf sf
8625 1635 m
gs 1 -1 sc (LAdr=Adr) dup sw pop 2 div neg 0 rm  col0 sh gr
/CourierNew-Bold-iso ff 150.00 scf sf
8625 1815 m
gs 1 -1 sc (or 80h) dup sw pop 2 div neg 0 rm  col0 sh gr
$F2psEnd
rs
