%!PS-Adobe-2.0 EPSF-2.0
%%Title: obr2.eps
%%Creator: fig2dev Version 3.2 Patchlevel 0-beta3
%%CreationDate: Tue Jul  7 23:02:44 1998
%%For: pisa@thor (Pavel Pisa)
%%Orientation: Portrait
%%BoundingBox: 0 0 428 99
%%Pages: 0
%%BeginSetup
%%EndSetup
%%Magnification: 1.0000
%%EndComments
/$F2psDict 200 dict def
$F2psDict begin
$F2psDict /mtrx matrix put
/col-1 {0 setgray} bind def
/col0 {0.000 0.000 0.000 srgb} bind def
/col1 {0.000 0.000 1.000 srgb} bind def
/col2 {0.000 1.000 0.000 srgb} bind def
/col3 {0.000 1.000 1.000 srgb} bind def
/col4 {1.000 0.000 0.000 srgb} bind def
/col5 {1.000 0.000 1.000 srgb} bind def
/col6 {1.000 1.000 0.000 srgb} bind def
/col7 {1.000 1.000 1.000 srgb} bind def
/col8 {0.000 0.000 0.560 srgb} bind def
/col9 {0.000 0.000 0.690 srgb} bind def
/col10 {0.000 0.000 0.820 srgb} bind def
/col11 {0.530 0.810 1.000 srgb} bind def
/col12 {0.000 0.560 0.000 srgb} bind def
/col13 {0.000 0.690 0.000 srgb} bind def
/col14 {0.000 0.820 0.000 srgb} bind def
/col15 {0.000 0.560 0.560 srgb} bind def
/col16 {0.000 0.690 0.690 srgb} bind def
/col17 {0.000 0.820 0.820 srgb} bind def
/col18 {0.560 0.000 0.000 srgb} bind def
/col19 {0.690 0.000 0.000 srgb} bind def
/col20 {0.820 0.000 0.000 srgb} bind def
/col21 {0.560 0.000 0.560 srgb} bind def
/col22 {0.690 0.000 0.690 srgb} bind def
/col23 {0.820 0.000 0.820 srgb} bind def
/col24 {0.500 0.190 0.000 srgb} bind def
/col25 {0.630 0.250 0.000 srgb} bind def
/col26 {0.750 0.380 0.000 srgb} bind def
/col27 {1.000 0.500 0.500 srgb} bind def
/col28 {1.000 0.630 0.630 srgb} bind def
/col29 {1.000 0.750 0.750 srgb} bind def
/col30 {1.000 0.880 0.880 srgb} bind def
/col31 {1.000 0.840 0.000 srgb} bind def

end
save
-19.0 105.0 translate
1 -1 scale

/cp {closepath} bind def
/ef {eofill} bind def
/gr {grestore} bind def
/gs {gsave} bind def
/sa {save} bind def
/rs {restore} bind def
/l {lineto} bind def
/m {moveto} bind def
/rm {rmoveto} bind def
/n {newpath} bind def
/s {stroke} bind def
/sh {show} bind def
/slc {setlinecap} bind def
/slj {setlinejoin} bind def
/slw {setlinewidth} bind def
/srgb {setrgbcolor} bind def
/rot {rotate} bind def
/sc {scale} bind def
/sd {setdash} bind def
/ff {findfont} bind def
/sf {setfont} bind def
/scf {scalefont} bind def
/sw {stringwidth} bind def
/tr {translate} bind def
/tnt {dup dup currentrgbcolor
  4 -2 roll dup 1 exch sub 3 -1 roll mul add
  4 -2 roll dup 1 exch sub 3 -1 roll mul add
  4 -2 roll dup 1 exch sub 3 -1 roll mul add srgb}
  bind def
/shd {dup dup currentrgbcolor 4 -2 roll mul 4 -2 roll mul
  4 -2 roll mul srgb} bind def
 /DrawEllipse {
	/endangle exch def
	/startangle exch def
	/yrad exch def
	/xrad exch def
	/y exch def
	/x exch def
	/savematrix mtrx currentmatrix def
	x y tr xrad yrad sc 0 0 1 startangle endangle arc
	closepath
	savematrix setmatrix
	} def

/$F2psBegin {$F2psDict begin /$F2psEnteredState save def} def
/$F2psEnd {$F2psEnteredState restore end} def
%%EndProlog

$F2psBegin
10 setmiterlimit
n -1000 2735 m -1000 -1000 l 8439 -1000 l 8439 2735 l cp clip
 0.06000 0.06000 sc
% Polyline
7.500 slw
n 343 615 m 439 615 l gs col0 s gr 
% Polyline
n 343 615 m 343 663 l gs col0 s gr 
% Polyline
n 439 615 m 439 663 l gs col0 s gr 
% Polyline
n 439 779 m 539 779 l gs col0 s gr 
% Polyline
n 439 779 m 439 731 l gs col0 s gr 
% Polyline
n 539 779 m 539 731 l gs col0 s gr 
% Polyline
n 439 615 m 439 755 l gs col0 s gr 
% Polyline
n 539 779 m 635 779 l gs col0 s gr 
% Polyline
n 539 779 m 539 615 l gs col0 s gr 
% Polyline
n 635 779 m 635 615 l gs col0 s gr 
% Polyline
n 539 615 m 635 615 l gs col0 s gr 
% Polyline
n 635 779 m 735 779 l gs col0 s gr 
% Polyline
n 635 779 m 635 615 l gs col0 s gr 
% Polyline
n 735 779 m 735 615 l gs col0 s gr 
% Polyline
n 635 615 m 735 615 l gs col0 s gr 
% Polyline
n 735 779 m 835 779 l gs col0 s gr 
% Polyline
n 735 779 m 735 615 l gs col0 s gr 
% Polyline
n 835 779 m 835 615 l gs col0 s gr 
% Polyline
n 735 615 m 835 615 l gs col0 s gr 
% Polyline
n 835 779 m 931 779 l gs col0 s gr 
% Polyline
n 835 779 m 835 615 l gs col0 s gr 
% Polyline
n 931 779 m 931 615 l gs col0 s gr 
% Polyline
n 835 615 m 931 615 l gs col0 s gr 
% Polyline
n 931 779 m 1031 779 l gs col0 s gr 
% Polyline
n 931 779 m 931 615 l gs col0 s gr 
% Polyline
n 1031 779 m 1031 615 l gs col0 s gr 
% Polyline
n 931 615 m 1031 615 l gs col0 s gr 
% Polyline
n 1031 779 m 1127 779 l gs col0 s gr 
% Polyline
n 1031 779 m 1031 615 l gs col0 s gr 
% Polyline
n 1127 779 m 1127 615 l gs col0 s gr 
% Polyline
n 1031 615 m 1127 615 l gs col0 s gr 
% Polyline
n 1127 779 m 1227 779 l gs col0 s gr 
% Polyline
n 1127 779 m 1127 615 l gs col0 s gr 
% Polyline
n 1227 779 m 1227 615 l gs col0 s gr 
% Polyline
n 1127 615 m 1227 615 l gs col0 s gr 
% Polyline
n 1227 779 m 1327 779 l gs col0 s gr 
% Polyline
n 1227 779 m 1227 731 l gs col0 s gr 
% Polyline
n 1327 779 m 1327 731 l gs col0 s gr 
% Polyline
n 1423 615 m 1523 615 l gs col0 s gr 
% Polyline
n 1423 615 m 1423 663 l gs col0 s gr 
% Polyline
n 1523 615 m 1523 663 l gs col0 s gr 
% Polyline
n 1327 615 m 1423 615 l gs col0 s gr 
% Polyline
n 1327 615 m 1327 663 l gs col0 s gr 
% Polyline
n 1423 615 m 1423 663 l gs col0 s gr 
% Polyline
n 1327 615 m 1327 755 l gs col0 s gr 
% Polyline
n 1523 779 m 1619 779 l gs col0 s gr 
% Polyline
n 1523 779 m 1523 731 l gs col0 s gr 
% Polyline
n 1619 779 m 1619 731 l gs col0 s gr 
% Polyline
n 1523 615 m 1523 755 l gs col0 s gr 
% Polyline
n 1619 779 m 1719 779 l gs col0 s gr 
% Polyline
n 1619 779 m 1619 615 l gs col0 s gr 
% Polyline
n 1719 779 m 1719 615 l gs col0 s gr 
% Polyline
n 1619 615 m 1719 615 l gs col0 s gr 
% Polyline
n 1719 779 m 1819 779 l gs col0 s gr 
% Polyline
n 1719 779 m 1719 615 l gs col0 s gr 
% Polyline
n 1819 779 m 1819 615 l gs col0 s gr 
% Polyline
n 1719 615 m 1819 615 l gs col0 s gr 
% Polyline
n 1819 779 m 1915 779 l gs col0 s gr 
% Polyline
n 1819 779 m 1819 615 l gs col0 s gr 
% Polyline
n 1915 779 m 1915 615 l gs col0 s gr 
% Polyline
n 1819 615 m 1915 615 l gs col0 s gr 
% Polyline
n 1915 779 m 2015 779 l gs col0 s gr 
% Polyline
n 1915 779 m 1915 615 l gs col0 s gr 
% Polyline
n 2015 779 m 2015 615 l gs col0 s gr 
% Polyline
n 1915 615 m 2015 615 l gs col0 s gr 
% Polyline
n 2015 779 m 2115 779 l gs col0 s gr 
% Polyline
n 2015 779 m 2015 615 l gs col0 s gr 
% Polyline
n 2115 779 m 2115 615 l gs col0 s gr 
% Polyline
n 2015 615 m 2115 615 l gs col0 s gr 
% Polyline
n 2115 779 m 2211 779 l gs col0 s gr 
% Polyline
n 2115 779 m 2115 615 l gs col0 s gr 
% Polyline
n 2211 779 m 2211 615 l gs col0 s gr 
% Polyline
n 2115 615 m 2211 615 l gs col0 s gr 
% Polyline
n 2211 779 m 2311 779 l gs col0 s gr 
% Polyline
n 2211 779 m 2211 615 l gs col0 s gr 
% Polyline
n 2311 779 m 2311 615 l gs col0 s gr 
% Polyline
n 2211 615 m 2311 615 l gs col0 s gr 
% Polyline
n 2311 779 m 2407 779 l gs col0 s gr 
% Polyline
n 2311 779 m 2311 731 l gs col0 s gr 
% Polyline
n 2407 779 m 2407 731 l gs col0 s gr 
% Polyline
n 2507 615 m 2603 615 l gs col0 s gr 
% Polyline
n 2507 615 m 2507 663 l gs col0 s gr 
% Polyline
n 2607 615 m 2607 663 l gs col0 s gr 
% Polyline
n 2507 615 m 2507 755 l gs col0 s gr 
% Polyline
n 2407 779 m 2507 779 l gs col0 s gr 
% Polyline
n 2407 779 m 2407 731 l gs col0 s gr 
% Polyline
n 2507 779 m 2507 731 l gs col0 s gr 
% Polyline
n 2607 779 m 2703 779 l gs col0 s gr 
% Polyline
n 2607 779 m 2607 731 l gs col0 s gr 
% Polyline
n 2703 779 m 2703 731 l gs col0 s gr 
% Polyline
n 2607 615 m 2607 755 l gs col0 s gr 
% Polyline
n 2703 779 m 2803 779 l gs col0 s gr 
% Polyline
n 2703 779 m 2703 615 l gs col0 s gr 
% Polyline
n 2803 779 m 2803 615 l gs col0 s gr 
% Polyline
n 2703 615 m 2803 615 l gs col0 s gr 
% Polyline
n 2803 779 m 2899 779 l gs col0 s gr 
% Polyline
n 2803 779 m 2803 615 l gs col0 s gr 
% Polyline
n 2899 779 m 2899 615 l gs col0 s gr 
% Polyline
n 2803 615 m 2899 615 l gs col0 s gr 
% Polyline
n 2899 779 m 2999 779 l gs col0 s gr 
% Polyline
n 2899 779 m 2899 615 l gs col0 s gr 
% Polyline
n 2999 779 m 2999 615 l gs col0 s gr 
% Polyline
n 2899 615 m 2999 615 l gs col0 s gr 
% Polyline
n 2999 779 m 3099 779 l gs col0 s gr 
% Polyline
n 2999 779 m 2999 615 l gs col0 s gr 
% Polyline
n 3099 779 m 3099 615 l gs col0 s gr 
% Polyline
n 2999 615 m 3099 615 l gs col0 s gr 
% Polyline
n 3099 779 m 3195 779 l gs col0 s gr 
% Polyline
n 3099 779 m 3099 615 l gs col0 s gr 
% Polyline
n 3195 779 m 3195 615 l gs col0 s gr 
% Polyline
n 3099 615 m 3195 615 l gs col0 s gr 
% Polyline
n 3195 779 m 3295 779 l gs col0 s gr 
% Polyline
n 3195 779 m 3195 615 l gs col0 s gr 
% Polyline
n 3295 779 m 3295 615 l gs col0 s gr 
% Polyline
n 3195 615 m 3295 615 l gs col0 s gr 
% Polyline
n 3295 779 m 3391 779 l gs col0 s gr 
% Polyline
n 3295 779 m 3295 615 l gs col0 s gr 
% Polyline
n 3395 779 m 3395 615 l gs col0 s gr 
% Polyline
n 3295 615 m 3391 615 l gs col0 s gr 
% Polyline
n 3591 615 m 3687 615 l gs col0 s gr 
% Polyline
n 3591 615 m 3591 663 l gs col0 s gr 
% Polyline
n 3687 615 m 3687 663 l gs col0 s gr 
% Polyline
n 3591 615 m 3591 755 l gs col0 s gr 
% Polyline
n 3491 779 m 3591 779 l gs col0 s gr 
% Polyline
n 3491 779 m 3491 731 l gs col0 s gr 
% Polyline
n 3591 779 m 3591 731 l gs col0 s gr 
% Polyline
n 3395 779 m 3491 779 l gs col0 s gr 
% Polyline
n 3395 779 m 3395 615 l gs col0 s gr 
% Polyline
n 3491 779 m 3491 615 l gs col0 s gr 
% Polyline
n 3395 615 m 3491 615 l gs col0 s gr 
% Polyline
n 3883 779 m 3983 779 l gs col0 s gr 
% Polyline
n 3883 779 m 3883 731 l gs col0 s gr 
% Polyline
n 3983 779 m 3983 731 l gs col0 s gr 
% Polyline
n 3883 615 m 3883 755 l gs col0 s gr 
% Polyline
n 3983 779 m 4083 779 l gs col0 s gr 
% Polyline
n 3983 779 m 3983 615 l gs col0 s gr 
% Polyline
n 4083 779 m 4083 615 l gs col0 s gr 
% Polyline
n 3983 615 m 4083 615 l gs col0 s gr 
% Polyline
n 4083 779 m 4179 779 l gs col0 s gr 
% Polyline
n 4083 779 m 4083 615 l gs col0 s gr 
% Polyline
n 4179 779 m 4179 615 l gs col0 s gr 
% Polyline
n 4083 615 m 4179 615 l gs col0 s gr 
% Polyline
n 4179 779 m 4279 779 l gs col0 s gr 
% Polyline
n 4179 779 m 4179 615 l gs col0 s gr 
% Polyline
n 4279 779 m 4279 615 l gs col0 s gr 
% Polyline
n 4179 615 m 4279 615 l gs col0 s gr 
% Polyline
n 4279 779 m 4379 779 l gs col0 s gr 
% Polyline
n 4279 779 m 4279 615 l gs col0 s gr 
% Polyline
n 4379 779 m 4379 615 l gs col0 s gr 
% Polyline
n 4279 615 m 4379 615 l gs col0 s gr 
% Polyline
n 4379 779 m 4475 779 l gs col0 s gr 
% Polyline
n 4379 779 m 4379 615 l gs col0 s gr 
% Polyline
n 4475 779 m 4475 615 l gs col0 s gr 
% Polyline
n 4379 615 m 4475 615 l gs col0 s gr 
% Polyline
n 4475 779 m 4575 779 l gs col0 s gr 
% Polyline
n 4475 779 m 4475 615 l gs col0 s gr 
% Polyline
n 4575 779 m 4575 615 l gs col0 s gr 
% Polyline
n 4475 615 m 4575 615 l gs col0 s gr 
% Polyline
n 4575 779 m 4671 779 l gs col0 s gr 
% Polyline
n 4575 779 m 4575 615 l gs col0 s gr 
% Polyline
n 4671 779 m 4671 615 l gs col0 s gr 
% Polyline
n 4575 615 m 4671 615 l gs col0 s gr 
% Polyline
n 4867 615 m 4967 615 l gs col0 s gr 
% Polyline
n 4867 615 m 4867 663 l gs col0 s gr 
% Polyline
n 4967 615 m 4967 663 l gs col0 s gr 
% Polyline
n 4867 615 m 4867 755 l gs col0 s gr 
% Polyline
n 4771 779 m 4867 779 l gs col0 s gr 
% Polyline
n 4771 779 m 4771 731 l gs col0 s gr 
% Polyline
n 4867 779 m 4867 731 l gs col0 s gr 
% Polyline
n 4671 779 m 4771 779 l gs col0 s gr 
% Polyline
n 4671 779 m 4671 615 l gs col0 s gr 
% Polyline
n 4771 779 m 4771 615 l gs col0 s gr 
% Polyline
n 4671 615 m 4771 615 l gs col0 s gr 
% Polyline
n 5163 615 m 5263 615 l gs col0 s gr 
% Polyline
n 5163 615 m 5163 663 l gs col0 s gr 
% Polyline
n 5263 615 m 5263 663 l gs col0 s gr 
% Polyline
n 5263 779 m 5363 779 l gs col0 s gr 
% Polyline
n 5263 779 m 5263 731 l gs col0 s gr 
% Polyline
n 5363 779 m 5363 731 l gs col0 s gr 
% Polyline
n 5263 615 m 5263 755 l gs col0 s gr 
% Polyline
n 5363 779 m 5459 779 l gs col0 s gr 
% Polyline
n 5363 779 m 5363 615 l gs col0 s gr 
% Polyline
n 5459 779 m 5459 615 l gs col0 s gr 
% Polyline
n 5363 615 m 5459 615 l gs col0 s gr 
% Polyline
n 5459 779 m 5559 779 l gs col0 s gr 
% Polyline
n 5459 779 m 5459 615 l gs col0 s gr 
% Polyline
n 5559 779 m 5559 615 l gs col0 s gr 
% Polyline
n 5459 615 m 5559 615 l gs col0 s gr 
% Polyline
n 5559 779 m 5655 779 l gs col0 s gr 
% Polyline
n 5559 779 m 5559 615 l gs col0 s gr 
% Polyline
n 5655 779 m 5655 615 l gs col0 s gr 
% Polyline
n 5559 615 m 5655 615 l gs col0 s gr 
% Polyline
n 5655 779 m 5755 779 l gs col0 s gr 
% Polyline
n 5655 779 m 5655 615 l gs col0 s gr 
% Polyline
n 5755 779 m 5755 615 l gs col0 s gr 
% Polyline
n 5655 615 m 5755 615 l gs col0 s gr 
% Polyline
n 5755 779 m 5855 779 l gs col0 s gr 
% Polyline
n 5755 779 m 5755 615 l gs col0 s gr 
% Polyline
n 5855 779 m 5855 615 l gs col0 s gr 
% Polyline
n 5755 615 m 5855 615 l gs col0 s gr 
% Polyline
n 5855 779 m 5951 779 l gs col0 s gr 
% Polyline
n 5855 779 m 5855 615 l gs col0 s gr 
% Polyline
n 5951 779 m 5951 615 l gs col0 s gr 
% Polyline
n 5855 615 m 5951 615 l gs col0 s gr 
% Polyline
n 5951 779 m 6051 779 l gs col0 s gr 
% Polyline
n 5951 779 m 5951 615 l gs col0 s gr 
% Polyline
n 6051 779 m 6051 615 l gs col0 s gr 
% Polyline
n 5951 615 m 6051 615 l gs col0 s gr 
% Polyline
n 6051 779 m 6147 779 l gs col0 s gr 
% Polyline
n 6051 779 m 6051 731 l gs col0 s gr 
% Polyline
n 6147 779 m 6147 731 l gs col0 s gr 
% Polyline
n 6247 615 m 6347 615 l gs col0 s gr 
% Polyline
n 6247 615 m 6247 663 l gs col0 s gr 
% Polyline
n 6347 615 m 6347 663 l gs col0 s gr 
% Polyline
n 6147 615 m 6247 615 l gs col0 s gr 
% Polyline
n 6147 615 m 6147 663 l gs col0 s gr 
% Polyline
n 6247 615 m 6247 663 l gs col0 s gr 
% Polyline
n 6147 615 m 6147 755 l gs col0 s gr 
% Polyline
n 6347 779 m 6443 779 l gs col0 s gr 
% Polyline
n 6347 779 m 6347 731 l gs col0 s gr 
% Polyline
n 6443 779 m 6443 731 l gs col0 s gr 
% Polyline
n 6347 615 m 6347 755 l gs col0 s gr 
% Polyline
n 6443 779 m 6543 779 l gs col0 s gr 
% Polyline
n 6443 779 m 6443 615 l gs col0 s gr 
% Polyline
n 6543 779 m 6543 615 l gs col0 s gr 
% Polyline
n 6443 615 m 6543 615 l gs col0 s gr 
% Polyline
n 6543 779 m 6639 779 l gs col0 s gr 
% Polyline
n 6543 779 m 6543 615 l gs col0 s gr 
% Polyline
n 6639 779 m 6639 615 l gs col0 s gr 
% Polyline
n 6543 615 m 6639 615 l gs col0 s gr 
% Polyline
n 6639 779 m 6739 779 l gs col0 s gr 
% Polyline
n 6639 779 m 6639 615 l gs col0 s gr 
% Polyline
n 6739 779 m 6739 615 l gs col0 s gr 
% Polyline
n 6639 615 m 6739 615 l gs col0 s gr 
% Polyline
n 6739 779 m 6839 779 l gs col0 s gr 
% Polyline
n 6739 779 m 6739 615 l gs col0 s gr 
% Polyline
n 6839 779 m 6839 615 l gs col0 s gr 
% Polyline
n 6739 615 m 6839 615 l gs col0 s gr 
% Polyline
n 6839 779 m 6935 779 l gs col0 s gr 
% Polyline
n 6839 779 m 6839 615 l gs col0 s gr 
% Polyline
n 6935 779 m 6935 615 l gs col0 s gr 
% Polyline
n 6839 615 m 6935 615 l gs col0 s gr 
% Polyline
n 6935 779 m 7035 779 l gs col0 s gr 
% Polyline
n 6935 779 m 6935 615 l gs col0 s gr 
% Polyline
n 7035 779 m 7035 615 l gs col0 s gr 
% Polyline
n 6935 615 m 7035 615 l gs col0 s gr 
% Polyline
n 7035 779 m 7135 779 l gs col0 s gr 
% Polyline
n 7035 779 m 7035 615 l gs col0 s gr 
% Polyline
n 7135 779 m 7135 615 l gs col0 s gr 
% Polyline
n 7035 615 m 7135 615 l gs col0 s gr 
% Polyline
n 7331 615 m 7427 615 l gs col0 s gr 
% Polyline
n 7331 615 m 7331 663 l gs col0 s gr 
% Polyline
n 7427 615 m 7427 663 l gs col0 s gr 
% Polyline
n 7331 615 m 7331 755 l gs col0 s gr 
% Polyline
n 7231 779 m 7331 779 l gs col0 s gr 
% Polyline
n 7231 779 m 7231 731 l gs col0 s gr 
% Polyline
n 7331 779 m 7331 731 l gs col0 s gr 
% Polyline
n 7135 779 m 7231 779 l gs col0 s gr 
% Polyline
n 7135 779 m 7135 615 l gs col0 s gr 
% Polyline
n 7231 779 m 7231 615 l gs col0 s gr 
% Polyline
n 7135 615 m 7231 615 l gs col0 s gr 
% Ellipse
n 3761 708 11 11 0 360 DrawEllipse gs 0.00 setgray ef gr gs col0 s gr

% Ellipse
n 3836 708 11 11 0 360 DrawEllipse gs 0.00 setgray ef gr gs col0 s gr

% Ellipse
n 3686 708 11 11 0 360 DrawEllipse gs 0.00 setgray ef gr gs col0 s gr

% Ellipse
n 5061 708 11 11 0 360 DrawEllipse gs 0.00 setgray ef gr gs col0 s gr

% Ellipse
n 5136 708 11 11 0 360 DrawEllipse gs 0.00 setgray ef gr gs col0 s gr

% Ellipse
n 4986 708 11 11 0 360 DrawEllipse gs 0.00 setgray ef gr gs col0 s gr

/CourierNew-Bold ff 150.00 scf sf
1950 975 m
gs 1 -1 sc (SAdr) dup sw pop 2 div neg 0 rm  col0 sh gr
/CourierNew-Bold ff 150.00 scf sf
825 975 m
gs 1 -1 sc (DAdr) dup sw pop 2 div neg 0 rm  col0 sh gr
/CourierNew-Bold ff 150.00 scf sf
825 1155 m
gs 1 -1 sc (or) dup sw pop 2 div neg 0 rm  col0 sh gr
/CourierNew-Bold ff 150.00 scf sf
825 1335 m
gs 1 -1 sc (uL_Beg) dup sw pop 2 div neg 0 rm  col0 sh gr
/CourierNew-Bold ff 150.00 scf sf
3075 975 m
gs 1 -1 sc (Com) dup sw pop 2 div neg 0 rm  col0 sh gr
/CourierNew-Bold ff 150.00 scf sf
4350 975 m
gs 1 -1 sc (0 to MaxBlock) dup sw pop 2 div neg 0 rm  col0 sh gr
/CourierNew-Bold ff 150.00 scf sf
4350 1155 m
gs 1 -1 sc (of data bytes) dup sw pop 2 div neg 0 rm  col0 sh gr
/CourierNew-Bold ff 150.00 scf sf
5700 975 m
gs 1 -1 sc (uL_End,) dup sw pop 2 div neg 0 rm  col0 sh gr
/CourierNew-Bold ff 150.00 scf sf
5700 1155 m
gs 1 -1 sc (uL_Arq,) dup sw pop 2 div neg 0 rm  col0 sh gr
/CourierNew-Bold ff 150.00 scf sf
5700 1335 m
gs 1 -1 sc (uL_Prq) dup sw pop 2 div neg 0 rm  col0 sh gr
/CourierNew-Bold ff 150.00 scf sf
5700 1515 m
gs 1 -1 sc (or) dup sw pop 2 div neg 0 rm  col0 sh gr
/CourierNew-Bold ff 150.00 scf sf
5700 1695 m
gs 1 -1 sc (uL_Aap) dup sw pop 2 div neg 0 rm  col0 sh gr
/CourierNew-Bold ff 150.00 scf sf
6825 975 m
gs 1 -1 sc (XorSum) dup sw pop 2 div neg 0 rm  col0 sh gr
/CourierNew-Bold ff 200.00 scf sf
3900 300 m
gs 1 -1 sc (Data frame format) dup sw pop 2 div neg 0 rm  col0 sh gr
$F2psEnd
rs
