%!PS-Adobe-2.0 EPSF-2.0
%%Title: obr1.eps
%%Creator: fig2dev Version 3.2 Patchlevel 0-beta3
%%CreationDate: Tue Jul  7 23:02:36 1998
%%For: pisa@thor (Pavel Pisa)
%%Orientation: Portrait
%%BoundingBox: 0 0 343 107
%%Pages: 0
%%BeginSetup
%%EndSetup
%%Magnification: 1.0000
%%EndComments
/$F2psDict 200 dict def
$F2psDict begin
$F2psDict /mtrx matrix put
/col-1 {0 setgray} bind def
/col0 {0.000 0.000 0.000 srgb} bind def
/col1 {0.000 0.000 1.000 srgb} bind def
/col2 {0.000 1.000 0.000 srgb} bind def
/col3 {0.000 1.000 1.000 srgb} bind def
/col4 {1.000 0.000 0.000 srgb} bind def
/col5 {1.000 0.000 1.000 srgb} bind def
/col6 {1.000 1.000 0.000 srgb} bind def
/col7 {1.000 1.000 1.000 srgb} bind def
/col8 {0.000 0.000 0.560 srgb} bind def
/col9 {0.000 0.000 0.690 srgb} bind def
/col10 {0.000 0.000 0.820 srgb} bind def
/col11 {0.530 0.810 1.000 srgb} bind def
/col12 {0.000 0.560 0.000 srgb} bind def
/col13 {0.000 0.690 0.000 srgb} bind def
/col14 {0.000 0.820 0.000 srgb} bind def
/col15 {0.000 0.560 0.560 srgb} bind def
/col16 {0.000 0.690 0.690 srgb} bind def
/col17 {0.000 0.820 0.820 srgb} bind def
/col18 {0.560 0.000 0.000 srgb} bind def
/col19 {0.690 0.000 0.000 srgb} bind def
/col20 {0.820 0.000 0.000 srgb} bind def
/col21 {0.560 0.000 0.560 srgb} bind def
/col22 {0.690 0.000 0.690 srgb} bind def
/col23 {0.820 0.000 0.820 srgb} bind def
/col24 {0.500 0.190 0.000 srgb} bind def
/col25 {0.630 0.250 0.000 srgb} bind def
/col26 {0.750 0.380 0.000 srgb} bind def
/col27 {1.000 0.500 0.500 srgb} bind def
/col28 {1.000 0.630 0.630 srgb} bind def
/col29 {1.000 0.750 0.750 srgb} bind def
/col30 {1.000 0.880 0.880 srgb} bind def
/col31 {1.000 0.840 0.000 srgb} bind def

end
save
-43.0 116.0 translate
1 -1 scale

/cp {closepath} bind def
/ef {eofill} bind def
/gr {grestore} bind def
/gs {gsave} bind def
/sa {save} bind def
/rs {restore} bind def
/l {lineto} bind def
/m {moveto} bind def
/rm {rmoveto} bind def
/n {newpath} bind def
/s {stroke} bind def
/sh {show} bind def
/slc {setlinecap} bind def
/slj {setlinejoin} bind def
/slw {setlinewidth} bind def
/srgb {setrgbcolor} bind def
/rot {rotate} bind def
/sc {scale} bind def
/sd {setdash} bind def
/ff {findfont} bind def
/sf {setfont} bind def
/scf {scalefont} bind def
/sw {stringwidth} bind def
/tr {translate} bind def
/tnt {dup dup currentrgbcolor
  4 -2 roll dup 1 exch sub 3 -1 roll mul add
  4 -2 roll dup 1 exch sub 3 -1 roll mul add
  4 -2 roll dup 1 exch sub 3 -1 roll mul add srgb}
  bind def
/shd {dup dup currentrgbcolor 4 -2 roll mul 4 -2 roll mul
  4 -2 roll mul srgb} bind def
/$F2psBegin {$F2psDict begin /$F2psEnteredState save def} def
/$F2psEnd {$F2psEnteredState restore end} def
%%EndProlog

$F2psBegin
10 setmiterlimit
n -1000 2929 m -1000 -1000 l 7427 -1000 l 7427 2929 l cp clip
 0.06000 0.06000 sc
% Polyline
7.500 slw
n 1207 1001 m 1683 1001 l gs col0 s gr 
% Polyline
n 1207 525 m 1207 1001 l gs col0 s gr 
% Polyline
n 1683 525 m 2155 525 l 2155 1001 l 1683 1001 l 1683 525 l  cp gs col0 s gr 
% Polyline
n 2155 525 m 2627 525 l 2627 1001 l 2155 1001 l 2155 525 l  cp gs col0 s gr 
% Polyline
n 2627 525 m 3103 525 l 3103 1001 l 2627 1001 l 2627 525 l  cp gs col0 s gr 
% Polyline
n 3103 525 m 3575 525 l 3575 1001 l 3103 1001 l 3103 525 l  cp gs col0 s gr 
% Polyline
n 3575 525 m 4047 525 l 4047 1001 l 3575 1001 l 3575 525 l  cp gs col0 s gr 
% Polyline
n 4047 525 m 4523 525 l 4523 1001 l 4047 1001 l 4047 525 l  cp gs col0 s gr 
% Polyline
n 4523 525 m 4995 525 l 4995 1001 l 4523 1001 l 4523 525 l  cp gs col0 s gr 
% Polyline
n 4995 525 m 5467 525 l 5467 1001 l 4995 1001 l 4995 525 l  cp gs col0 s gr 
% Polyline
n 5467 525 m 5943 525 l 5943 1001 l 5467 1001 l 5467 525 l  cp gs col0 s gr 
% Polyline
n 5943 525 m 6415 525 l 5943 525 l  cp gs col0 s gr 
% Polyline
n 735 525 m 1207 525 l gs col0 s gr 
% Polyline
n 1207 1193 m 1207 1829 l gs col0 s gr 
% Polyline
0.000 slw
n 1159 1217 m 1259 1217 l 1207 1117 l 1159 1217 l  cp gs 0.00 setgray ef gr 
% Polyline
7.500 slw
n 1159 1217 m 1259 1217 l 1207 1117 l 1159 1217 l  cp gs col0 s gr 
% Polyline
n 1207 1829 m 1799 1829 l gs col0 s gr 
% Polyline
n 1447 1193 m 1447 1473 l gs col0 s gr 
% Polyline
0.000 slw
n 1395 1217 m 1495 1217 l 1447 1117 l 1395 1217 l  cp gs 0.00 setgray ef gr 
% Polyline
7.500 slw
n 1395 1217 m 1495 1217 l 1447 1117 l 1395 1217 l  cp gs col0 s gr 
% Polyline
n 1447 1473 m 1803 1473 l gs col0 s gr 
% Polyline
n 6179 1193 m 6179 1593 l gs col0 s gr 
% Polyline
0.000 slw
n 6127 1217 m 6227 1217 l 6179 1117 l 6127 1217 l  cp gs 0.00 setgray ef gr 
% Polyline
7.500 slw
n 6127 1217 m 6227 1217 l 6179 1117 l 6127 1217 l  cp gs col0 s gr 
% Polyline
n 6179 1593 m 5351 1593 l gs col0 s gr 
/CourierNew-Bold ff 300.00 scf sf
1725 900 m
gs 1 -1 sc (D0) col0 sh gr
/CourierNew-Bold ff 300.00 scf sf
2250 900 m
gs 1 -1 sc (D1) col0 sh gr
/CourierNew-Bold ff 300.00 scf sf
2700 900 m
gs 1 -1 sc (D2) col0 sh gr
/CourierNew-Bold ff 300.00 scf sf
3150 900 m
gs 1 -1 sc (D3) col0 sh gr
/CourierNew-Bold ff 300.00 scf sf
3675 900 m
gs 1 -1 sc (D4) col0 sh gr
/CourierNew-Bold ff 300.00 scf sf
4125 900 m
gs 1 -1 sc (D5) col0 sh gr
/CourierNew-Bold ff 300.00 scf sf
4575 900 m
gs 1 -1 sc (D6) col0 sh gr
/CourierNew-Bold ff 300.00 scf sf
5100 900 m
gs 1 -1 sc (D7) col0 sh gr
/CourierNew-Bold ff 300.00 scf sf
5550 900 m
gs 1 -1 sc (D8) col0 sh gr
/CourierNew-Bold ff 210.00 scf sf
1875 1500 m
gs 1 -1 sc (start bit) col0 sh gr
/CourierNew-Bold ff 210.00 scf sf
5325 1650 m
gs 1 -1 sc (stop bit) dup sw pop neg 0 rm  col0 sh gr
/CourierNew-Bold ff 210.00 scf sf
1875 1875 m
gs 1 -1 sc (char begin) col0 sh gr
/CourierNew-Bold ff 360.00 scf sf
3750 375 m
gs 1 -1 sc (Transfered character) dup sw pop 2 div neg 0 rm  col0 sh gr
$F2psEnd
rs
