#FIG 3.2
Landscape
Center
Inches
Letter  
100.00
Single
-2
1200 2
0 32 #c6b797
0 33 #eff8ff
0 34 #dccba6
0 35 #404040
0 36 #808080
0 37 #c0c0c0
0 38 #e0e0e0
0 39 #8e8f8e
0 40 #aaaaaa
0 41 #555555
0 42 #8e8e8e
0 43 #d7d7d7
0 44 #aeaeae
0 45 #bebebe
0 46 #515151
0 47 #e7e3e7
0 48 #000049
0 49 #797979
0 50 #303430
0 51 #414141
0 52 #c7b696
0 53 #414541
0 54 #444444
0 55 #cccccc
0 56 #fff2d3
0 57 #ffe4ae
0 58 #ffd279
0 59 #cfcfcf
0 60 #999999
0 61 #b2b2b2
0 62 #dd9d93
0 63 #f1ece0
0 64 #c3c3c3
0 65 #e2c8a8
0 66 #e1e1e1
0 67 #d2d2d2
0 68 #ededed
0 69 #da7a1a
0 70 #f1e41a
0 71 #887dc2
0 72 #d6d6d6
0 73 #8c8ca5
0 74 #4a4a4a
0 75 #8c6b6b
0 76 #5a5a5a
0 77 #636363
0 78 #b79b73
0 79 #4193ff
0 80 #bf703b
0 81 #db7700
0 82 #dab800
0 83 #006400
0 84 #5a6b3b
0 85 #d3d3d3
0 86 #8e8ea4
0 87 #f3b95d
0 88 #89996b
0 89 #646464
0 90 #b7e6ff
0 91 #86c0ec
0 92 #bdbdbd
0 93 #d39552
0 94 #98d2fe
0 95 #8c9c6b
0 96 #f76b00
0 97 #5a6b39
0 98 #8c9c6b
0 99 #8c9c7b
0 100 #184a18
0 101 #adadad
0 102 #f7bd5a
0 103 #636b9c
0 104 #f7f7f7
0 105 #de0000
0 106 #adadad
0 107 #f7bd5a
0 108 #adadad
0 109 #f7bd5a
0 110 #636b9c
0 111 #526b29
0 112 #949494
0 113 #006300
0 114 #00634a
0 115 #7b844a
0 116 #e7bd7b
0 117 #a5b5c6
0 118 #6b6b94
0 119 #846b6b
0 120 #529c4a
0 121 #d6e7e7
0 122 #526363
0 123 #186b4a
0 124 #9ca5b5
0 125 #ff9400
0 126 #ff9400
0 127 #00634a
0 128 #7b844a
0 129 #63737b
0 130 #e7bd7b
0 131 #184a18
0 132 #f7bd5a
0 133 #dedede
0 134 #f3eed3
0 135 #f5ae5d
0 136 #95ce99
0 137 #b5157d
0 138 #eeeeee
0 139 #848484
0 140 #7b7b7b
0 141 #005a00
0 142 #e77373
0 143 #ffcb31
0 144 #29794a
0 145 #de2821
0 146 #2159c6
0 147 #f8f8f8
0 148 #e6e6e6
0 149 #21845a
0 150 #868286
0 151 #c7c3c7
0 152 #868686
0 153 #c7c7c7
0 154 #e7e7e7
0 155 #9e9e9e
0 156 #717571
0 157 #757575
0 158 #effbff
0 159 #f3f3f3
0 160 #d7d3d7
0 161 #aeaaae
0 162 #c2c2c2
0 163 #303030
0 164 #515551
0 165 #f7f3f7
0 166 #666666
0 167 #717171
6 3675 4050 4725 4725
2 2 0 2 0 4 100 -1 34 6.000 0 0 -1 0 0 5
	 3750 4125 4650 4125 4650 4650 3750 4650 3750 4125
4 1 0 100 -1 0 18 0.0000 4 180 675 4200 4575 model\001
4 1 0 100 -1 0 18 0.0000 4 180 660 4200 4350 Dev 1\001
-6
6 6675 2100 7875 3750
2 2 0 2 0 4 100 -1 34 6.000 0 0 -1 0 0 5
	 6750 2175 7800 2175 7800 3675 6750 3675 6750 2175
4 1 0 100 -1 0 18 0.0000 4 180 660 7275 3450 cation\001
4 1 0 100 -1 0 18 0.0000 4 240 630 7275 3150 appli-\001
4 1 0 100 -1 0 18 0.0000 4 180 900 7275 2850 function\001
4 1 0 100 -1 0 18 0.0000 4 180 765 7275 2550 Device\001
-6
6 6675 4125 7875 5325
2 2 0 2 0 4 100 -1 34 6.000 0 0 -1 0 0 5
	 6750 4200 7800 4200 7800 5250 6750 5250 6750 4200
4 1 0 100 -1 0 18 0.0000 4 180 945 7275 5100 interface\001
4 1 0 100 -1 0 18 0.0000 4 240 660 7275 4800 object\001
4 1 0 100 -1 0 18 0.0000 4 180 555 7275 4500 uLan\001
-6
6 4875 4050 5925 4725
2 2 0 2 0 1 100 -1 34 6.000 0 0 -1 0 0 5
	 4950 4125 5850 4125 5850 4650 4950 4650 4950 4125
4 1 0 100 -1 0 18 0.0000 4 180 675 5400 4575 model\001
4 1 0 100 -1 0 18 0.0000 4 180 660 5400 4350 Dev 2\001
-6
6 8175 4125 9375 5325
2 2 0 2 0 1 50 -1 34 6.000 0 0 -1 0 0 5
	 8250 4200 9300 4200 9300 5250 8250 5250 8250 4200
4 1 0 50 -1 0 18 0.0000 4 180 945 8775 5100 interface\001
4 1 0 50 -1 0 18 0.0000 4 240 660 8775 4800 object\001
4 1 0 50 -1 0 18 0.0000 4 180 555 8775 4500 uLan\001
-6
6 3525 6375 4875 7275
2 2 0 2 0 43 100 -1 34 0.000 0 0 7 0 0 5
	 4800 7200 3600 7200 3600 6450 4800 6450 4800 7200
4 1 0 100 -1 0 18 0.0000 4 180 555 4200 6750 uLan\001
4 1 0 100 -1 0 18 0.0000 4 180 645 4200 7050 driver\001
-6
6 4800 1500 6000 2475
2 2 0 2 0 43 50 -1 34 6.000 0 0 -1 0 0 5
	 4875 1575 5925 1575 5925 2400 4875 2400 4875 1575
4 1 0 50 -1 0 18 0.0000 4 180 960 5400 2325 Interface\001
4 1 0 50 -1 0 18 0.0000 4 180 510 5400 2100 User\001
4 1 0 50 -1 0 18 0.0000 4 240 870 5400 1875 Graphic\001
-6
6 6675 825 7875 2175
2 2 0 2 0 43 50 -1 34 6.000 0 0 -1 0 0 5
	 6750 900 7800 900 7800 2100 6750 2100 6750 900
4 1 0 50 -1 0 18 0.0000 4 180 615 7275 1125 Local\001
4 1 0 50 -1 0 18 0.0000 4 180 750 7275 2025 and UI\001
4 1 0 50 -1 0 18 0.0000 4 240 1005 7275 1725 keyboard\001
4 1 0 50 -1 0 18 0.0000 4 240 780 7275 1425 display\001
-6
6 6675 5325 7875 7275
2 2 0 2 0 43 50 -1 34 6.000 0 0 -1 0 0 5
	 6750 5400 7800 5400 7800 7200 6750 7200 6750 5400
4 1 0 50 -1 0 18 0.0000 4 180 555 7275 5775 uLan\001
4 1 0 50 -1 0 18 0.0000 4 180 900 7275 6075 API and\001
4 1 0 50 -1 0 18 0.0000 4 180 615 7275 6375 MCU\001
4 1 0 50 -1 0 18 0.0000 4 210 810 7275 6600 support\001
4 1 0 50 -1 0 18 0.0000 4 180 885 7275 6900 libraries\001
-6
6 8175 5325 9375 7275
2 2 0 2 0 43 50 -1 34 6.000 0 0 -1 0 0 5
	 8250 5400 9300 5400 9300 7200 8250 7200 8250 5400
4 1 0 50 -1 0 18 0.0000 4 180 555 8775 5775 uLan\001
4 1 0 50 -1 0 18 0.0000 4 180 900 8775 6075 API and\001
4 1 0 50 -1 0 18 0.0000 4 180 615 8775 6375 MCU\001
4 1 0 50 -1 0 18 0.0000 4 210 810 8775 6600 support\001
4 1 0 50 -1 0 18 0.0000 4 180 885 8775 6900 libraries\001
-6
6 8175 7275 9375 8175
2 2 0 2 0 43 100 -1 34 0.000 0 0 -1 0 0 5
	 8250 7350 9300 7350 9300 8100 8250 8100 8250 7350
4 1 0 100 -1 0 18 0.0000 4 180 735 8700 7650 UART\001
4 1 0 100 -1 0 18 0.0000 4 180 735 8700 7950 RS485\001
-6
6 6675 7275 7875 8175
2 2 0 2 0 43 130 -1 34 0.000 0 0 -1 0 0 5
	 6750 7350 7800 7350 7800 8100 6750 8100 6750 7350
4 1 0 130 -1 0 18 0.0000 4 180 735 7200 7650 UART\001
4 1 0 130 -1 0 18 0.0000 4 180 735 7200 7950 RS485\001
-6
6 4875 7275 6075 8175
2 2 0 2 0 43 100 -1 34 0.000 0 0 -1 0 0 5
	 4950 7350 6000 7350 6000 8100 4950 8100 4950 7350
4 1 0 100 -1 0 18 0.0000 4 180 735 5400 7650 RS485\001
4 1 0 100 -1 0 18 0.0000 4 180 660 5400 7950 buffer\001
-6
6 3525 7275 4875 8175
2 2 0 2 0 43 160 -1 34 0.000 0 0 -1 0 0 5
	 3600 7350 4800 7350 4800 8100 3600 8100 3600 7350
4 1 0 160 -1 0 18 0.0000 4 180 735 4200 7650 UART\001
4 1 0 160 -1 0 18 0.0000 4 240 465 4200 7950 chip\001
-6
1 3 0 2 0 4 50 -1 34 6.000 1 0.0000 4050 3600 75 75 4050 3600 4125 3600
1 3 0 2 0 4 50 -1 34 6.000 1 0.0000 4350 3825 75 75 4350 3825 4425 3825
1 3 0 2 0 4 50 -1 34 6.000 1 0.0000 4575 3525 75 75 4575 3525 4650 3525
1 3 0 2 0 4 50 -1 34 6.000 1 0.0000 6772 3953 75 75 6772 3953 6847 3953
1 3 0 2 0 4 50 -1 34 6.000 1 0.0000 6975 3825 75 75 6975 3825 7050 3825
1 3 0 2 0 4 50 -1 34 6.000 1 0.0000 7200 3975 75 75 7200 3975 7275 3975
1 3 0 2 0 4 50 -1 34 6.000 1 0.0000 7500 3900 75 75 7500 3900 7575 3900
1 3 0 2 0 10 50 -1 34 6.000 1 0.0000 9525 4725 75 75 9525 4725 9600 4725
1 3 0 2 0 10 50 -1 34 6.000 1 0.0000 5400 3825 75 75 5400 3825 5475 3825
1 3 0 2 0 23 50 -1 34 6.000 1 0.0000 1200 3525 75 75 1200 3525 1275 3525
1 3 0 2 0 4 50 -1 34 6.000 1 0.0000 3825 3825 75 75 3825 3825 3900 3825
1 3 0 2 0 4 50 -1 34 6.000 1 0.0000 3525 3675 75 75 3525 3675 3600 3675
1 3 0 2 0 23 50 -1 34 6.000 1 0.0000 2025 3150 75 75 2025 3150 2100 3150
1 3 0 2 0 23 50 -1 34 6.000 1 0.0000 1800 3525 75 75 1800 3525 1875 3525
1 3 0 2 0 23 50 -1 34 0.000 1 0.0000 2475 3450 75 75 2475 3450 2550 3450
1 3 0 2 0 23 50 -1 34 6.000 1 0.0000 2775 3600 75 75 2775 3600 2850 3600
1 3 0 2 0 23 50 -1 34 6.000 1 0.0000 3150 3375 75 75 3150 3375 3150 3450
1 3 0 2 0 23 50 -1 34 6.000 1 0.0000 1650 2475 75 75 1650 2475 1725 2475
1 3 0 2 0 23 50 -1 34 6.000 1 0.0000 1125 2325 75 75 1125 2325 1200 2325
1 3 0 2 0 1 50 -1 34 6.000 1 0.0000 5025 3750 75 75 5025 3750 5100 3750
1 3 0 2 0 1 50 -1 34 6.000 1 0.0000 5325 3525 75 75 5325 3525 5400 3525
1 3 0 2 0 1 50 -1 34 6.000 1 0.0000 5625 3600 75 75 5625 3600 5700 3600
1 3 0 2 0 1 50 -1 34 6.000 1 0.0000 8400 3975 75 75 8400 3975 8475 3975
1 3 0 2 0 1 50 -1 34 6.000 1 0.0000 8625 3825 75 75 8625 3825 8700 3825
1 3 0 2 0 1 50 -1 34 6.000 1 0.0000 9675 5625 75 75 9675 5625 9750 5625
2 1 0 3 0 7 50 -1 -1 0.000 0 0 -1 0 0 4
	 5400 8100 5400 8400 8700 8400 8700 8100
2 1 0 3 0 7 50 -1 -1 0.000 0 0 -1 0 0 2
	 7200 8100 7200 8400
2 1 0 1 0 7 50 -1 -1 4.000 0 0 7 0 0 2
	 5625 3675 5550 4125
2 1 0 1 0 7 50 -1 -1 4.000 0 0 7 0 0 2
	 5400 3900 5400 4125
2 1 0 1 0 7 50 -1 -1 4.000 0 0 7 0 0 2
	 5025 3825 5175 4125
2 1 0 1 0 7 50 -1 -1 4.000 0 0 7 0 0 2
	 4575 3600 4500 4125
2 1 0 1 0 7 50 -1 -1 4.000 0 0 7 0 0 2
	 4350 3900 4350 4125
2 1 0 1 0 7 50 -1 -1 4.000 0 0 7 0 0 2
	 4050 3675 4125 4125
2 1 0 1 0 7 50 -1 -1 4.000 0 0 7 0 0 2
	 3900 3900 3975 4125
2 1 0 1 0 7 50 -1 -1 4.000 0 0 7 0 0 2
	 3600 3750 3825 4125
2 1 0 1 0 7 50 -1 -1 4.000 0 0 7 0 0 2
	 5325 3600 5325 4125
2 1 0 1 0 7 50 -1 -1 4.000 0 0 -1 0 0 2
	 1275 3600 1425 3900
2 1 0 1 0 7 50 -1 -1 4.000 0 0 -1 0 0 2
	 1800 3600 1725 3900
2 1 0 1 0 7 50 -1 -1 4.000 0 0 -1 0 0 2
	 2025 3225 1875 3900
2 1 0 1 0 7 50 -1 -1 4.000 0 0 -1 0 0 2
	 2475 3525 2625 4050
2 1 0 1 0 7 50 -1 -1 4.000 0 0 -1 0 0 2
	 2775 3675 2775 4050
2 1 0 1 0 7 50 -1 -1 4.000 0 0 -1 0 0 2
	 3150 3375 3000 4050
2 1 0 1 0 7 50 -1 -1 4.000 0 0 7 0 0 2
	 1650 2550 1575 3900
2 1 0 1 0 7 50 -1 -1 4.000 0 0 -1 0 0 2
	 1125 2400 1500 3900
2 1 0 1 0 7 50 -1 -1 4.000 0 0 -1 0 0 2
	 8475 4050 8625 4200
2 1 0 1 0 7 50 -1 -1 4.000 0 0 -1 0 0 2
	 8625 3900 8775 4200
2 1 0 1 0 7 50 -1 -1 4.000 0 0 -1 0 0 2
	 9450 4800 9300 4875
2 1 0 1 0 7 50 -1 -1 4.000 0 0 -1 0 0 2
	 9300 4950 9600 5550
2 1 0 1 0 7 50 -1 -1 4.000 0 0 -1 0 0 2
	 6825 4050 6900 4200
2 1 0 1 0 7 50 -1 -1 4.000 0 0 -1 0 0 2
	 6975 3900 7050 4200
2 1 0 1 0 7 50 -1 -1 4.000 0 0 -1 0 0 2
	 7200 4050 7200 4200
2 1 0 1 0 7 50 -1 -1 4.000 0 0 -1 0 0 2
	 7500 3975 7425 4200
2 2 0 2 0 23 100 -1 34 6.000 0 0 -1 0 0 5
	 1050 3900 2250 3900 2250 5100 1050 5100 1050 3900
2 2 0 2 0 23 100 -1 34 6.000 0 0 -1 0 0 5
	 2400 4050 3300 4050 3300 5100 2400 5100 2400 4050
2 2 0 2 0 37 100 -1 34 6.000 0 0 -1 0 0 5
	 9450 7350 10350 7350 10350 8100 9450 8100 9450 7350
2 2 0 2 0 1 100 -1 34 6.000 0 0 -1 0 0 5
	 8250 2175 10350 2175 10350 3675 8250 3675 8250 2175
2 2 0 2 0 5 100 -1 34 6.000 0 0 -1 0 0 5
	 9450 5400 10350 5400 10350 7200 9450 7200 9450 5400
2 3 0 2 0 43 100 -1 34 0.000 0 0 7 0 0 8
	 1200 7200 1200 6000 4500 6000 4500 6300 3450 6300 3450 7200
	 2250 7200 1200 7200
2 3 0 2 0 43 100 -1 34 0.000 0 0 7 0 0 8
	 1200 7350 1200 8550 4500 8550 4500 8250 3450 8250 3450 7350
	 2250 7350 1200 7350
2 2 0 2 0 43 100 -1 34 6.000 0 0 -1 0 0 5
	 1950 2475 5625 2475 5625 2850 1950 2850 1950 2475
2 2 0 2 0 43 100 -1 34 6.000 0 0 -1 0 0 5
	 1050 1575 2775 1575 2775 2400 1050 2400 1050 1575
2 2 0 2 0 43 100 -1 34 6.000 0 0 -1 0 0 5
	 2850 1575 4800 1575 4800 2400 2850 2400 2850 1575
2 2 0 2 0 43 100 -1 34 6.000 0 0 -1 0 0 5
	 8250 900 10350 900 10350 2100 8250 2100 8250 900
2 2 0 2 40 40 130 -1 20 6.000 0 0 -1 0 0 5
	 8625 7200 8775 7200 8775 7350 8625 7350 8625 7200
2 2 0 2 40 40 130 -1 20 6.000 0 0 -1 0 0 5
	 9750 7200 9900 7200 9900 7350 9750 7350 9750 7200
2 2 0 2 40 40 140 -1 20 0.000 0 0 -1 0 0 5
	 7125 7200 7275 7200 7275 7350 7125 7350 7125 7200
2 2 0 2 40 40 130 -1 20 6.000 0 0 -1 0 0 5
	 7125 5250 7275 5250 7275 5400 7125 5400 7125 5250
2 2 0 2 40 40 130 -1 20 6.000 0 0 -1 0 0 5
	 8625 5250 8775 5250 8775 5400 8625 5400 8625 5250
2 2 0 2 40 40 130 -1 20 6.000 0 0 -1 0 0 5
	 4200 5775 4350 5775 4350 6000 4200 6000 4200 5775
2 2 0 2 40 40 130 -1 20 6.000 0 0 7 0 0 5
	 4200 5250 4350 5250 4350 5400 4200 5400 4200 5250
2 2 0 2 40 40 130 -1 20 6.000 0 0 7 0 0 5
	 4125 4650 4275 4650 4275 4800 4125 4800 4125 4650
2 2 0 2 40 40 130 -1 20 6.000 0 0 7 0 0 5
	 5250 4650 5400 4650 5400 4800 5250 4800 5250 4650
2 1 0 2 40 40 130 -1 20 6.000 0 0 -1 0 0 11
	 1425 5700 1650 6000 1875 5700 1800 5700 1800 5400 1875 5400
	 1650 5100 1425 5400 1500 5400 1500 5700 1425 5700
2 2 0 2 40 40 160 -1 20 6.000 0 0 -1 0 0 5
	 4800 7650 4950 7650 4950 7800 4800 7800 4800 7650
2 2 0 2 40 40 160 -1 20 6.000 0 0 -1 0 0 5
	 2325 7200 2625 7200 2625 7350 2325 7350 2325 7200
2 2 0 2 40 40 160 -1 20 6.000 0 0 7 0 0 5
	 2925 5775 3075 5775 3075 6000 2925 6000 2925 5775
2 2 0 2 40 40 160 -1 20 6.000 0 0 -1 0 0 5
	 4200 6300 4350 6300 4350 6450 4200 6450 4200 6300
2 2 0 2 40 40 160 -1 20 6.000 0 0 -1 0 0 5
	 4200 7200 4350 7200 4350 7350 4200 7350 4200 7200
2 2 1 1 0 43 300 -1 20 4.000 0 0 -1 0 0 5
	 900 300 6225 300 6225 8775 900 8775 900 300
2 2 1 1 0 43 300 -1 20 4.000 0 0 -1 0 0 5
	 6525 300 7950 300 7950 8775 6525 8775 6525 300
2 2 1 1 0 43 300 -1 20 4.000 0 0 -1 0 0 5
	 8100 300 10500 300 10500 8775 8100 8775 8100 300
2 2 0 2 0 43 100 -1 34 6.000 0 0 -1 0 0 5
	 2475 5400 4950 5400 4950 5775 2475 5775 2475 5400
2 2 0 2 0 43 50 -1 34 6.000 0 0 -1 0 0 5
	 3675 4800 5925 4800 5925 5250 3675 5250 3675 4800
2 2 1 1 0 43 200 -1 18 4.000 0 0 -1 0 0 5
	 975 975 6075 975 6075 5850 975 5850 975 975
4 1 0 50 -1 0 18 0.0000 4 240 1950 2400 6450 Operating System\001
4 1 0 50 -1 0 18 0.0000 4 180 1755 2400 6780 Linux/Windows\001
4 1 0 50 -1 0 18 0.0000 4 180 540 2400 7110 DOS\001
4 1 0 50 -1 0 18 0.0000 4 240 1980 2250 7800 Control Computer\001
4 1 0 50 -1 0 18 0.0000 4 225 1650 2250 8130 Hardware (PC)\001
4 1 0 50 -1 0 24 0.0000 4 330 2265 3150 675 Control System\001
4 1 0 50 -1 0 24 0.0000 4 240 1305 7200 675 Device 1\001
4 1 0 50 -1 0 24 0.0000 4 240 1305 9000 675 Device 2\001
4 1 0 50 -1 0 24 0.0000 4 240 2220 3150 1425 CHROMuLAN\001
4 1 0 50 -1 0 18 0.0000 4 180 1065 3675 5700 uLan API\001
4 1 0 50 -1 0 18 0.0000 4 120 555 9825 7650 more\001
4 1 0 50 -1 0 18 0.0000 4 180 450 9825 7980 HW\001
4 1 0 50 -1 0 18 0.0000 4 180 1785 4725 5100 uLan net. model\001
4 1 0 50 -1 0 18 0.0000 4 180 1095 1650 4950 ULD files\001
4 1 0 50 -1 0 18 0.0000 4 210 1200 1650 4650 ULF, ULC\001
4 1 0 50 -1 0 18 0.0000 4 210 780 1650 4350 storage\001
4 1 0 50 -1 0 18 0.0000 4 225 720 2850 4950 (mem)\001
4 1 0 50 -1 0 18 0.0000 4 210 780 2850 4650 storage\001
4 1 0 50 -1 0 18 0.0000 4 240 705 2850 4350 Temp.\001
4 1 0 50 -1 0 18 0.0000 4 180 1050 1650 4125 Persistent\001
4 1 0 50 -1 0 18 0.0000 4 240 1440 3825 1875 Control logic\001
4 1 0 50 -1 0 18 0.0000 4 240 1815 3825 2175 IFPS interpretter\001
4 1 0 50 -1 0 18 0.0000 4 240 1290 1950 1800 User scripts\001
4 1 0 50 -1 0 18 0.0000 4 240 1650 1950 2025 parameters and\001
4 1 0 50 -1 0 18 0.0000 4 240 1455 1950 2250 acquired data\001
4 1 0 50 -1 0 18 0.0000 4 240 3495 3750 2775 Object tree browser and handler\001
4 1 0 50 -1 0 18 0.0000 4 240 3765 4125 3150 Object tree of branches, properties\001
4 1 0 50 -1 0 18 0.0000 4 240 2325 4725 3375 and process variables\001
4 1 0 50 -1 0 18 0.0000 4 120 795 9900 6600 sensors\001
4 1 0 50 -1 0 18 0.0000 4 150 390 9900 6900 etc.\001
4 1 0 50 -1 0 18 0.0000 4 180 465 9900 6375 llers\001
4 1 0 50 -1 0 18 0.0000 4 180 840 9900 6075 Contro-\001
4 1 0 50 -1 0 18 0.0000 4 150 720 9975 5025 meters\001
4 1 0 50 -1 0 18 0.0000 4 180 1440 9675 4125 variables and\001
4 1 0 50 -1 0 18 0.0000 4 180 705 9975 4425 device\001
4 1 0 50 -1 0 18 0.0000 4 180 555 9975 4725 para-\001
4 1 0 50 -1 0 18 0.0000 4 180 825 9750 3900 Process\001
4 1 0 50 -1 0 18 0.0000 4 240 1950 9300 3525 over uLan objects\001
4 1 0 50 -1 0 18 0.0000 4 240 1470 9300 3225 comunicating\001
4 1 0 50 -1 0 18 0.0000 4 240 1665 9300 2925 and application\001
4 1 0 50 -1 0 18 0.0000 4 240 1380 9300 2625 Device logic\001
4 1 0 50 -1 0 18 0.0000 4 240 1470 9300 1275 Local display\001
4 1 0 50 -1 0 18 0.0000 4 240 1440 9300 1575 keyboard, UI\001
4 1 0 50 -1 0 18 0.0000 4 240 1935 9300 1875 and time program\001
