EESchema Schematic File Version 4
EELAYER 30 0
EELAYER END
$Descr A4 11693 8268
encoding utf-8
Sheet 11 16
Title "SumIntADC NX breadboard"
Date "2021-11-12"
Rev "1.0"
Comp "PiKRON"
Comment1 "Pavel Píša, Petr Porazil, Jakub Ladman"
Comment2 "High Resolution SumInt ADC with Galvanic Isolation"
Comment3 ""
Comment4 ""
$EndDescr
$Comp
L Device:C_Small C?
U 1 1 61F33E24
P 3300 3800
AR Path="/61F33E24" Ref="C?"  Part="1" 
AR Path="/61833839/61F33E24" Ref="C?"  Part="1" 
AR Path="/622F77ED/61F33E24" Ref="C?"  Part="1" 
AR Path="/622F77ED/61EFFE1E/61F33E24" Ref="C1006"  Part="1" 
AR Path="/622F77ED/61FD0F9D/61F33E24" Ref="C1106"  Part="1" 
F 0 "C1106" V 3250 3600 50  0000 C CNN
F 1 "100n" V 3300 4100 50  0000 C CNN
F 2 "Capacitor_SMD:C_0805_2012Metric" H 3300 3800 50  0001 C CNN
F 3 "~" H 3300 3800 50  0001 C CNN
	1    3300 3800
	0    1    1    0   
$EndComp
$Comp
L Device:C_Small C?
U 1 1 61F33E2A
P 3300 3950
AR Path="/61F33E2A" Ref="C?"  Part="1" 
AR Path="/61833839/61F33E2A" Ref="C?"  Part="1" 
AR Path="/622F77ED/61F33E2A" Ref="C?"  Part="1" 
AR Path="/622F77ED/61EFFE1E/61F33E2A" Ref="C1007"  Part="1" 
AR Path="/622F77ED/61FD0F9D/61F33E2A" Ref="C1107"  Part="1" 
F 0 "C1107" V 3250 3750 50  0000 C CNN
F 1 "10n" V 3300 4250 50  0000 C CNN
F 2 "Capacitor_SMD:C_0805_2012Metric" H 3300 3950 50  0001 C CNN
F 3 "~" H 3300 3950 50  0001 C CNN
	1    3300 3950
	0    1    1    0   
$EndComp
Wire Wire Line
	3200 4100 3200 3950
Connection ~ 3200 3950
Wire Wire Line
	3200 3950 3200 3800
Wire Wire Line
	3400 3800 3400 3950
Connection ~ 3400 3950
Wire Wire Line
	3400 3950 3400 4100
$Comp
L Amplifier_Operational:AD8676xR U?
U 3 1 61F33E36
P 2900 4400
AR Path="/61F33E36" Ref="U?"  Part="2" 
AR Path="/61833839/61F33E36" Ref="U?"  Part="3" 
AR Path="/622F77ED/61F33E36" Ref="U?"  Part="3" 
AR Path="/622F77ED/61EFFE1E/61F33E36" Ref="U1002"  Part="3" 
AR Path="/622F77ED/61FD0F9D/61F33E36" Ref="U1102"  Part="3" 
F 0 "U1102" V 2650 4300 50  0000 L CNN
F 1 "LMP2012MA" V 2750 4150 50  0000 L CNN
F 2 "Package_SO:SOIC-8_3.9x4.9mm_P1.27mm" H 3000 4400 50  0001 C CNN
F 3 "https://www.ti.com/lit/gpn/lmp2012" H 3150 4550 50  0001 C CNN
	3    2900 4400
	1    0    0    -1  
$EndComp
Wire Wire Line
	3200 4100 2900 4100
Connection ~ 3200 4100
$Comp
L Device:C_Small C?
U 1 1 61F33E3E
P 3300 4100
AR Path="/61F33E3E" Ref="C?"  Part="1" 
AR Path="/61833839/61F33E3E" Ref="C?"  Part="1" 
AR Path="/622F77ED/61F33E3E" Ref="C?"  Part="1" 
AR Path="/622F77ED/61EFFE1E/61F33E3E" Ref="C1008"  Part="1" 
AR Path="/622F77ED/61FD0F9D/61F33E3E" Ref="C1108"  Part="1" 
F 0 "C1108" V 3250 3900 50  0000 C CNN
F 1 "100p" V 3300 4400 50  0000 C CNN
F 2 "Capacitor_SMD:C_0805_2012Metric" H 3300 4100 50  0001 C CNN
F 3 "~" H 3300 4100 50  0001 C CNN
	1    3300 4100
	0    1    1    0   
$EndComp
$Comp
L Device:C_Small C?
U 1 1 61F33E44
P 3300 4400
AR Path="/61F33E44" Ref="C?"  Part="1" 
AR Path="/61833839/61F33E44" Ref="C?"  Part="1" 
AR Path="/622F77ED/61F33E44" Ref="C?"  Part="1" 
AR Path="/622F77ED/61EFFE1E/61F33E44" Ref="C1009"  Part="1" 
AR Path="/622F77ED/61FD0F9D/61F33E44" Ref="C1109"  Part="1" 
F 0 "C1109" V 3250 4200 50  0000 C CNN
F 1 "100n" V 3300 4700 50  0000 C CNN
F 2 "Capacitor_SMD:C_0805_2012Metric" H 3300 4400 50  0001 C CNN
F 3 "~" H 3300 4400 50  0001 C CNN
	1    3300 4400
	0    1    1    0   
$EndComp
$Comp
L Device:C_Small C?
U 1 1 61F33E4A
P 3300 4550
AR Path="/61F33E4A" Ref="C?"  Part="1" 
AR Path="/61833839/61F33E4A" Ref="C?"  Part="1" 
AR Path="/622F77ED/61F33E4A" Ref="C?"  Part="1" 
AR Path="/622F77ED/61EFFE1E/61F33E4A" Ref="C1010"  Part="1" 
AR Path="/622F77ED/61FD0F9D/61F33E4A" Ref="C1110"  Part="1" 
F 0 "C1110" V 3250 4350 50  0000 C CNN
F 1 "10n" V 3300 4850 50  0000 C CNN
F 2 "Capacitor_SMD:C_0805_2012Metric" H 3300 4550 50  0001 C CNN
F 3 "~" H 3300 4550 50  0001 C CNN
	1    3300 4550
	0    1    1    0   
$EndComp
Wire Wire Line
	3200 4700 3200 4550
Connection ~ 3200 4550
Wire Wire Line
	3200 4550 3200 4400
Wire Wire Line
	3400 4400 3400 4550
Connection ~ 3400 4550
Wire Wire Line
	3400 4550 3400 4700
Wire Wire Line
	3200 4700 2900 4700
Connection ~ 3200 4700
$Comp
L Device:C_Small C?
U 1 1 61F33E58
P 3300 4700
AR Path="/61F33E58" Ref="C?"  Part="1" 
AR Path="/61833839/61F33E58" Ref="C?"  Part="1" 
AR Path="/622F77ED/61F33E58" Ref="C?"  Part="1" 
AR Path="/622F77ED/61EFFE1E/61F33E58" Ref="C1011"  Part="1" 
AR Path="/622F77ED/61FD0F9D/61F33E58" Ref="C1111"  Part="1" 
F 0 "C1111" V 3250 4500 50  0000 C CNN
F 1 "100p" V 3300 5000 50  0000 C CNN
F 2 "Capacitor_SMD:C_0805_2012Metric" H 3300 4700 50  0001 C CNN
F 3 "~" H 3300 4700 50  0001 C CNN
	1    3300 4700
	0    1    1    0   
$EndComp
Connection ~ 2900 4100
Connection ~ 2900 4700
$Comp
L project_power:GNDHR #PWR?
U 1 1 61F33E60
P 3400 4100
AR Path="/61833839/61F33E60" Ref="#PWR?"  Part="1" 
AR Path="/622F77ED/61F33E60" Ref="#PWR?"  Part="1" 
AR Path="/622F77ED/61EFFE1E/61F33E60" Ref="#PWR01009"  Part="1" 
AR Path="/622F77ED/61FD0F9D/61F33E60" Ref="#PWR01109"  Part="1" 
F 0 "#PWR01109" H 3400 3850 50  0001 C CNN
F 1 "GNDHR" H 3405 3927 50  0000 C CNN
F 2 "" H 3400 4100 50  0001 C CNN
F 3 "" H 3400 4100 50  0001 C CNN
	1    3400 4100
	1    0    0    -1  
$EndComp
Connection ~ 3400 4100
$Comp
L project_power:GNDHR #PWR?
U 1 1 61F33E67
P 3400 4700
AR Path="/61833839/61F33E67" Ref="#PWR?"  Part="1" 
AR Path="/622F77ED/61F33E67" Ref="#PWR?"  Part="1" 
AR Path="/622F77ED/61EFFE1E/61F33E67" Ref="#PWR01010"  Part="1" 
AR Path="/622F77ED/61FD0F9D/61F33E67" Ref="#PWR01110"  Part="1" 
F 0 "#PWR01110" H 3400 4450 50  0001 C CNN
F 1 "GNDHR" H 3405 4527 50  0000 C CNN
F 2 "" H 3400 4700 50  0001 C CNN
F 3 "" H 3400 4700 50  0001 C CNN
	1    3400 4700
	1    0    0    -1  
$EndComp
Connection ~ 3400 4700
Wire Wire Line
	6750 3350 6500 3350
Wire Wire Line
	6750 3700 6750 3350
$Comp
L Device:C_Small C?
U 1 1 61F33E71
P 6400 3350
AR Path="/61833839/61F33E71" Ref="C?"  Part="1" 
AR Path="/622F77ED/61F33E71" Ref="C?"  Part="1" 
AR Path="/622F77ED/61EFFE1E/61F33E71" Ref="C1012"  Part="1" 
AR Path="/622F77ED/61FD0F9D/61F33E71" Ref="C1112"  Part="1" 
F 0 "C1112" V 6629 3350 50  0000 C CNN
F 1 "1.8n/100" V 6538 3350 50  0000 C CNN
F 2 "Capacitor_SMD:C_1206_3216Metric" H 6400 3350 50  0001 C CNN
F 3 "https://cz.mouser.com/datasheet/2/40/C0GNP0_Dielectric-951274.pdf" H 6400 3350 50  0001 C CNN
F 4 "12061A182FAT2A KYOCERA AVX" V 6400 3350 50  0001 C CNN "PN"
	1    6400 3350
	0    1    -1   0   
$EndComp
$Comp
L project_power:GNDHR #PWR?
U 1 1 61F33E77
P 6150 3800
AR Path="/61833839/61F33E77" Ref="#PWR?"  Part="1" 
AR Path="/622F77ED/61F33E77" Ref="#PWR?"  Part="1" 
AR Path="/622F77ED/61EFFE1E/61F33E77" Ref="#PWR01012"  Part="1" 
AR Path="/622F77ED/61FD0F9D/61F33E77" Ref="#PWR01112"  Part="1" 
F 0 "#PWR01112" H 6150 3550 50  0001 C CNN
F 1 "GNDHR" H 6155 3627 50  0000 C CNN
F 2 "" H 6150 3800 50  0001 C CNN
F 3 "" H 6150 3800 50  0001 C CNN
	1    6150 3800
	1    0    0    -1  
$EndComp
$Comp
L Amplifier_Operational:AD8676xR U?
U 2 1 61F33E7D
P 7550 4500
AR Path="/61F33E7D" Ref="U?"  Part="2" 
AR Path="/61833839/61F33E7D" Ref="U?"  Part="1" 
AR Path="/622F77ED/61F33E7D" Ref="U?"  Part="2" 
AR Path="/622F77ED/61EFFE1E/61F33E7D" Ref="U1002"  Part="2" 
AR Path="/622F77ED/61FD0F9D/61F33E7D" Ref="U1102"  Part="2" 
F 0 "U1102" H 7600 4700 50  0000 C CNN
F 1 "LMP2012MA" H 7600 4800 50  0000 C CNN
F 2 "Package_SO:SOIC-8_3.9x4.9mm_P1.27mm" H 7650 4500 50  0001 C CNN
F 3 "https://www.ti.com/lit/gpn/lmp2012" H 7800 4650 50  0001 C CNN
	2    7550 4500
	1    0    0    1   
$EndComp
Wire Wire Line
	6750 3700 8400 3700
Connection ~ 6750 3700
$Comp
L Device:R_Small R?
U 1 1 61F33E85
P 7600 4250
AR Path="/61833839/61F33E85" Ref="R?"  Part="1" 
AR Path="/622F77ED/61F33E85" Ref="R?"  Part="1" 
AR Path="/622F77ED/61EFFE1E/61F33E85" Ref="R1020"  Part="1" 
AR Path="/622F77ED/61FD0F9D/61F33E85" Ref="R1120"  Part="1" 
F 0 "R1120" V 7550 4050 50  0000 C CNN
F 1 "47k 0.1%" V 7550 4500 50  0000 C CNN
F 2 "Resistor_SMD:R_0805_2012Metric" H 7600 4250 50  0001 C CNN
F 3 "http://industrial.panasonic.com/cdbs/www-data/pdf/RDM0000/AOA0000C307.pdf" H 6500 3950 50  0001 C CNN
F 4 "ERA6ARW473V" V 6500 3950 50  0001 C CNN "PN"
	1    7600 4250
	0    1    1    0   
$EndComp
$Comp
L Device:R_Small R?
U 1 1 61F33E8B
P 7050 4250
AR Path="/61833839/61F33E8B" Ref="R?"  Part="1" 
AR Path="/622F77ED/61F33E8B" Ref="R?"  Part="1" 
AR Path="/622F77ED/61EFFE1E/61F33E8B" Ref="R1017"  Part="1" 
AR Path="/622F77ED/61FD0F9D/61F33E8B" Ref="R1117"  Part="1" 
F 0 "R1117" V 6854 4250 50  0000 C CNN
F 1 "47k 0.1%" V 6945 4250 50  0000 C CNN
F 2 "Resistor_SMD:R_0805_2012Metric" H 7050 4250 50  0001 C CNN
F 3 "http://industrial.panasonic.com/cdbs/www-data/pdf/RDM0000/AOA0000C307.pdf" H 6500 3950 50  0001 C CNN
F 4 "ERA6ARW473V" V 6500 3950 50  0001 C CNN "PN"
	1    7050 4250
	0    1    1    0   
$EndComp
Wire Wire Line
	7250 4400 7250 4250
Wire Wire Line
	7250 4250 7150 4250
Wire Wire Line
	7250 4250 7500 4250
Connection ~ 7250 4250
$Comp
L Device:R_Small R?
U 1 1 61F33E95
P 7600 4150
AR Path="/61833839/61F33E95" Ref="R?"  Part="1" 
AR Path="/622F77ED/61F33E95" Ref="R?"  Part="1" 
AR Path="/622F77ED/61EFFE1E/61F33E95" Ref="R1019"  Part="1" 
AR Path="/622F77ED/61FD0F9D/61F33E95" Ref="R1119"  Part="1" 
F 0 "R1119" V 7550 3950 50  0000 C CNN
F 1 "47k 0.1%" V 7550 4400 50  0000 C CNN
F 2 "Resistor_SMD:R_0805_2012Metric" H 7600 4150 50  0001 C CNN
F 3 "http://industrial.panasonic.com/cdbs/www-data/pdf/RDM0000/AOA0000C307.pdf" H 6500 3950 50  0001 C CNN
F 4 "ERA6ARW473V" V 6500 3950 50  0001 C CNN "PN"
	1    7600 4150
	0    1    1    0   
$EndComp
$Comp
L Device:R_Small R?
U 1 1 61F33E9B
P 7600 4050
AR Path="/61833839/61F33E9B" Ref="R?"  Part="1" 
AR Path="/622F77ED/61F33E9B" Ref="R?"  Part="1" 
AR Path="/622F77ED/61EFFE1E/61F33E9B" Ref="R1018"  Part="1" 
AR Path="/622F77ED/61FD0F9D/61F33E9B" Ref="R1118"  Part="1" 
F 0 "R1118" V 7550 3850 50  0000 C CNN
F 1 "47k 0.1%" V 7550 4300 50  0000 C CNN
F 2 "Resistor_SMD:R_0805_2012Metric" H 7600 4050 50  0001 C CNN
F 3 "http://industrial.panasonic.com/cdbs/www-data/pdf/RDM0000/AOA0000C307.pdf" H 6500 3950 50  0001 C CNN
F 4 "ERA6ARW473V" V 6500 3950 50  0001 C CNN "PN"
	1    7600 4050
	0    1    1    0   
$EndComp
Wire Wire Line
	7500 4050 7250 4050
Wire Wire Line
	7250 4050 7250 4150
Wire Wire Line
	7500 4150 7250 4150
Connection ~ 7250 4150
Wire Wire Line
	7250 4150 7250 4250
Wire Wire Line
	7700 4050 8050 4050
Wire Wire Line
	8050 4050 8050 4150
Wire Wire Line
	8050 4500 7850 4500
Wire Wire Line
	7700 4150 8050 4150
Connection ~ 8050 4150
Wire Wire Line
	8050 4150 8050 4250
Wire Wire Line
	7700 4250 8050 4250
Connection ~ 8050 4250
Wire Wire Line
	8050 4250 8050 4500
$Comp
L project_power:GNDHR #PWR?
U 1 1 61F33EAF
P 7250 4600
AR Path="/61833839/61F33EAF" Ref="#PWR?"  Part="1" 
AR Path="/622F77ED/61F33EAF" Ref="#PWR?"  Part="1" 
AR Path="/622F77ED/61EFFE1E/61F33EAF" Ref="#PWR01014"  Part="1" 
AR Path="/622F77ED/61FD0F9D/61F33EAF" Ref="#PWR01114"  Part="1" 
F 0 "#PWR01114" H 7250 4350 50  0001 C CNN
F 1 "GNDA" H 7255 4427 50  0000 C CNN
F 2 "" H 7250 4600 50  0001 C CNN
F 3 "" H 7250 4600 50  0001 C CNN
	1    7250 4600
	1    0    0    -1  
$EndComp
Text Notes 7300 3950 0    50   ~ 0
(-1.25V, or\n -0.833V depending on population)\n
$Comp
L Device:R_Small R?
U 1 1 61F33EB6
P 5500 3350
AR Path="/61833839/61F33EB6" Ref="R?"  Part="1" 
AR Path="/622F77ED/61F33EB6" Ref="R?"  Part="1" 
AR Path="/622F77ED/61EFFE1E/61F33EB6" Ref="R1014"  Part="1" 
AR Path="/622F77ED/61FD0F9D/61F33EB6" Ref="R1114"  Part="1" 
F 0 "R1114" V 5304 3350 50  0000 C CNN
F 1 "47k 0.1%" V 5395 3350 50  0000 C CNN
F 2 "Resistor_SMD:R_0805_2012Metric" H 5500 3350 50  0001 C CNN
F 3 "http://industrial.panasonic.com/cdbs/www-data/pdf/RDM0000/AOA0000C307.pdf" H 6500 3950 50  0001 C CNN
F 4 "ERA6ARW473V" V 6500 3950 50  0001 C CNN "PN"
	1    5500 3350
	0    1    1    0   
$EndComp
$Comp
L Device:R_Small R?
U 1 1 61F33EBC
P 5100 3350
AR Path="/61833839/61F33EBC" Ref="R?"  Part="1" 
AR Path="/622F77ED/61F33EBC" Ref="R?"  Part="1" 
AR Path="/622F77ED/61EFFE1E/61F33EBC" Ref="R1013"  Part="1" 
AR Path="/622F77ED/61FD0F9D/61F33EBC" Ref="R1113"  Part="1" 
F 0 "R1113" V 4904 3350 50  0000 C CNN
F 1 "47k 0.1%" V 4995 3350 50  0000 C CNN
F 2 "Resistor_SMD:R_0805_2012Metric" H 5100 3350 50  0001 C CNN
F 3 "http://industrial.panasonic.com/cdbs/www-data/pdf/RDM0000/AOA0000C307.pdf" H 6500 3950 50  0001 C CNN
F 4 "ERA6ARW473V" V 6500 3950 50  0001 C CNN "PN"
	1    5100 3350
	0    1    1    0   
$EndComp
Wire Wire Line
	5900 3350 5900 3600
Wire Wire Line
	5650 4250 5650 4200
Connection ~ 5900 3350
Wire Wire Line
	5900 3350 5600 3350
Wire Wire Line
	5900 3350 6300 3350
Wire Wire Line
	6150 3600 5900 3600
Wire Wire Line
	5600 4200 5650 4200
Wire Wire Line
	5600 4300 5650 4300
Wire Wire Line
	5650 4250 5650 4300
$Comp
L Device:R_Small R?
U 1 1 61F33ECE
P 5000 4250
AR Path="/61833839/61F33ECE" Ref="R?"  Part="1" 
AR Path="/622F77ED/61F33ECE" Ref="R?"  Part="1" 
AR Path="/622F77ED/61EFFE1E/61F33ECE" Ref="R1012"  Part="1" 
AR Path="/622F77ED/61FD0F9D/61F33ECE" Ref="R1112"  Part="1" 
F 0 "R1112" V 5196 4250 50  0000 C CNN
F 1 "100R" V 5105 4250 50  0000 C CNN
F 2 "Resistor_SMD:R_0805_2012Metric" H 5000 4250 50  0001 C CNN
F 3 "~" H 5000 4250 50  0001 C CNN
	1    5000 4250
	1    0    0    -1  
$EndComp
$Comp
L Diode:BAT54S D?
U 1 1 61F33ED4
P 4800 4250
AR Path="/622F77ED/61F33ED4" Ref="D?"  Part="1" 
AR Path="/622F77ED/61EFFE1E/61F33ED4" Ref="D1001"  Part="1" 
AR Path="/622F77ED/61FD0F9D/61F33ED4" Ref="D1101"  Part="1" 
F 0 "D1101" V 5000 3950 50  0000 L CNN
F 1 "BAT54S" H 4650 4350 50  0000 L CNN
F 2 "Package_TO_SOT_SMD:SOT-23" H 4875 4375 50  0001 L CNN
F 3 "https://www.diodes.com/assets/Datasheets/ds11005.pdf" H 4680 4250 50  0001 C CNN
	1    4800 4250
	0    1    -1   0   
$EndComp
Connection ~ 5650 4250
Wire Wire Line
	5650 4250 5900 4250
Wire Wire Line
	5900 4250 5900 3600
Connection ~ 5900 3600
Connection ~ 5000 3950
Wire Wire Line
	5000 3950 4800 3950
Connection ~ 5000 4550
Wire Wire Line
	5000 4550 4800 4550
Wire Wire Line
	5000 4350 5000 4550
$Comp
L Transistor_FET:BSS123 Q?
U 1 1 61F33EE3
P 5200 4550
AR Path="/622F77ED/61F33EE3" Ref="Q?"  Part="1" 
AR Path="/622F77ED/61ACF1DD/61F33EE3" Ref="Q?"  Part="1" 
AR Path="/622F77ED/61EFFE1E/61F33EE3" Ref="Q1002"  Part="1" 
AR Path="/622F77ED/61FD0F9D/61F33EE3" Ref="Q1102"  Part="1" 
F 0 "Q1102" H 5400 4450 50  0000 L CNN
F 1 "BSS205N" H 4900 4350 50  0000 L CNN
F 2 "Package_TO_SOT_SMD:SOT-23" H 5400 4475 50  0001 L CIN
F 3 "https://www.infineon.com/cms/en/product/power/mosfet/small-signal-small-power/bss205n/#!?fileId=db3a304330f686060131091244950062" H 5200 4550 50  0001 L CNN
	1    5200 4550
	1    0    0    -1  
$EndComp
Wire Wire Line
	5000 3950 5000 4150
$Comp
L Transistor_FET:IRLML6401 Q?
U 1 1 61F33EEA
P 5200 3950
AR Path="/622F77ED/61F33EEA" Ref="Q?"  Part="1" 
AR Path="/622F77ED/61ACF1DD/61F33EEA" Ref="Q?"  Part="1" 
AR Path="/622F77ED/61EFFE1E/61F33EEA" Ref="Q1001"  Part="1" 
AR Path="/622F77ED/61FD0F9D/61F33EEA" Ref="Q1101"  Part="1" 
F 0 "Q1101" H 5400 3800 50  0000 L CNN
F 1 "IRLML6401" H 4850 3750 50  0000 L CNN
F 2 "Package_TO_SOT_SMD:SOT-23" H 5400 3875 50  0001 L CIN
F 3 "https://www.infineon.com/dgdl/irlml6401pbf.pdf?fileId=5546d462533600a401535668b96d2634" H 5200 3950 50  0001 L CNN
	1    5200 3950
	1    0    0    1   
$EndComp
Wire Wire Line
	5300 4350 5300 4300
Wire Wire Line
	5400 4200 5300 4200
Connection ~ 5300 4200
Wire Wire Line
	5300 4200 5300 4150
Wire Wire Line
	5400 4300 5300 4300
Connection ~ 5300 4300
Wire Wire Line
	5300 4300 5300 4200
$Comp
L Device:R_Small R?
U 1 1 61F33EF7
P 5500 4300
AR Path="/61833839/61F33EF7" Ref="R?"  Part="1" 
AR Path="/622F77ED/61F33EF7" Ref="R?"  Part="1" 
AR Path="/622F77ED/61EFFE1E/61F33EF7" Ref="R1016"  Part="1" 
AR Path="/622F77ED/61FD0F9D/61F33EF7" Ref="R1116"  Part="1" 
F 0 "R1116" V 5600 4300 50  0000 C CNN
F 1 "47k 0.1%" V 5700 4400 50  0000 C CNN
F 2 "Resistor_SMD:R_0805_2012Metric" H 5500 4300 50  0001 C CNN
F 3 "http://industrial.panasonic.com/cdbs/www-data/pdf/RDM0000/AOA0000C307.pdf" H 6500 3950 50  0001 C CNN
F 4 "ERA6ARW473V" V 6500 3950 50  0001 C CNN "PN"
	1    5500 4300
	0    1    1    0   
$EndComp
$Comp
L Device:R_Small R?
U 1 1 61F33EFD
P 5500 4200
AR Path="/61833839/61F33EFD" Ref="R?"  Part="1" 
AR Path="/622F77ED/61F33EFD" Ref="R?"  Part="1" 
AR Path="/622F77ED/61EFFE1E/61F33EFD" Ref="R1015"  Part="1" 
AR Path="/622F77ED/61FD0F9D/61F33EFD" Ref="R1115"  Part="1" 
F 0 "R1115" V 5300 4200 50  0000 C CNN
F 1 "47k 0.1%" V 5400 4300 50  0000 C CNN
F 2 "Resistor_SMD:R_0805_2012Metric" H 5500 4200 50  0001 C CNN
F 3 "http://industrial.panasonic.com/cdbs/www-data/pdf/RDM0000/AOA0000C307.pdf" H 6500 3950 50  0001 C CNN
F 4 "ERA6ARW473V" V 6500 3950 50  0001 C CNN "PN"
	1    5500 4200
	0    1    1    0   
$EndComp
$Comp
L Amplifier_Operational:AD8676xR U?
U 1 1 61F33F03
P 6450 3700
AR Path="/61F33F03" Ref="U?"  Part="1" 
AR Path="/61833839/61F33F03" Ref="U?"  Part="1" 
AR Path="/622F77ED/61F33F03" Ref="U?"  Part="1" 
AR Path="/622F77ED/61EFFE1E/61F33F03" Ref="U1002"  Part="1" 
AR Path="/622F77ED/61FD0F9D/61F33F03" Ref="U1102"  Part="1" 
F 0 "U1102" H 6600 3550 50  0000 C CNN
F 1 "LMP2012MA" H 6450 4050 50  0000 C CNN
F 2 "Package_SO:SOIC-8_3.9x4.9mm_P1.27mm" H 6550 3700 50  0001 C CNN
F 3 "https://www.ti.com/lit/gpn/lmp2012" H 6700 3850 50  0001 C CNN
	1    6450 3700
	1    0    0    1   
$EndComp
Wire Wire Line
	9000 3900 9000 4250
Wire Wire Line
	9000 3900 9100 3900
$Comp
L project_power:GNDHR #PWR?
U 1 1 61F33F0B
P 9250 4250
AR Path="/61833839/61F33F0B" Ref="#PWR?"  Part="1" 
AR Path="/622F77ED/61F33F0B" Ref="#PWR?"  Part="1" 
AR Path="/622F77ED/61EFFE1E/61F33F0B" Ref="#PWR01015"  Part="1" 
AR Path="/622F77ED/61FD0F9D/61F33F0B" Ref="#PWR01115"  Part="1" 
F 0 "#PWR01115" H 9250 4000 50  0001 C CNN
F 1 "GNDHR" H 9255 4077 50  0000 C CNN
F 2 "" H 9250 4250 50  0001 C CNN
F 3 "" H 9250 4250 50  0001 C CNN
	1    9250 4250
	1    0    0    -1  
$EndComp
$Comp
L Connector:Conn_01x03_Male J?
U 1 1 61F33F11
P 6550 4700
AR Path="/622F77ED/61F33F11" Ref="J?"  Part="1" 
AR Path="/622F77ED/61EFFE1E/61F33F11" Ref="J1010"  Part="1" 
AR Path="/622F77ED/61FD0F9D/61F33F11" Ref="J1110"  Part="1" 
F 0 "J1110" V 6550 4900 50  0000 C CNN
F 1 "Conn_01x03_Male" V 6450 4700 50  0000 C CNN
F 2 "Connector_PinHeader_2.54mm:PinHeader_1x03_P2.54mm_Vertical" H 6550 4700 50  0001 C CNN
F 3 "~" H 6550 4700 50  0001 C CNN
	1    6550 4700
	0    1    -1   0   
$EndComp
Wire Wire Line
	6550 4250 6550 4500
Wire Wire Line
	6650 4500 6650 4450
Wire Wire Line
	6450 4500 6450 4450
Wire Wire Line
	6450 4450 6350 4450
Wire Wire Line
	2250 3650 2000 3650
$Comp
L Connector_Generic:Conn_01x02 J?
U 1 1 61F33F1C
P 1800 3650
AR Path="/61F33F1C" Ref="J?"  Part="1" 
AR Path="/6169E126/61F33F1C" Ref="J?"  Part="1" 
AR Path="/619D5072/61F33F1C" Ref="J?"  Part="1" 
AR Path="/622F77ED/61F33F1C" Ref="J?"  Part="1" 
AR Path="/622F77ED/61EFFE1E/61F33F1C" Ref="J1005"  Part="1" 
AR Path="/622F77ED/61FD0F9D/61F33F1C" Ref="J1105"  Part="1" 
F 0 "J1105" H 2250 3550 50  0000 C CNN
F 1 "Conn_01x02" H 2100 3650 50  0000 C CNN
F 2 "Connector_PinHeader_2.54mm:PinHeader_1x02_P2.54mm_Vertical" H 1800 3650 50  0001 C CNN
F 3 "~" H 1800 3650 50  0001 C CNN
	1    1800 3650
	-1   0    0    -1  
$EndComp
Wire Wire Line
	2050 3150 2050 3450
Wire Wire Line
	2050 3450 2050 3750
Wire Wire Line
	2000 3450 2050 3450
Wire Wire Line
	2250 3650 2250 3600
Wire Wire Line
	2000 3750 2050 3750
Connection ~ 2250 3350
Wire Wire Line
	2000 3350 2250 3350
Connection ~ 2050 3450
$Comp
L Connector_Generic:Conn_01x02 J?
U 1 1 61F33F2A
P 1800 3350
AR Path="/61F33F2A" Ref="J?"  Part="1" 
AR Path="/6169E126/61F33F2A" Ref="J?"  Part="1" 
AR Path="/619D5072/61F33F2A" Ref="J?"  Part="1" 
AR Path="/622F77ED/61F33F2A" Ref="J?"  Part="1" 
AR Path="/622F77ED/61EFFE1E/61F33F2A" Ref="J1004"  Part="1" 
AR Path="/622F77ED/61FD0F9D/61F33F2A" Ref="J1104"  Part="1" 
F 0 "J1104" H 2250 3250 50  0000 C CNN
F 1 "Conn_01x02" H 2100 3350 50  0000 C CNN
F 2 "Connector_PinHeader_2.54mm:PinHeader_1x02_P2.54mm_Vertical" H 1800 3350 50  0001 C CNN
F 3 "~" H 1800 3350 50  0001 C CNN
	1    1800 3350
	-1   0    0    -1  
$EndComp
Wire Wire Line
	2250 3400 2250 3350
$Comp
L Connector:Conn_Coaxial J?
U 1 1 61F33F31
P 2250 3150
AR Path="/61F33F31" Ref="J?"  Part="1" 
AR Path="/6169E126/61F33F31" Ref="J?"  Part="1" 
AR Path="/619D5072/61F33F31" Ref="J?"  Part="1" 
AR Path="/622F77ED/61F33F31" Ref="J?"  Part="1" 
AR Path="/622F77ED/61EFFE1E/61F33F31" Ref="J1006"  Part="1" 
AR Path="/622F77ED/61FD0F9D/61F33F31" Ref="J1106"  Part="1" 
F 0 "J1106" V 2550 3100 50  0000 L CNN
F 1 "5-1814832-2" V 2450 2900 50  0000 L CNN
F 2 "Connector_Coaxial:SMA_Amphenol_132291_Vertical" H 2250 3150 50  0001 C CNN
F 3 "https://www.te.com/commerce/DocumentDelivery/DDEController?Action=showdoc&DocId=Customer+Drawing%7F1814832%7FC%7Fpdf%7FEnglish%7FENG_CD_1814832_C.pdf%7F5-1814832-2" H 2250 3150 50  0001 C CNN
	1    2250 3150
	0    1    -1   0   
$EndComp
$Comp
L Device:R_Small R?
U 1 1 61F33F37
P 2250 3500
AR Path="/61F33F37" Ref="R?"  Part="1" 
AR Path="/6169E126/61F33F37" Ref="R?"  Part="1" 
AR Path="/619D5072/61F33F37" Ref="R?"  Part="1" 
AR Path="/622F77ED/61F33F37" Ref="R?"  Part="1" 
AR Path="/622F77ED/61EFFE1E/61F33F37" Ref="R1009"  Part="1" 
AR Path="/622F77ED/61FD0F9D/61F33F37" Ref="R1109"  Part="1" 
F 0 "R1109" H 1950 3450 50  0000 L CNN
F 1 "49R9" H 2000 3550 50  0000 L CNN
F 2 "Resistor_SMD:R_0805_2012Metric" H 2250 3500 50  0001 C CNN
F 3 "~" H 2250 3500 50  0001 C CNN
	1    2250 3500
	-1   0    0    1   
$EndComp
Wire Wire Line
	2250 3350 3250 3350
$Comp
L Device:R_Small R?
U 1 1 61F33F3E
P 4700 3350
AR Path="/61833839/61F33F3E" Ref="R?"  Part="1" 
AR Path="/622F77ED/61F33F3E" Ref="R?"  Part="1" 
AR Path="/622F77ED/61EFFE1E/61F33F3E" Ref="R1011"  Part="1" 
AR Path="/622F77ED/61FD0F9D/61F33F3E" Ref="R1111"  Part="1" 
F 0 "R1111" V 4504 3350 50  0000 C CNN
F 1 "47k 0.1%" V 4595 3350 50  0000 C CNN
F 2 "Resistor_SMD:R_0805_2012Metric" H 4700 3350 50  0001 C CNN
F 3 "http://industrial.panasonic.com/cdbs/www-data/pdf/RDM0000/AOA0000C307.pdf" H 6500 3950 50  0001 C CNN
F 4 "ERA6ARW473V" V 6500 3950 50  0001 C CNN "PN"
	1    4700 3350
	0    1    1    0   
$EndComp
$Comp
L Device:R_Small R?
U 1 1 61F33F44
P 4300 3350
AR Path="/61833839/61F33F44" Ref="R?"  Part="1" 
AR Path="/622F77ED/61F33F44" Ref="R?"  Part="1" 
AR Path="/622F77ED/61EFFE1E/61F33F44" Ref="R1010"  Part="1" 
AR Path="/622F77ED/61FD0F9D/61F33F44" Ref="R1110"  Part="1" 
F 0 "R1110" V 4104 3350 50  0000 C CNN
F 1 "47k 0.1%" V 4195 3350 50  0000 C CNN
F 2 "Resistor_SMD:R_0805_2012Metric" H 4300 3350 50  0001 C CNN
F 3 "http://industrial.panasonic.com/cdbs/www-data/pdf/RDM0000/AOA0000C307.pdf" H 6500 3950 50  0001 C CNN
F 4 "ERA6ARW473V" V 6500 3950 50  0001 C CNN "PN"
	1    4300 3350
	0    1    1    0   
$EndComp
Wire Wire Line
	4800 3350 4900 3350
Wire Wire Line
	4400 3350 4500 3350
$Comp
L Connector_Generic:Conn_02x03_Odd_Even J?
U 1 1 61F33F4C
P 4500 2800
AR Path="/622F77ED/61F33F4C" Ref="J?"  Part="1" 
AR Path="/622F77ED/61EFFE1E/61F33F4C" Ref="J1008"  Part="1" 
AR Path="/622F77ED/61FD0F9D/61F33F4C" Ref="J1108"  Part="1" 
F 0 "J1108" V 4596 2612 50  0000 R CNN
F 1 "Conn_02x03_Odd_Even" V 4900 3200 50  0000 R CNN
F 2 "Connector_PinHeader_2.54mm:PinHeader_2x03_P2.54mm_Vertical" H 4500 2800 50  0001 C CNN
F 3 "~" H 4500 2800 50  0001 C CNN
	1    4500 2800
	0    -1   -1   0   
$EndComp
Wire Wire Line
	4400 3000 4100 3000
Wire Wire Line
	4100 3000 4100 3350
Wire Wire Line
	4500 3000 4500 3350
Wire Wire Line
	4600 3000 4900 3000
Wire Wire Line
	4900 3000 4900 3350
Wire Wire Line
	4400 2500 4500 2500
Connection ~ 4500 2500
Wire Wire Line
	4500 2500 4600 2500
Connection ~ 4100 3350
Wire Wire Line
	4100 3350 4200 3350
Connection ~ 4500 3350
Wire Wire Line
	4500 3350 4600 3350
Connection ~ 4900 3350
Wire Wire Line
	4900 3350 5000 3350
$Comp
L Connector:Conn_01x03_Male J?
U 1 1 61F33F65
P 9000 4450
AR Path="/622F77ED/61F33F65" Ref="J?"  Part="1" 
AR Path="/622F77ED/61EFFE1E/61F33F65" Ref="J1011"  Part="1" 
AR Path="/622F77ED/61FD0F9D/61F33F65" Ref="J1111"  Part="1" 
F 0 "J1111" V 8800 4450 50  0000 C CNN
F 1 "Conn_01x03_Male" V 8900 4450 50  0000 C CNN
F 2 "Connector_PinHeader_2.54mm:PinHeader_1x03_P2.54mm_Vertical" H 9000 4450 50  0001 C CNN
F 3 "~" H 9000 4450 50  0001 C CNN
	1    9000 4450
	0    1    -1   0   
$EndComp
Wire Wire Line
	9250 4250 9100 4250
$Comp
L Device:R_Small R?
U 1 1 61F33F6C
P 9100 4100
AR Path="/61833839/61F33F6C" Ref="R?"  Part="1" 
AR Path="/622F77ED/61F33F6C" Ref="R?"  Part="1" 
AR Path="/622F77ED/61EFFE1E/61F33F6C" Ref="R1021"  Part="1" 
AR Path="/622F77ED/61FD0F9D/61F33F6C" Ref="R1121"  Part="1" 
F 0 "R1121" H 9041 4054 50  0000 R CNN
F 1 "4M7" H 9041 4145 50  0000 R CNN
F 2 "Resistor_SMD:R_0805_2012Metric" H 9100 4100 50  0001 C CNN
F 3 "~" H 9100 4100 50  0001 C CNN
	1    9100 4100
	-1   0    0    1   
$EndComp
Wire Wire Line
	9100 4000 9100 3900
Connection ~ 9100 3900
Wire Wire Line
	9100 3900 9350 3900
Wire Wire Line
	9100 4200 9100 4250
Connection ~ 9100 4250
$Comp
L Connector:Conn_01x02_Male J?
U 1 1 61F33F77
P 3050 2900
AR Path="/622F77ED/61F33F77" Ref="J?"  Part="1" 
AR Path="/622F77ED/61EFFE1E/61F33F77" Ref="J1007"  Part="1" 
AR Path="/622F77ED/61FD0F9D/61F33F77" Ref="J1107"  Part="1" 
F 0 "J1107" H 3150 3150 50  0000 C CNN
F 1 "Conn_01x02_Male" H 3150 3050 50  0000 C CNN
F 2 "Connector_PinHeader_2.54mm:PinHeader_1x02_P2.54mm_Vertical" H 3050 2900 50  0001 C CNN
F 3 "~" H 3050 2900 50  0001 C CNN
	1    3050 2900
	1    0    0    -1  
$EndComp
Wire Wire Line
	3250 3000 3250 3350
Connection ~ 3250 3350
Wire Wire Line
	3250 3350 4100 3350
Wire Wire Line
	3250 2900 3400 2900
Wire Wire Line
	6350 3000 5900 3000
Wire Wire Line
	5900 3000 5900 3350
Wire Wire Line
	6750 3000 6750 3350
Connection ~ 6750 3350
$Comp
L project_power:GNDHR #PWR?
U 1 1 61F33F85
P 6100 2500
AR Path="/61833839/61F33F85" Ref="#PWR?"  Part="1" 
AR Path="/622F77ED/61F33F85" Ref="#PWR?"  Part="1" 
AR Path="/622F77ED/61EFFE1E/61F33F85" Ref="#PWR01011"  Part="1" 
AR Path="/622F77ED/61FD0F9D/61F33F85" Ref="#PWR01111"  Part="1" 
F 0 "#PWR01111" H 6100 2250 50  0001 C CNN
F 1 "GNDHR" H 6105 2327 50  0000 C CNN
F 2 "" H 6100 2500 50  0001 C CNN
F 3 "" H 6100 2500 50  0001 C CNN
	1    6100 2500
	1    0    0    -1  
$EndComp
$Comp
L project_power:+VHR #PWR?
U 1 1 61F33F8B
P 2900 4100
AR Path="/622F77ED/61F33F8B" Ref="#PWR?"  Part="1" 
AR Path="/622F77ED/61EFFE1E/61F33F8B" Ref="#PWR01007"  Part="1" 
AR Path="/622F77ED/61FD0F9D/61F33F8B" Ref="#PWR01107"  Part="1" 
F 0 "#PWR01107" H 2900 3950 50  0001 C CNN
F 1 "+VHR" H 2915 4273 50  0000 C CNN
F 2 "" H 2900 4100 50  0001 C CNN
F 3 "" H 2900 4100 50  0001 C CNN
	1    2900 4100
	1    0    0    -1  
$EndComp
$Comp
L project_power:-VHR #PWR?
U 1 1 61F33F91
P 2900 4700
AR Path="/622F77ED/61F33F91" Ref="#PWR?"  Part="1" 
AR Path="/622F77ED/61EFFE1E/61F33F91" Ref="#PWR01008"  Part="1" 
AR Path="/622F77ED/61FD0F9D/61F33F91" Ref="#PWR01108"  Part="1" 
F 0 "#PWR01108" H 2900 4800 50  0001 C CNN
F 1 "-VHR" H 2915 4873 50  0000 C CNN
F 2 "" H 2900 4700 50  0001 C CNN
F 3 "" H 2900 4700 50  0001 C CNN
	1    2900 4700
	-1   0    0    1   
$EndComp
$Comp
L project_power:+VREF #PWR?
U 1 1 61F33F97
P 6650 4450
AR Path="/622F77ED/61F33F97" Ref="#PWR?"  Part="1" 
AR Path="/622F77ED/61EFFE1E/61F33F97" Ref="#PWR01013"  Part="1" 
AR Path="/622F77ED/61FD0F9D/61F33F97" Ref="#PWR01113"  Part="1" 
F 0 "#PWR01113" H 6650 4300 50  0001 C CNN
F 1 "+VREF" H 6800 4550 50  0000 C CNN
F 2 "" H 6650 4450 50  0001 C CNN
F 3 "" H 6650 4450 50  0001 C CNN
	1    6650 4450
	1    0    0    -1  
$EndComp
$Comp
L project_power:GNDHR #PWR?
U 1 1 61F33F9D
P 2050 3750
AR Path="/61833839/61F33F9D" Ref="#PWR?"  Part="1" 
AR Path="/622F77ED/61F33F9D" Ref="#PWR?"  Part="1" 
AR Path="/622F77ED/61EFFE1E/61F33F9D" Ref="#PWR01006"  Part="1" 
AR Path="/622F77ED/61FD0F9D/61F33F9D" Ref="#PWR01106"  Part="1" 
F 0 "#PWR01106" H 2050 3500 50  0001 C CNN
F 1 "GNDHR" H 2055 3577 50  0000 C CNN
F 2 "" H 2050 3750 50  0001 C CNN
F 3 "" H 2050 3750 50  0001 C CNN
	1    2050 3750
	1    0    0    -1  
$EndComp
Connection ~ 2050 3750
Wire Wire Line
	6100 2500 6350 2500
Wire Wire Line
	6450 3000 6750 3000
$Comp
L Connector_Generic:Conn_02x02_Odd_Even J?
U 1 1 61F33FA6
P 6350 2800
AR Path="/622F77ED/61F33FA6" Ref="J?"  Part="1" 
AR Path="/622F77ED/61EFFE1E/61F33FA6" Ref="J1009"  Part="1" 
AR Path="/622F77ED/61FD0F9D/61F33FA6" Ref="J1109"  Part="1" 
F 0 "J1109" V 6354 2880 50  0000 L CNN
F 1 "Conn_02x02_Odd_Even" V 6750 2400 50  0000 L CNN
F 2 "Connector_PinHeader_2.54mm:PinHeader_2x02_P2.54mm_Vertical" H 6350 2800 50  0001 C CNN
F 3 "~" H 6350 2800 50  0001 C CNN
	1    6350 2800
	0    -1   -1   0   
$EndComp
Wire Wire Line
	6450 2500 6350 2500
Connection ~ 6350 2500
Wire Wire Line
	9750 3350 9750 3500
Connection ~ 9750 3350
Wire Wire Line
	9750 3200 9750 3350
Wire Wire Line
	9550 3350 9550 3200
Connection ~ 9550 3350
Wire Wire Line
	9550 3500 9550 3350
$Comp
L project_power:+VHR #PWR?
U 1 1 61F33FCF
P 9550 3200
AR Path="/622F77ED/61F33FCF" Ref="#PWR?"  Part="1" 
AR Path="/622F77ED/61EFFE1E/61F33FCF" Ref="#PWR01016"  Part="1" 
AR Path="/622F77ED/61FD0F9D/61F33FCF" Ref="#PWR01116"  Part="1" 
F 0 "#PWR01116" H 9550 3050 50  0001 C CNN
F 1 "+VHR" H 9565 3373 50  0000 C CNN
F 2 "" H 9550 3200 50  0001 C CNN
F 3 "" H 9550 3200 50  0001 C CNN
	1    9550 3200
	1    0    0    -1  
$EndComp
Connection ~ 9550 3200
Text HLabel 4450 4250 0    50   Input ~ 0
SW
Wire Wire Line
	4450 4250 4600 4250
Wire Wire Line
	4450 5000 10200 5000
Text HLabel 4450 5000 0    50   Output ~ 0
CMP
Text HLabel 3400 2900 2    50   Input ~ 0
DAC
Wire Wire Line
	6550 4250 6950 4250
Text Label 6800 4250 2    50   ~ 0
+REF
Text HLabel 6350 4450 0    50   Input ~ 0
EREF
Wire Wire Line
	8050 4250 8900 4250
Text Label 8550 4250 2    50   ~ 0
-REF
Text Label 5300 4950 1    50   ~ 0
-REF
Text Label 5300 3550 3    50   ~ 0
+REF
Wire Wire Line
	5300 3750 5300 3550
Wire Wire Line
	5300 4950 5300 4750
$Comp
L Device:C_Small C?
U 1 1 61F33FBD
P 9650 3200
AR Path="/61F33FBD" Ref="C?"  Part="1" 
AR Path="/6169E126/61F33FBD" Ref="C?"  Part="1" 
AR Path="/619D5072/61F33FBD" Ref="C?"  Part="1" 
AR Path="/622F77ED/61EFFE1E/61F33FBD" Ref="C1013"  Part="1" 
AR Path="/622F77ED/61FD0F9D/61F33FBD" Ref="C1113"  Part="1" 
F 0 "C1113" V 9650 2950 50  0000 C CNN
F 1 "100n" V 9650 3550 50  0000 C CNN
F 2 "Capacitor_SMD:C_0805_2012Metric" H 9650 3200 50  0001 C CNN
F 3 "~" H 9650 3200 50  0001 C CNN
	1    9650 3200
	0    1    1    0   
$EndComp
$Comp
L Device:C_Small C?
U 1 1 61F33FB7
P 9650 3350
AR Path="/61F33FB7" Ref="C?"  Part="1" 
AR Path="/6169E126/61F33FB7" Ref="C?"  Part="1" 
AR Path="/619D5072/61F33FB7" Ref="C?"  Part="1" 
AR Path="/622F77ED/61EFFE1E/61F33FB7" Ref="C1014"  Part="1" 
AR Path="/622F77ED/61FD0F9D/61F33FB7" Ref="C1114"  Part="1" 
F 0 "C1114" V 9650 3100 50  0000 C CNN
F 1 "10n" V 9650 3700 50  0000 C CNN
F 2 "Capacitor_SMD:C_0805_2012Metric" H 9650 3350 50  0001 C CNN
F 3 "~" H 9650 3350 50  0001 C CNN
	1    9650 3350
	0    1    1    0   
$EndComp
$Comp
L Device:C_Small C?
U 1 1 61F33FC3
P 9650 3500
AR Path="/61F33FC3" Ref="C?"  Part="1" 
AR Path="/6169E126/61F33FC3" Ref="C?"  Part="1" 
AR Path="/619D5072/61F33FC3" Ref="C?"  Part="1" 
AR Path="/622F77ED/61F33FC3" Ref="C?"  Part="1" 
AR Path="/622F77ED/61EFFE1E/61F33FC3" Ref="C1015"  Part="1" 
AR Path="/622F77ED/61FD0F9D/61F33FC3" Ref="C1115"  Part="1" 
F 0 "C1115" V 9650 3250 50  0000 C CNN
F 1 "100p" V 9650 3850 50  0000 C CNN
F 2 "Capacitor_SMD:C_0805_2012Metric" H 9650 3500 50  0001 C CNN
F 3 "~" H 9650 3500 50  0001 C CNN
	1    9650 3500
	0    1    1    0   
$EndComp
Wire Wire Line
	10200 5000 10200 3900
Wire Wire Line
	9950 3900 10200 3900
NoConn ~ 9950 3700
Wire Wire Line
	9850 3400 9850 3350
Wire Wire Line
	9850 3350 9750 3350
Wire Wire Line
	9650 4100 9600 4100
$Comp
L project_power:-VHR #PWR?
U 1 1 6186FEFD
P 9600 4100
AR Path="/622F77ED/6186FEFD" Ref="#PWR?"  Part="1" 
AR Path="/622F77ED/61EFFE1E/6186FEFD" Ref="#PWR01019"  Part="1" 
AR Path="/622F77ED/61FD0F9D/6186FEFD" Ref="#PWR01119"  Part="1" 
F 0 "#PWR01119" H 9600 4200 50  0001 C CNN
F 1 "-VHR" H 9615 4273 50  0000 C CNN
F 2 "" H 9600 4100 50  0001 C CNN
F 3 "" H 9600 4100 50  0001 C CNN
	1    9600 4100
	-1   0    0    1   
$EndComp
Connection ~ 9600 4100
Wire Wire Line
	9600 4100 9550 4100
$Comp
L Device:R_Small R?
U 1 1 61870A29
P 8500 3700
AR Path="/61833839/61870A29" Ref="R?"  Part="1" 
AR Path="/622F77ED/61870A29" Ref="R?"  Part="1" 
AR Path="/622F77ED/61EFFE1E/61870A29" Ref="R1022"  Part="1" 
AR Path="/622F77ED/61FD0F9D/61870A29" Ref="R1122"  Part="1" 
F 0 "R1122" V 8304 3700 50  0000 C CNN
F 1 "100R" V 8395 3700 50  0000 C CNN
F 2 "Resistor_SMD:R_0805_2012Metric" H 8500 3700 50  0001 C CNN
F 3 "~" H 8500 3700 50  0001 C CNN
	1    8500 3700
	0    1    1    0   
$EndComp
Wire Wire Line
	8600 3700 8750 3700
$Comp
L Device:R_Small R?
U 1 1 618752CF
P 8750 3900
AR Path="/61833839/618752CF" Ref="R?"  Part="1" 
AR Path="/622F77ED/618752CF" Ref="R?"  Part="1" 
AR Path="/622F77ED/61EFFE1E/618752CF" Ref="R1023"  Part="1" 
AR Path="/622F77ED/61FD0F9D/618752CF" Ref="R1123"  Part="1" 
F 0 "R1123" H 8691 3854 50  0000 R CNN
F 1 "DNP" H 8691 3945 50  0000 R CNN
F 2 "Resistor_SMD:R_0805_2012Metric" H 8750 3900 50  0001 C CNN
F 3 "~" H 8750 3900 50  0001 C CNN
	1    8750 3900
	-1   0    0    1   
$EndComp
$Comp
L project_power:-VHR #PWR?
U 1 1 618760E5
P 8750 4000
AR Path="/622F77ED/618760E5" Ref="#PWR?"  Part="1" 
AR Path="/622F77ED/61EFFE1E/618760E5" Ref="#PWR01017"  Part="1" 
AR Path="/622F77ED/61FD0F9D/618760E5" Ref="#PWR01117"  Part="1" 
F 0 "#PWR01117" H 8750 4100 50  0001 C CNN
F 1 "-VHR" H 8765 4173 50  0000 C CNN
F 2 "" H 8750 4000 50  0001 C CNN
F 3 "" H 8750 4000 50  0001 C CNN
	1    8750 4000
	-1   0    0    1   
$EndComp
Wire Wire Line
	8750 3800 8750 3700
Connection ~ 8750 3700
Wire Wire Line
	8750 3700 9350 3700
Connection ~ 9750 3500
Connection ~ 9550 3500
$Comp
L Comparator:AD8561 U1103
U 1 1 6183437C
P 9650 3800
AR Path="/622F77ED/61FD0F9D/6183437C" Ref="U1103"  Part="1" 
AR Path="/622F77ED/61EFFE1E/6183437C" Ref="U1003"  Part="1" 
F 0 "U1103" H 9994 3846 50  0000 L CNN
F 1 "AD8561" H 9994 3755 50  0000 L CNN
F 2 "Package_SO:SOIC-8_3.9x4.9mm_P1.27mm" H 9650 3800 50  0001 C CNN
F 3 "https://www.analog.com/media/en/technical-documentation/data-sheets/ad8561.pdf" H 9650 3800 50  0001 C CNN
	1    9650 3800
	1    0    0    -1  
$EndComp
$Comp
L project_power:-VHR #PWR?
U 1 1 618B080A
P 9850 3400
AR Path="/622F77ED/618B080A" Ref="#PWR?"  Part="1" 
AR Path="/622F77ED/61EFFE1E/618B080A" Ref="#PWR01018"  Part="1" 
AR Path="/622F77ED/61FD0F9D/618B080A" Ref="#PWR01118"  Part="1" 
F 0 "#PWR01118" H 9850 3500 50  0001 C CNN
F 1 "-VHR" H 9865 3573 50  0000 C CNN
F 2 "" H 9850 3400 50  0001 C CNN
F 3 "" H 9850 3400 50  0001 C CNN
	1    9850 3400
	-1   0    0    1   
$EndComp
Wire Wire Line
	5200 3350 5400 3350
Wire Wire Line
	5900 3000 5900 2500
Wire Wire Line
	5900 2500 4600 2500
Connection ~ 5900 3000
Connection ~ 4600 2500
$Comp
L Connector:TestPoint TP?
U 1 1 61A642C3
P 6550 4250
AR Path="/61A642C3" Ref="TP?"  Part="1" 
AR Path="/622F77ED/61FD0F9D/61A642C3" Ref="TP1101"  Part="1" 
AR Path="/622F77ED/61EFFE1E/61A642C3" Ref="TP1001"  Part="1" 
F 0 "TP1101" V 6596 4437 50  0000 L CNN
F 1 "TestPoint" V 6505 4437 50  0000 L CNN
F 2 "TestPoint:TestPoint_Loop_D1.80mm_Drill1.0mm_Beaded" H 6750 4250 50  0001 C CNN
F 3 "https://cz.mouser.com/datasheet/2/215/000-5004-741320.pdf" H 6750 4250 50  0001 C CNN
	1    6550 4250
	0    -1   -1   0   
$EndComp
Connection ~ 6550 4250
$Comp
L Connector:TestPoint TP?
U 1 1 61A68E5E
P 8050 4500
AR Path="/61A68E5E" Ref="TP?"  Part="1" 
AR Path="/622F77ED/61FD0F9D/61A68E5E" Ref="TP1102"  Part="1" 
AR Path="/622F77ED/61EFFE1E/61A68E5E" Ref="TP1002"  Part="1" 
F 0 "TP1102" V 8096 4688 50  0000 L CNN
F 1 "TestPoint" V 8005 4688 50  0000 L CNN
F 2 "TestPoint:TestPoint_Loop_D1.80mm_Drill1.0mm_Beaded" H 8250 4500 50  0001 C CNN
F 3 "https://cz.mouser.com/datasheet/2/215/000-5004-741320.pdf" H 8250 4500 50  0001 C CNN
	1    8050 4500
	0    1    -1   0   
$EndComp
Connection ~ 8050 4500
$EndSCHEMATC
