M48
; DRILL file {KiCad 5.1.10-88a1d61d58~90~ubuntu21.04.1} date Tue Aug 17 00:35:55 2021
; FORMAT={-:-/ absolute / metric / decimal}
; #@! TF.CreationDate,2021-08-17T00:35:55+02:00
; #@! TF.GenerationSoftware,Kicad,Pcbnew,5.1.10-88a1d61d58~90~ubuntu21.04.1
; #@! TF.FileFunction,Plated,1,2,PTH
FMAT,2
METRIC
T1C0.400
T2C1.000
T3C1.016
%
G90
G05
T1
X69.698Y-106.045
X71.272Y-104.496
X71.577Y-111.608
X71.603Y-98.069
X72.339Y-103.861
X74.331Y-108.65
X75.387Y-111.43
X75.463Y-98.044
X75.717Y-107.925
X77.034Y-108.65
X77.038Y-101.498
X80.239Y-98.044
X80.239Y-112.065
X83.845Y-101.778
X83.845Y-106.655
X85.115Y-98.693
X85.325Y-107.978
X85.547Y-97.18
X85.623Y-112.395
X86.385Y-101.93
X87.122Y-105.461
X87.562Y-98.675
X88.265Y-97.587
X88.925Y-111.76
X89.691Y-106.163
T2
X64.059Y-113.97
X66.599Y-113.97
X95.682Y-93.65
X95.682Y-96.19
X95.682Y-98.73
X95.682Y-101.27
X95.682Y-103.81
X95.682Y-106.35
X95.682Y-108.89
X95.682Y-111.43
X95.682Y-113.97
X95.682Y-116.51
X98.222Y-93.65
X98.222Y-96.19
X98.222Y-98.73
X98.222Y-101.27
X98.222Y-103.81
X98.222Y-106.35
X98.222Y-108.89
X98.222Y-111.43
X98.222Y-113.97
X98.222Y-116.51
T3
X64.059Y-98.73
X64.059Y-101.27
X64.059Y-103.81
X64.059Y-106.35
X64.059Y-108.89
X64.059Y-111.43
X66.599Y-98.73
X66.599Y-101.27
X66.599Y-103.81
X66.599Y-106.35
X66.599Y-108.89
X66.599Y-111.43
T0
M30
