EESchema Schematic File Version 4
EELAYER 30 0
EELAYER END
$Descr A4 11693 8268
encoding utf-8
Sheet 13 16
Title "SumIntADC NX breadboard"
Date "2021-11-12"
Rev "1.0"
Comp "PiKRON"
Comment1 "Pavel Píša, Petr Porazil, Jakub Ladman"
Comment2 "Simple Low Resolution SumInt ADC with LVDS as Comparator"
Comment3 ""
Comment4 ""
$EndDescr
Wire Wire Line
	4650 4350 4400 4350
Wire Wire Line
	4650 4050 5050 4050
$Comp
L Connector_Generic:Conn_01x02 J?
U 1 1 616AF4D1
P 4200 4350
AR Path="/616AF4D1" Ref="J?"  Part="1" 
AR Path="/6169E126/616AF4D1" Ref="J1002"  Part="1" 
AR Path="/619D5072/616AF4D1" Ref="J1102"  Part="1" 
F 0 "J1102" H 4650 4250 50  0000 C CNN
F 1 "Conn_01x02" H 4500 4350 50  0000 C CNN
F 2 "Connector_PinHeader_2.54mm:PinHeader_1x02_P2.54mm_Vertical" H 4200 4350 50  0001 C CNN
F 3 "~" H 4200 4350 50  0001 C CNN
	1    4200 4350
	-1   0    0    -1  
$EndComp
Wire Wire Line
	4450 3850 4450 4150
Wire Wire Line
	4450 4150 4450 4450
Wire Wire Line
	4400 4150 4450 4150
Wire Wire Line
	4650 4350 4650 4300
Wire Wire Line
	4400 4450 4450 4450
Connection ~ 4650 4050
Wire Wire Line
	4400 4050 4650 4050
Connection ~ 4450 4150
$Comp
L Connector_Generic:Conn_01x02 J?
U 1 1 616AF4DF
P 4200 4050
AR Path="/616AF4DF" Ref="J?"  Part="1" 
AR Path="/6169E126/616AF4DF" Ref="J1001"  Part="1" 
AR Path="/619D5072/616AF4DF" Ref="J1101"  Part="1" 
F 0 "J1101" H 4650 3950 50  0000 C CNN
F 1 "Conn_01x02" H 4500 4050 50  0000 C CNN
F 2 "Connector_PinHeader_2.54mm:PinHeader_1x02_P2.54mm_Vertical" H 4200 4050 50  0001 C CNN
F 3 "~" H 4200 4050 50  0001 C CNN
	1    4200 4050
	-1   0    0    -1  
$EndComp
Wire Wire Line
	6100 4450 6100 4250
Connection ~ 6100 4450
Wire Wire Line
	6000 4450 6100 4450
Wire Wire Line
	5050 4450 4450 4450
Wire Wire Line
	4650 4100 4650 4050
$Comp
L Connector:Conn_Coaxial J?
U 1 1 616AF4EB
P 4650 3850
AR Path="/616AF4EB" Ref="J?"  Part="1" 
AR Path="/6169E126/616AF4EB" Ref="J1003"  Part="1" 
AR Path="/619D5072/616AF4EB" Ref="J1103"  Part="1" 
F 0 "J1103" V 4950 3800 50  0000 L CNN
F 1 "5-1814832-2" V 4850 3600 50  0000 L CNN
F 2 "Connector_Coaxial:SMA_Amphenol_132291_Vertical" H 4650 3850 50  0001 C CNN
F 3 "https://www.te.com/commerce/DocumentDelivery/DDEController?Action=showdoc&DocId=Customer+Drawing%7F1814832%7FC%7Fpdf%7FEnglish%7FENG_CD_1814832_C.pdf%7F5-1814832-2" H 4650 3850 50  0001 C CNN
	1    4650 3850
	0    1    -1   0   
$EndComp
Connection ~ 4450 4450
$Comp
L Device:R_Small R?
U 1 1 616AF4F8
P 5750 3650
AR Path="/616AF4F8" Ref="R?"  Part="1" 
AR Path="/6169E126/616AF4F8" Ref="R1006"  Part="1" 
AR Path="/619D5072/616AF4F8" Ref="R1106"  Part="1" 
F 0 "R1106" H 5750 3850 50  0000 L CNN
F 1 "100k" V 5850 3550 50  0000 L CNN
F 2 "Resistor_SMD:R_0805_2012Metric" H 5750 3650 50  0001 C CNN
F 3 "~" H 5750 3650 50  0001 C CNN
	1    5750 3650
	1    0    0    -1  
$EndComp
Connection ~ 6550 3950
Wire Wire Line
	6550 4350 6550 3950
Wire Wire Line
	6400 4350 6550 4350
Wire Wire Line
	5750 3350 5750 3550
Wire Wire Line
	5550 3550 5550 3350
Wire Wire Line
	5350 3000 7100 3000
Wire Wire Line
	5350 3550 5350 3000
Wire Wire Line
	6300 3500 6300 3650
Connection ~ 6300 3500
Wire Wire Line
	6300 3350 6300 3500
Wire Wire Line
	6100 3500 6100 3350
Connection ~ 6100 3500
Connection ~ 6100 3650
Wire Wire Line
	6100 3650 6100 3500
Wire Wire Line
	6500 3950 6550 3950
Wire Wire Line
	5350 4050 5250 4050
Connection ~ 5350 4050
Wire Wire Line
	5350 3750 5350 4050
Wire Wire Line
	5550 4050 5550 3750
Wire Wire Line
	5550 4050 5350 4050
Connection ~ 5550 4050
Wire Wire Line
	5550 4350 5550 4050
Wire Wire Line
	6200 4350 5550 4350
Wire Wire Line
	5900 4050 5550 4050
Connection ~ 5750 4450
Wire Wire Line
	5250 4450 5750 4450
Connection ~ 5750 3850
Wire Wire Line
	5750 4450 5800 4450
Wire Wire Line
	5750 3850 5750 4450
Wire Wire Line
	5750 3850 5900 3850
Wire Wire Line
	5750 3850 5750 3750
$Comp
L Device:C_Small C?
U 1 1 616AF540
P 6200 3500
AR Path="/616AF540" Ref="C?"  Part="1" 
AR Path="/6169E126/616AF540" Ref="C1003"  Part="1" 
AR Path="/619D5072/616AF540" Ref="C1103"  Part="1" 
F 0 "C1103" V 6200 3300 50  0000 C CNN
F 1 "10n" V 6200 3800 50  0000 C CNN
F 2 "Capacitor_SMD:C_0805_2012Metric" H 6200 3500 50  0001 C CNN
F 3 "~" H 6200 3500 50  0001 C CNN
	1    6200 3500
	0    1    1    0   
$EndComp
$Comp
L Device:C_Small C?
U 1 1 616AF546
P 6200 3350
AR Path="/616AF546" Ref="C?"  Part="1" 
AR Path="/6169E126/616AF546" Ref="C1002"  Part="1" 
AR Path="/619D5072/616AF546" Ref="C1102"  Part="1" 
F 0 "C1102" V 6200 3150 50  0000 C CNN
F 1 "100n" V 6200 3650 50  0000 C CNN
F 2 "Capacitor_SMD:C_0805_2012Metric" H 6200 3350 50  0001 C CNN
F 3 "~" H 6200 3350 50  0001 C CNN
	1    6200 3350
	0    1    1    0   
$EndComp
$Comp
L Device:C_Small C?
U 1 1 616AF54C
P 6200 3650
AR Path="/616AF54C" Ref="C?"  Part="1" 
AR Path="/6169E126/616AF54C" Ref="C1004"  Part="1" 
AR Path="/619D5072/616AF54C" Ref="C1104"  Part="1" 
F 0 "C1104" V 6200 3450 50  0000 C CNN
F 1 "220p" V 6200 3950 50  0000 C CNN
F 2 "Capacitor_SMD:C_0805_2012Metric" H 6200 3650 50  0001 C CNN
F 3 "~" H 6200 3650 50  0001 C CNN
	1    6200 3650
	0    1    1    0   
$EndComp
$Comp
L Device:C_Small C?
U 1 1 616AF552
P 5900 4450
AR Path="/616AF552" Ref="C?"  Part="1" 
AR Path="/6169E126/616AF552" Ref="C1001"  Part="1" 
AR Path="/619D5072/616AF552" Ref="C1101"  Part="1" 
F 0 "C1101" V 5671 4450 50  0000 C CNN
F 1 "220p" V 5762 4450 50  0000 C CNN
F 2 "Capacitor_SMD:C_0805_2012Metric" H 5900 4450 50  0001 C CNN
F 3 "~" H 5900 4450 50  0001 C CNN
	1    5900 4450
	0    1    1    0   
$EndComp
$Comp
L Device:C_Small C?
U 1 1 616AF558
P 6300 4350
AR Path="/616AF558" Ref="C?"  Part="1" 
AR Path="/6169E126/616AF558" Ref="C1005"  Part="1" 
AR Path="/619D5072/616AF558" Ref="C1105"  Part="1" 
F 0 "C1105" V 6071 4350 50  0000 C CNN
F 1 "220p" V 6162 4350 50  0000 C CNN
F 2 "Capacitor_SMD:C_0805_2012Metric" H 6300 4350 50  0001 C CNN
F 3 "~" H 6300 4350 50  0001 C CNN
	1    6300 4350
	0    1    1    0   
$EndComp
$Comp
L Device:R_Small R?
U 1 1 616AF57C
P 5150 4450
AR Path="/616AF57C" Ref="R?"  Part="1" 
AR Path="/6169E126/616AF57C" Ref="R1003"  Part="1" 
AR Path="/619D5072/616AF57C" Ref="R1103"  Part="1" 
F 0 "R1103" V 4954 4450 50  0000 C CNN
F 1 "33k" V 5045 4450 50  0000 C CNN
F 2 "Resistor_SMD:R_0805_2012Metric" H 5150 4450 50  0001 C CNN
F 3 "~" H 5150 4450 50  0001 C CNN
	1    5150 4450
	0    1    1    0   
$EndComp
$Comp
L Device:R_Small R?
U 1 1 616AF582
P 4650 4200
AR Path="/616AF582" Ref="R?"  Part="1" 
AR Path="/6169E126/616AF582" Ref="R1001"  Part="1" 
AR Path="/619D5072/616AF582" Ref="R1101"  Part="1" 
F 0 "R1101" H 4400 4150 50  0000 L CNN
F 1 "49R9" H 4400 4250 50  0000 L CNN
F 2 "Resistor_SMD:R_0805_2012Metric" H 4650 4200 50  0001 C CNN
F 3 "~" H 4650 4200 50  0001 C CNN
	1    4650 4200
	-1   0    0    1   
$EndComp
$Comp
L Device:R_Small R?
U 1 1 616AF588
P 5150 4050
AR Path="/616AF588" Ref="R?"  Part="1" 
AR Path="/6169E126/616AF588" Ref="R1002"  Part="1" 
AR Path="/619D5072/616AF588" Ref="R1102"  Part="1" 
F 0 "R1102" V 4954 4050 50  0000 C CNN
F 1 "33k" V 5045 4050 50  0000 C CNN
F 2 "Resistor_SMD:R_0805_2012Metric" H 5150 4050 50  0001 C CNN
F 3 "~" H 5150 4050 50  0001 C CNN
	1    5150 4050
	0    1    1    0   
$EndComp
$Comp
L Device:R_Small R?
U 1 1 616AF58E
P 5350 3650
AR Path="/616AF58E" Ref="R?"  Part="1" 
AR Path="/6169E126/616AF58E" Ref="R1004"  Part="1" 
AR Path="/619D5072/616AF58E" Ref="R1104"  Part="1" 
F 0 "R1104" H 5350 3800 50  0000 L CNN
F 1 "18k" V 5450 3550 50  0000 L CNN
F 2 "Resistor_SMD:R_0805_2012Metric" H 5350 3650 50  0001 C CNN
F 3 "~" H 5350 3650 50  0001 C CNN
	1    5350 3650
	1    0    0    -1  
$EndComp
$Comp
L Device:R_Small R?
U 1 1 616AF594
P 5550 3650
AR Path="/616AF594" Ref="R?"  Part="1" 
AR Path="/6169E126/616AF594" Ref="R1005"  Part="1" 
AR Path="/619D5072/616AF594" Ref="R1105"  Part="1" 
F 0 "R1105" H 5550 3800 50  0000 L CNN
F 1 "100k" V 5650 3550 50  0000 L CNN
F 2 "Resistor_SMD:R_0805_2012Metric" H 5550 3650 50  0001 C CNN
F 3 "~" H 5550 3650 50  0001 C CNN
	1    5550 3650
	1    0    0    -1  
$EndComp
$Comp
L Amplifier_Operational:MCP6001-OT U?
U 1 1 616AF59A
P 6200 3950
AR Path="/616AF59A" Ref="U?"  Part="1" 
AR Path="/6169E126/616AF59A" Ref="U1001"  Part="1" 
AR Path="/619D5072/616AF59A" Ref="U1101"  Part="1" 
F 0 "U1101" H 5850 3950 50  0000 L CNN
F 1 "ADA4084-1ARJZ-R2" H 5800 2900 50  0000 L CNN
F 2 "Package_TO_SOT_SMD:SOT-23-5" H 6100 3750 50  0001 L CNN
F 3 "http://ww1.microchip.com/downloads/en/DeviceDoc/20001685E.pdf" H 6200 4150 50  0001 C CNN
	1    6200 3950
	1    0    0    -1  
$EndComp
Wire Wire Line
	5550 3350 5650 3350
Wire Wire Line
	5650 3350 5650 3100
Wire Wire Line
	5650 3100 7100 3100
Connection ~ 5650 3350
Wire Wire Line
	5650 3350 5750 3350
Text HLabel 7100 3100 2    50   Input ~ 0
REF
Text HLabel 7100 3000 2    50   Input ~ 0
SW
Text HLabel 7100 4250 2    50   Output ~ 0
OUT
Wire Wire Line
	4450 4450 4450 4550
Wire Wire Line
	6100 4450 6100 4550
$Comp
L power:GND #PWR01103
U 1 1 61891D33
P 6100 4550
AR Path="/619D5072/61891D33" Ref="#PWR01103"  Part="1" 
AR Path="/6169E126/61891D33" Ref="#PWR01003"  Part="1" 
F 0 "#PWR01103" H 6100 4300 50  0001 C CNN
F 1 "GND" H 6105 4377 50  0000 C CNN
F 2 "" H 6100 4550 50  0001 C CNN
F 3 "" H 6100 4550 50  0001 C CNN
	1    6100 4550
	1    0    0    -1  
$EndComp
$Comp
L power:GND #PWR01101
U 1 1 618920E7
P 4450 4550
AR Path="/619D5072/618920E7" Ref="#PWR01101"  Part="1" 
AR Path="/6169E126/618920E7" Ref="#PWR01001"  Part="1" 
F 0 "#PWR01101" H 4450 4300 50  0001 C CNN
F 1 "GND" H 4455 4377 50  0000 C CNN
F 2 "" H 4450 4550 50  0001 C CNN
F 3 "" H 4450 4550 50  0001 C CNN
	1    4450 4550
	1    0    0    -1  
$EndComp
$Comp
L power:GND #PWR01104
U 1 1 61892480
P 6300 3650
AR Path="/619D5072/61892480" Ref="#PWR01104"  Part="1" 
AR Path="/6169E126/61892480" Ref="#PWR01004"  Part="1" 
F 0 "#PWR01104" H 6300 3400 50  0001 C CNN
F 1 "GND" H 6305 3477 50  0000 C CNN
F 2 "" H 6300 3650 50  0001 C CNN
F 3 "" H 6300 3650 50  0001 C CNN
	1    6300 3650
	1    0    0    -1  
$EndComp
Connection ~ 6300 3650
$Comp
L power:+5V #PWR01102
U 1 1 61893A11
P 6100 3350
AR Path="/619D5072/61893A11" Ref="#PWR01102"  Part="1" 
AR Path="/6169E126/61893A11" Ref="#PWR01002"  Part="1" 
F 0 "#PWR01102" H 6100 3200 50  0001 C CNN
F 1 "+5V" H 6115 3523 50  0000 C CNN
F 2 "" H 6100 3350 50  0001 C CNN
F 3 "" H 6100 3350 50  0001 C CNN
	1    6100 3350
	1    0    0    -1  
$EndComp
Connection ~ 6100 3350
$Comp
L Device:R_Small R?
U 1 1 618998D3
P 6900 4100
AR Path="/618998D3" Ref="R?"  Part="1" 
AR Path="/617B514C/618998D3" Ref="R?"  Part="1" 
AR Path="/619065BF/618998D3" Ref="R?"  Part="1" 
AR Path="/61908BA4/618998D3" Ref="R?"  Part="1" 
AR Path="/6192AB24/618998D3" Ref="R?"  Part="1" 
AR Path="/619332FF/618998D3" Ref="R?"  Part="1" 
AR Path="/619B691C/618998D3" Ref="R?"  Part="1" 
AR Path="/619BF925/618998D3" Ref="R?"  Part="1" 
AR Path="/619C8940/618998D3" Ref="R?"  Part="1" 
AR Path="/6169E126/618998D3" Ref="R1007"  Part="1" 
AR Path="/619D5072/618998D3" Ref="R1107"  Part="1" 
F 0 "R1107" H 6959 4146 50  0000 L CNN
F 1 "1k" H 6959 4055 50  0000 L CNN
F 2 "Resistor_SMD:R_0805_2012Metric" H 6900 4100 50  0001 C CNN
F 3 "~" H 6900 4100 50  0001 C CNN
	1    6900 4100
	-1   0    0    1   
$EndComp
$Comp
L Device:R_Small R?
U 1 1 618998D9
P 6900 4400
AR Path="/618998D9" Ref="R?"  Part="1" 
AR Path="/617B514C/618998D9" Ref="R?"  Part="1" 
AR Path="/619065BF/618998D9" Ref="R?"  Part="1" 
AR Path="/61908BA4/618998D9" Ref="R?"  Part="1" 
AR Path="/6192AB24/618998D9" Ref="R?"  Part="1" 
AR Path="/619332FF/618998D9" Ref="R?"  Part="1" 
AR Path="/619B691C/618998D9" Ref="R?"  Part="1" 
AR Path="/619BF925/618998D9" Ref="R?"  Part="1" 
AR Path="/619C8940/618998D9" Ref="R?"  Part="1" 
AR Path="/6169E126/618998D9" Ref="R1008"  Part="1" 
AR Path="/619D5072/618998D9" Ref="R1108"  Part="1" 
F 0 "R1108" H 6959 4446 50  0000 L CNN
F 1 "1k" H 6959 4355 50  0000 L CNN
F 2 "Resistor_SMD:R_0805_2012Metric" H 6900 4400 50  0001 C CNN
F 3 "~" H 6900 4400 50  0001 C CNN
	1    6900 4400
	-1   0    0    1   
$EndComp
Wire Wire Line
	6900 4250 7100 4250
Wire Wire Line
	6900 4500 6900 4550
$Comp
L power:GND #PWR?
U 1 1 618998E3
P 6900 4550
AR Path="/619C8940/618998E3" Ref="#PWR?"  Part="1" 
AR Path="/6169E126/618998E3" Ref="#PWR01005"  Part="1" 
AR Path="/619D5072/618998E3" Ref="#PWR01105"  Part="1" 
F 0 "#PWR01105" H 6900 4300 50  0001 C CNN
F 1 "GND" H 6905 4377 50  0000 C CNN
F 2 "" H 6900 4550 50  0001 C CNN
F 3 "" H 6900 4550 50  0001 C CNN
	1    6900 4550
	1    0    0    -1  
$EndComp
Wire Wire Line
	6550 3950 6900 3950
Wire Wire Line
	6900 3950 6900 4000
Wire Wire Line
	6900 4200 6900 4250
Connection ~ 6900 4250
Wire Wire Line
	6900 4250 6900 4300
$EndSCHEMATC
