EESchema Schematic File Version 4
EELAYER 30 0
EELAYER END
$Descr A4 11693 8268
encoding utf-8
Sheet 7 16
Title "SumIntADC NX breadboard"
Date "2021-11-12"
Rev "1.0"
Comp "PiKRON"
Comment1 "Pavel Píša, Petr Porazil, Jakub Ladman"
Comment2 "Motor Control with SumInt ADC Current Sensing - Single Half-bridge Switch"
Comment3 ""
Comment4 ""
$EndDescr
$Comp
L ics:IFX007TAUMA1 IC?
U 1 1 6158FE43
P 7650 3750
AR Path="/614102B7/6158FE43" Ref="IC?"  Part="1" 
AR Path="/614102B7/6158E0F0/6158FE43" Ref="IC401"  Part="1" 
AR Path="/614102B7/61665CD2/6158FE43" Ref="IC?"  Part="1" 
AR Path="/614102B7/616662E9/6158FE43" Ref="IC?"  Part="1" 
AR Path="/614102B7/616662F1/6158FE43" Ref="IC?"  Part="1" 
AR Path="/614102B7/61A702A7/6158FE43" Ref="IC501"  Part="1" 
AR Path="/614102B7/61A71E43/6158FE43" Ref="IC601"  Part="1" 
AR Path="/614102B7/61A73D1E/6158FE43" Ref="IC701"  Part="1" 
F 0 "IC701" V 8296 3022 50  0000 R CNN
F 1 "IFX007TAUMA1" V 8205 3022 50  0000 R CNN
F 2 "Package_TO_SOT_SMD:TO-263-7_TabPin8" H 8700 3850 50  0001 L CNN
F 3 "https://www.infineon.com/dgdl/Infineon-IFX007T-DS-v01_00-EN.pdf?fileId=5546d46265f064ff0166433484070b75" H 8700 3750 50  0001 L CNN
F 4 "Gate Drivers" H 8700 3650 50  0001 L CNN "Description"
F 5 "" H 8700 3550 50  0001 L CNN "Height"
F 6 "726-IFX007TAUMA1" H 8700 3450 50  0001 L CNN "Mouser Part Number"
F 7 "https://www.mouser.co.uk/ProductDetail/Infineon-Technologies/IFX007TAUMA1?qs=qSfuJ%252Bfl%2Fd7ZcDPqNlCgmA%3D%3D" H 8700 3350 50  0001 L CNN "Mouser Price/Stock"
F 8 "Infineon" H 8700 3250 50  0001 L CNN "Manufacturer_Name"
F 9 "IFX007TAUMA1" H 8700 3150 50  0001 L CNN "Manufacturer_Part_Number"
	1    7650 3750
	0    -1   -1   0   
$EndComp
Text HLabel 7950 2300 1    50   Output ~ 0
OUT
Wire Wire Line
	7950 2300 7950 2450
Wire Wire Line
	7950 2450 7850 2450
Wire Wire Line
	7850 2450 7850 2550
Wire Wire Line
	8050 2550 8050 2450
Wire Wire Line
	8050 2450 7950 2450
Connection ~ 7950 2450
$Comp
L Device:R_Small R?
U 1 1 615EF8B7
P 8050 4000
AR Path="/615EF8B7" Ref="R?"  Part="1" 
AR Path="/614102B7/6158E0F0/615EF8B7" Ref="R408"  Part="1" 
AR Path="/614102B7/61665CD2/615EF8B7" Ref="R?"  Part="1" 
AR Path="/614102B7/616662E9/615EF8B7" Ref="R?"  Part="1" 
AR Path="/614102B7/616662F1/615EF8B7" Ref="R?"  Part="1" 
AR Path="/614102B7/61A702A7/615EF8B7" Ref="R508"  Part="1" 
AR Path="/614102B7/61A71E43/615EF8B7" Ref="R608"  Part="1" 
AR Path="/614102B7/61A73D1E/615EF8B7" Ref="R708"  Part="1" 
F 0 "R708" H 7950 3500 50  0000 L CNN
F 1 "330R" H 7950 3400 50  0000 L CNN
F 2 "Resistor_SMD:R_0805_2012Metric" H 8050 4000 50  0001 C CNN
F 3 "~" H 8050 4000 50  0001 C CNN
	1    8050 4000
	1    0    0    -1  
$EndComp
$Comp
L Device:R_Small R?
U 1 1 61607494
P 7650 4000
AR Path="/61607494" Ref="R?"  Part="1" 
AR Path="/614102B7/6158E0F0/61607494" Ref="R407"  Part="1" 
AR Path="/614102B7/61665CD2/61607494" Ref="R?"  Part="1" 
AR Path="/614102B7/616662E9/61607494" Ref="R?"  Part="1" 
AR Path="/614102B7/616662F1/61607494" Ref="R?"  Part="1" 
AR Path="/614102B7/61A702A7/61607494" Ref="R507"  Part="1" 
AR Path="/614102B7/61A71E43/61607494" Ref="R607"  Part="1" 
AR Path="/614102B7/61A73D1E/61607494" Ref="R707"  Part="1" 
F 0 "R707" H 7850 3950 50  0000 C CNN
F 1 "15m" H 7850 4050 50  0000 C CNN
F 2 "Resistor_SMD:R_0805_2012Metric" H 7650 4000 50  0001 C CNN
F 3 "https://www.farnell.com/datasheets/2167177.pdf" H 7650 4000 50  0001 C CNN
F 4 "RL0805FR-7W0R015L" H 7650 4000 50  0001 C CNN "PN"
	1    7650 4000
	-1   0    0    1   
$EndComp
Wire Wire Line
	7650 3750 7650 3800
Connection ~ 7650 3800
Wire Wire Line
	7650 3800 7650 3900
Text HLabel 3600 3500 0    50   Input ~ 0
PWM_A
Text HLabel 3600 3600 0    50   Input ~ 0
PWM_B
$Comp
L Device:C_Small C?
U 1 1 6162D5F8
P 7950 4000
AR Path="/6162D5F8" Ref="C?"  Part="1" 
AR Path="/614102B7/6158E0F0/6162D5F8" Ref="C408"  Part="1" 
AR Path="/614102B7/61665CD2/6162D5F8" Ref="C?"  Part="1" 
AR Path="/614102B7/616662E9/6162D5F8" Ref="C?"  Part="1" 
AR Path="/614102B7/616662F1/6162D5F8" Ref="C?"  Part="1" 
AR Path="/614102B7/61A702A7/6162D5F8" Ref="C508"  Part="1" 
AR Path="/614102B7/61A71E43/6162D5F8" Ref="C608"  Part="1" 
AR Path="/614102B7/61A73D1E/6162D5F8" Ref="C708"  Part="1" 
F 0 "C708" H 7900 4300 50  0000 L CNN
F 1 "100n" H 7800 4400 50  0000 L CNN
F 2 "Capacitor_SMD:C_0805_2012Metric" H 7950 4000 50  0001 C CNN
F 3 "~" H 7950 4000 50  0001 C CNN
	1    7950 4000
	-1   0    0    1   
$EndComp
Wire Wire Line
	8050 3750 8050 3850
Wire Wire Line
	7950 3900 7950 3850
Wire Wire Line
	7950 3850 8050 3850
Connection ~ 8050 3850
Wire Wire Line
	8050 3850 8050 3900
Wire Wire Line
	7950 4100 7950 4200
Wire Wire Line
	8050 4200 8050 4100
Wire Wire Line
	8250 3900 8250 3850
Wire Wire Line
	8250 3850 8150 3850
Connection ~ 8150 3850
Wire Wire Line
	8150 3850 8150 3900
Wire Wire Line
	8250 4100 8250 4200
Wire Wire Line
	8150 4200 8150 4100
$Comp
L Device:C_Small C?
U 1 1 61644E63
P 8400 4000
AR Path="/61644E63" Ref="C?"  Part="1" 
AR Path="/614102B7/6158E0F0/61644E63" Ref="C410"  Part="1" 
AR Path="/614102B7/61665CD2/61644E63" Ref="C?"  Part="1" 
AR Path="/614102B7/616662E9/61644E63" Ref="C?"  Part="1" 
AR Path="/614102B7/616662F1/61644E63" Ref="C?"  Part="1" 
AR Path="/614102B7/61A702A7/61644E63" Ref="C510"  Part="1" 
AR Path="/614102B7/61A71E43/61644E63" Ref="C610"  Part="1" 
AR Path="/614102B7/61A73D1E/61644E63" Ref="C710"  Part="1" 
F 0 "C710" H 8400 4300 50  0000 C CNN
F 1 "100n" H 8350 4400 50  0000 C CNN
F 2 "Capacitor_SMD:C_0805_2012Metric" H 8400 4000 50  0001 C CNN
F 3 "~" H 8400 4000 50  0001 C CNN
	1    8400 4000
	-1   0    0    1   
$EndComp
$Comp
L Device:R_Small R?
U 1 1 616345CD
P 8150 4000
AR Path="/616345CD" Ref="R?"  Part="1" 
AR Path="/614102B7/6158E0F0/616345CD" Ref="R409"  Part="1" 
AR Path="/614102B7/61665CD2/616345CD" Ref="R?"  Part="1" 
AR Path="/614102B7/616662E9/616345CD" Ref="R?"  Part="1" 
AR Path="/614102B7/616662F1/616345CD" Ref="R?"  Part="1" 
AR Path="/614102B7/61A702A7/616345CD" Ref="R509"  Part="1" 
AR Path="/614102B7/61A71E43/616345CD" Ref="R609"  Part="1" 
AR Path="/614102B7/61A73D1E/616345CD" Ref="R709"  Part="1" 
F 0 "R709" H 8100 3700 50  0000 L CNN
F 1 "1k" H 8100 3600 50  0000 L CNN
F 2 "Resistor_SMD:R_0805_2012Metric" H 8150 4000 50  0001 C CNN
F 3 "~" H 8150 4000 50  0001 C CNN
	1    8150 4000
	-1   0    0    -1  
$EndComp
$Comp
L Device:C_Small C?
U 1 1 616346F1
P 8250 4000
AR Path="/616346F1" Ref="C?"  Part="1" 
AR Path="/614102B7/6158E0F0/616346F1" Ref="C409"  Part="1" 
AR Path="/614102B7/61665CD2/616346F1" Ref="C?"  Part="1" 
AR Path="/614102B7/616662E9/616346F1" Ref="C?"  Part="1" 
AR Path="/614102B7/616662F1/616346F1" Ref="C?"  Part="1" 
AR Path="/614102B7/61A702A7/616346F1" Ref="C509"  Part="1" 
AR Path="/614102B7/61A71E43/616346F1" Ref="C609"  Part="1" 
AR Path="/614102B7/61A73D1E/616346F1" Ref="C709"  Part="1" 
F 0 "C709" H 8250 4500 50  0000 L CNN
F 1 "1n" H 8250 4600 50  0000 L CNN
F 2 "Capacitor_SMD:C_0805_2012Metric" H 8250 4000 50  0001 C CNN
F 3 "~" H 8250 4000 50  0001 C CNN
	1    8250 4000
	1    0    0    1   
$EndComp
Text Notes 8200 2600 0    50   ~ 10
5A max
Wire Wire Line
	6000 4200 6000 4000
Wire Wire Line
	6100 4200 6000 4200
Wire Wire Line
	7050 4200 7650 4200
$Comp
L Device:R_Small R?
U 1 1 622E2BE4
P 6350 3400
AR Path="/622E2BE4" Ref="R?"  Part="1" 
AR Path="/614102B7/6158E0F0/622E2BE4" Ref="R402"  Part="1" 
AR Path="/614102B7/61665CD2/622E2BE4" Ref="R?"  Part="1" 
AR Path="/614102B7/616662E9/622E2BE4" Ref="R?"  Part="1" 
AR Path="/614102B7/616662F1/622E2BE4" Ref="R?"  Part="1" 
AR Path="/614102B7/61A702A7/622E2BE4" Ref="R502"  Part="1" 
AR Path="/614102B7/61A71E43/622E2BE4" Ref="R602"  Part="1" 
AR Path="/614102B7/61A73D1E/622E2BE4" Ref="R702"  Part="1" 
F 0 "R702" H 6400 3550 50  0000 L CNN
F 1 "100k" V 6450 3300 50  0000 L CNN
F 2 "Resistor_SMD:R_0805_2012Metric" H 6350 3400 50  0001 C CNN
F 3 "~" H 6350 3400 50  0001 C CNN
	1    6350 3400
	-1   0    0    -1  
$EndComp
Wire Wire Line
	5550 3700 5450 3700
Connection ~ 5550 3700
Wire Wire Line
	5550 4100 5550 3700
Wire Wire Line
	5700 4100 5550 4100
Wire Wire Line
	6350 3100 6350 3300
Wire Wire Line
	6550 3300 6550 3100
Wire Wire Line
	6750 2800 5150 2800
Wire Wire Line
	6750 3300 6750 2800
Wire Wire Line
	5800 3250 5800 3400
Connection ~ 5800 3250
Wire Wire Line
	5800 3100 5800 3250
Wire Wire Line
	6000 3250 6000 3100
Connection ~ 6000 3250
Connection ~ 6000 3400
Wire Wire Line
	6000 3400 6000 3250
Wire Wire Line
	5250 3700 4650 3700
Wire Wire Line
	5600 3700 5550 3700
Wire Wire Line
	6750 3800 6850 3800
Connection ~ 6750 3800
Wire Wire Line
	6750 3500 6750 3800
Wire Wire Line
	6550 3800 6550 3500
Wire Wire Line
	6550 3800 6750 3800
Connection ~ 6550 3800
Wire Wire Line
	6550 4100 6550 3800
Wire Wire Line
	5900 4100 6550 4100
Wire Wire Line
	6200 3800 6550 3800
Connection ~ 6350 4200
Wire Wire Line
	6850 4200 6350 4200
Connection ~ 6350 3600
Wire Wire Line
	6350 4200 6300 4200
Wire Wire Line
	6350 3600 6350 4200
Wire Wire Line
	6350 3600 6200 3600
Wire Wire Line
	6350 3600 6350 3500
$Comp
L Device:C_Small C?
U 1 1 622E2C2C
P 5900 3250
AR Path="/622E2C2C" Ref="C?"  Part="1" 
AR Path="/614102B7/6158E0F0/622E2C2C" Ref="C405"  Part="1" 
AR Path="/614102B7/61665CD2/622E2C2C" Ref="C?"  Part="1" 
AR Path="/614102B7/616662E9/622E2C2C" Ref="C?"  Part="1" 
AR Path="/614102B7/616662F1/622E2C2C" Ref="C?"  Part="1" 
AR Path="/614102B7/61A702A7/622E2C2C" Ref="C505"  Part="1" 
AR Path="/614102B7/61A71E43/622E2C2C" Ref="C605"  Part="1" 
AR Path="/614102B7/61A73D1E/622E2C2C" Ref="C705"  Part="1" 
F 0 "C705" V 5900 3050 50  0000 C CNN
F 1 "10n" V 5900 3550 50  0000 C CNN
F 2 "Capacitor_SMD:C_0805_2012Metric" H 5900 3250 50  0001 C CNN
F 3 "~" H 5900 3250 50  0001 C CNN
	1    5900 3250
	0    -1   1    0   
$EndComp
$Comp
L Device:C_Small C?
U 1 1 622E2C32
P 5900 3100
AR Path="/622E2C32" Ref="C?"  Part="1" 
AR Path="/614102B7/6158E0F0/622E2C32" Ref="C404"  Part="1" 
AR Path="/614102B7/61665CD2/622E2C32" Ref="C?"  Part="1" 
AR Path="/614102B7/616662E9/622E2C32" Ref="C?"  Part="1" 
AR Path="/614102B7/616662F1/622E2C32" Ref="C?"  Part="1" 
AR Path="/614102B7/61A702A7/622E2C32" Ref="C504"  Part="1" 
AR Path="/614102B7/61A71E43/622E2C32" Ref="C604"  Part="1" 
AR Path="/614102B7/61A73D1E/622E2C32" Ref="C704"  Part="1" 
F 0 "C704" V 5900 2900 50  0000 C CNN
F 1 "100n" V 5900 3400 50  0000 C CNN
F 2 "Capacitor_SMD:C_0805_2012Metric" H 5900 3100 50  0001 C CNN
F 3 "~" H 5900 3100 50  0001 C CNN
	1    5900 3100
	0    -1   1    0   
$EndComp
$Comp
L Device:C_Small C?
U 1 1 622E2C38
P 5900 3400
AR Path="/622E2C38" Ref="C?"  Part="1" 
AR Path="/614102B7/6158E0F0/622E2C38" Ref="C406"  Part="1" 
AR Path="/614102B7/61665CD2/622E2C38" Ref="C?"  Part="1" 
AR Path="/614102B7/616662E9/622E2C38" Ref="C?"  Part="1" 
AR Path="/614102B7/616662F1/622E2C38" Ref="C?"  Part="1" 
AR Path="/614102B7/61A702A7/622E2C38" Ref="C506"  Part="1" 
AR Path="/614102B7/61A71E43/622E2C38" Ref="C606"  Part="1" 
AR Path="/614102B7/61A73D1E/622E2C38" Ref="C706"  Part="1" 
F 0 "C706" V 5900 3200 50  0000 C CNN
F 1 "220p" V 5900 3700 50  0000 C CNN
F 2 "Capacitor_SMD:C_0805_2012Metric" H 5900 3400 50  0001 C CNN
F 3 "~" H 5900 3400 50  0001 C CNN
	1    5900 3400
	0    -1   1    0   
$EndComp
$Comp
L Device:C_Small C?
U 1 1 622E2C3E
P 6200 4200
AR Path="/622E2C3E" Ref="C?"  Part="1" 
AR Path="/614102B7/6158E0F0/622E2C3E" Ref="C407"  Part="1" 
AR Path="/614102B7/61665CD2/622E2C3E" Ref="C?"  Part="1" 
AR Path="/614102B7/616662E9/622E2C3E" Ref="C?"  Part="1" 
AR Path="/614102B7/616662F1/622E2C3E" Ref="C?"  Part="1" 
AR Path="/614102B7/61A702A7/622E2C3E" Ref="C507"  Part="1" 
AR Path="/614102B7/61A71E43/622E2C3E" Ref="C607"  Part="1" 
AR Path="/614102B7/61A73D1E/622E2C3E" Ref="C707"  Part="1" 
F 0 "C707" V 5971 4200 50  0000 C CNN
F 1 "220p" V 6062 4200 50  0000 C CNN
F 2 "Capacitor_SMD:C_0805_2012Metric" H 6200 4200 50  0001 C CNN
F 3 "~" H 6200 4200 50  0001 C CNN
	1    6200 4200
	0    -1   1    0   
$EndComp
$Comp
L Device:C_Small C?
U 1 1 622E2C44
P 5800 4100
AR Path="/622E2C44" Ref="C?"  Part="1" 
AR Path="/614102B7/6158E0F0/622E2C44" Ref="C403"  Part="1" 
AR Path="/614102B7/61665CD2/622E2C44" Ref="C?"  Part="1" 
AR Path="/614102B7/616662E9/622E2C44" Ref="C?"  Part="1" 
AR Path="/614102B7/616662F1/622E2C44" Ref="C?"  Part="1" 
AR Path="/614102B7/61A702A7/622E2C44" Ref="C503"  Part="1" 
AR Path="/614102B7/61A71E43/622E2C44" Ref="C603"  Part="1" 
AR Path="/614102B7/61A73D1E/622E2C44" Ref="C703"  Part="1" 
F 0 "C703" V 5571 4100 50  0000 C CNN
F 1 "220p" V 5662 4100 50  0000 C CNN
F 2 "Capacitor_SMD:C_0805_2012Metric" H 5800 4100 50  0001 C CNN
F 3 "~" H 5800 4100 50  0001 C CNN
	1    5800 4100
	0    -1   1    0   
$EndComp
$Comp
L Device:R_Small R?
U 1 1 622E2C62
P 5350 3700
AR Path="/622E2C62" Ref="R?"  Part="1" 
AR Path="/614102B7/6158E0F0/622E2C62" Ref="R401"  Part="1" 
AR Path="/614102B7/61665CD2/622E2C62" Ref="R?"  Part="1" 
AR Path="/614102B7/616662E9/622E2C62" Ref="R?"  Part="1" 
AR Path="/614102B7/616662F1/622E2C62" Ref="R?"  Part="1" 
AR Path="/614102B7/61A702A7/622E2C62" Ref="R501"  Part="1" 
AR Path="/614102B7/61A71E43/622E2C62" Ref="R601"  Part="1" 
AR Path="/614102B7/61A73D1E/622E2C62" Ref="R701"  Part="1" 
F 0 "R701" V 5154 3700 50  0000 C CNN
F 1 "49R9" V 5245 3700 50  0000 C CNN
F 2 "Resistor_SMD:R_0805_2012Metric" H 5350 3700 50  0001 C CNN
F 3 "~" H 5350 3700 50  0001 C CNN
	1    5350 3700
	0    -1   1    0   
$EndComp
$Comp
L Device:R_Small R?
U 1 1 622E2C68
P 6950 4200
AR Path="/622E2C68" Ref="R?"  Part="1" 
AR Path="/614102B7/6158E0F0/622E2C68" Ref="R406"  Part="1" 
AR Path="/614102B7/61665CD2/622E2C68" Ref="R?"  Part="1" 
AR Path="/614102B7/616662E9/622E2C68" Ref="R?"  Part="1" 
AR Path="/614102B7/616662F1/622E2C68" Ref="R?"  Part="1" 
AR Path="/614102B7/61A702A7/622E2C68" Ref="R506"  Part="1" 
AR Path="/614102B7/61A71E43/622E2C68" Ref="R606"  Part="1" 
AR Path="/614102B7/61A73D1E/622E2C68" Ref="R706"  Part="1" 
F 0 "R706" V 6754 4200 50  0000 C CNN
F 1 "33k" V 6845 4200 50  0000 C CNN
F 2 "Resistor_SMD:R_0805_2012Metric" H 6950 4200 50  0001 C CNN
F 3 "~" H 6950 4200 50  0001 C CNN
	1    6950 4200
	0    -1   1    0   
$EndComp
$Comp
L Device:R_Small R?
U 1 1 622E2C6E
P 6950 3800
AR Path="/622E2C6E" Ref="R?"  Part="1" 
AR Path="/614102B7/6158E0F0/622E2C6E" Ref="R405"  Part="1" 
AR Path="/614102B7/61665CD2/622E2C6E" Ref="R?"  Part="1" 
AR Path="/614102B7/616662E9/622E2C6E" Ref="R?"  Part="1" 
AR Path="/614102B7/616662F1/622E2C6E" Ref="R?"  Part="1" 
AR Path="/614102B7/61A702A7/622E2C6E" Ref="R505"  Part="1" 
AR Path="/614102B7/61A71E43/622E2C6E" Ref="R605"  Part="1" 
AR Path="/614102B7/61A73D1E/622E2C6E" Ref="R705"  Part="1" 
F 0 "R705" V 6754 3800 50  0000 C CNN
F 1 "33k" V 6845 3800 50  0000 C CNN
F 2 "Resistor_SMD:R_0805_2012Metric" H 6950 3800 50  0001 C CNN
F 3 "~" H 6950 3800 50  0001 C CNN
	1    6950 3800
	0    -1   1    0   
$EndComp
$Comp
L Device:R_Small R?
U 1 1 622E2C74
P 6750 3400
AR Path="/622E2C74" Ref="R?"  Part="1" 
AR Path="/614102B7/6158E0F0/622E2C74" Ref="R404"  Part="1" 
AR Path="/614102B7/61665CD2/622E2C74" Ref="R?"  Part="1" 
AR Path="/614102B7/616662E9/622E2C74" Ref="R?"  Part="1" 
AR Path="/614102B7/616662F1/622E2C74" Ref="R?"  Part="1" 
AR Path="/614102B7/61A702A7/622E2C74" Ref="R504"  Part="1" 
AR Path="/614102B7/61A71E43/622E2C74" Ref="R604"  Part="1" 
AR Path="/614102B7/61A73D1E/622E2C74" Ref="R704"  Part="1" 
F 0 "R704" H 6750 3550 50  0000 L CNN
F 1 "18k" V 6850 3300 50  0000 L CNN
F 2 "Resistor_SMD:R_0805_2012Metric" H 6750 3400 50  0001 C CNN
F 3 "~" H 6750 3400 50  0001 C CNN
	1    6750 3400
	-1   0    0    -1  
$EndComp
$Comp
L Device:R_Small R?
U 1 1 622E2C7A
P 6550 3400
AR Path="/622E2C7A" Ref="R?"  Part="1" 
AR Path="/614102B7/6158E0F0/622E2C7A" Ref="R403"  Part="1" 
AR Path="/614102B7/61665CD2/622E2C7A" Ref="R?"  Part="1" 
AR Path="/614102B7/616662E9/622E2C7A" Ref="R?"  Part="1" 
AR Path="/614102B7/616662F1/622E2C7A" Ref="R?"  Part="1" 
AR Path="/614102B7/61A702A7/622E2C7A" Ref="R503"  Part="1" 
AR Path="/614102B7/61A71E43/622E2C7A" Ref="R603"  Part="1" 
AR Path="/614102B7/61A73D1E/622E2C7A" Ref="R703"  Part="1" 
F 0 "R703" H 6550 3550 50  0000 L CNN
F 1 "100k" V 6650 3300 50  0000 L CNN
F 2 "Resistor_SMD:R_0805_2012Metric" H 6550 3400 50  0001 C CNN
F 3 "~" H 6550 3400 50  0001 C CNN
	1    6550 3400
	-1   0    0    -1  
$EndComp
$Comp
L Amplifier_Operational:MCP6001-OT U?
U 1 1 622E2C80
P 5900 3700
AR Path="/622E2C80" Ref="U?"  Part="1" 
AR Path="/614102B7/6158E0F0/622E2C80" Ref="U402"  Part="1" 
AR Path="/614102B7/61665CD2/622E2C80" Ref="U?"  Part="1" 
AR Path="/614102B7/616662E9/622E2C80" Ref="U?"  Part="1" 
AR Path="/614102B7/616662F1/622E2C80" Ref="U?"  Part="1" 
AR Path="/614102B7/61A702A7/622E2C80" Ref="U502"  Part="1" 
AR Path="/614102B7/61A71E43/622E2C80" Ref="U602"  Part="1" 
AR Path="/614102B7/61A73D1E/622E2C80" Ref="U702"  Part="1" 
F 0 "U702" H 5500 3700 50  0000 L CNN
F 1 "ADA4084-1ARJZ-R2" H 5400 2900 50  0000 L CNN
F 2 "Package_TO_SOT_SMD:SOT-23-5" H 5800 3500 50  0001 L CNN
F 3 "http://ww1.microchip.com/downloads/en/DeviceDoc/20001685E.pdf" H 5900 3900 50  0001 C CNN
	1    5900 3700
	-1   0    0    -1  
$EndComp
Wire Wire Line
	7050 3800 7650 3800
Wire Wire Line
	7650 4100 7650 4200
Wire Wire Line
	8150 3750 8150 3850
$Comp
L Isolator:ISO7341C U?
U 1 1 622F5F69
P 4250 3300
AR Path="/622F5F69" Ref="U?"  Part="1" 
AR Path="/61A3FEC3/622F5F69" Ref="U?"  Part="1" 
AR Path="/622F77ED/622F5F69" Ref="U?"  Part="1" 
AR Path="/614102B7/6158E0F0/622F5F69" Ref="U401"  Part="1" 
AR Path="/614102B7/61665CD2/622F5F69" Ref="U?"  Part="1" 
AR Path="/614102B7/616662E9/622F5F69" Ref="U?"  Part="1" 
AR Path="/614102B7/616662F1/622F5F69" Ref="U?"  Part="1" 
AR Path="/614102B7/61A702A7/622F5F69" Ref="U501"  Part="1" 
AR Path="/614102B7/61A71E43/622F5F69" Ref="U601"  Part="1" 
AR Path="/614102B7/61A73D1E/622F5F69" Ref="U701"  Part="1" 
F 0 "U701" H 4250 3967 50  0000 C CNN
F 1 "ISOS141-SEP" H 4250 3876 50  0000 C CNN
F 2 "Package_SO:SSOP-16_3.9x4.9mm_P0.635mm" H 4250 2750 50  0001 C CIN
F 3 "https://www.ti.com/lit/gpn/isos141-sep" H 4250 3700 50  0001 C CNN
	1    4250 3300
	1    0    0    -1  
$EndComp
Wire Wire Line
	5150 2800 5150 3400
Wire Wire Line
	7850 4700 5050 4700
Wire Wire Line
	5050 4700 5050 3600
Wire Wire Line
	7850 3750 7850 4700
Wire Wire Line
	7750 4600 5150 4600
Wire Wire Line
	5150 4600 5150 3500
Wire Wire Line
	7750 3750 7750 4600
Text HLabel 3600 3400 0    50   Input ~ 0
ADC_SW
Text HLabel 3600 3700 0    50   Output ~ 0
ADC_OUT
Wire Wire Line
	4650 3200 4700 3200
Wire Wire Line
	4650 2900 4700 2900
Connection ~ 4700 2900
Wire Wire Line
	4700 2900 4700 3200
Wire Wire Line
	4650 3000 4900 3000
Connection ~ 7650 4200
Wire Wire Line
	8400 4200 8400 4100
Wire Wire Line
	8400 3900 8400 3750
Connection ~ 8400 3750
Wire Wire Line
	8400 3750 8250 3750
Wire Wire Line
	7650 4200 7950 4200
Connection ~ 7950 4200
Wire Wire Line
	7950 4200 8050 4200
Connection ~ 8050 4200
Wire Wire Line
	8050 4200 8150 4200
Connection ~ 8150 4200
Wire Wire Line
	8150 4200 8250 4200
Connection ~ 8250 4200
Wire Wire Line
	8250 4200 8400 4200
$Comp
L Device:C_Small C?
U 1 1 61A3E99A
P 4800 2900
AR Path="/61A3E99A" Ref="C?"  Part="1" 
AR Path="/614102B7/6158E0F0/61A3E99A" Ref="C402"  Part="1" 
AR Path="/614102B7/61665CD2/61A3E99A" Ref="C?"  Part="1" 
AR Path="/614102B7/616662E9/61A3E99A" Ref="C?"  Part="1" 
AR Path="/614102B7/616662F1/61A3E99A" Ref="C?"  Part="1" 
AR Path="/614102B7/61A702A7/61A3E99A" Ref="C502"  Part="1" 
AR Path="/614102B7/61A71E43/61A3E99A" Ref="C602"  Part="1" 
AR Path="/614102B7/61A73D1E/61A3E99A" Ref="C702"  Part="1" 
F 0 "C702" V 4600 2800 50  0000 C CNN
F 1 "100n" V 4700 2750 50  0000 C CNN
F 2 "Capacitor_SMD:C_0805_2012Metric" H 4800 2900 50  0001 C CNN
F 3 "~" H 4800 2900 50  0001 C CNN
	1    4800 2900
	0    -1   1    0   
$EndComp
Wire Wire Line
	4900 2900 4900 3000
Connection ~ 4900 3000
Wire Wire Line
	3850 2900 3800 2900
Wire Wire Line
	3850 3500 3600 3500
Wire Wire Line
	3850 3600 3600 3600
Wire Wire Line
	3850 3400 3600 3400
Wire Wire Line
	3850 3700 3600 3700
Wire Wire Line
	3850 3200 3800 3200
Wire Wire Line
	3800 3200 3800 2900
$Comp
L Device:C_Small C?
U 1 1 61A5D28A
P 3700 2900
AR Path="/61A5D28A" Ref="C?"  Part="1" 
AR Path="/614102B7/6158E0F0/61A5D28A" Ref="C401"  Part="1" 
AR Path="/614102B7/61665CD2/61A5D28A" Ref="C?"  Part="1" 
AR Path="/614102B7/616662E9/61A5D28A" Ref="C?"  Part="1" 
AR Path="/614102B7/616662F1/61A5D28A" Ref="C?"  Part="1" 
AR Path="/614102B7/61A702A7/61A5D28A" Ref="C501"  Part="1" 
AR Path="/614102B7/61A71E43/61A5D28A" Ref="C601"  Part="1" 
AR Path="/614102B7/61A73D1E/61A5D28A" Ref="C701"  Part="1" 
F 0 "C701" V 3950 2750 50  0000 C CNN
F 1 "100n" V 3850 2800 50  0000 C CNN
F 2 "Capacitor_SMD:C_0805_2012Metric" H 3700 2900 50  0001 C CNN
F 3 "~" H 3700 2900 50  0001 C CNN
	1    3700 2900
	0    1    -1   0   
$EndComp
$Comp
L Device:CP_Small C411
U 1 1 61BC38E6
P 8550 4000
AR Path="/614102B7/6158E0F0/61BC38E6" Ref="C411"  Part="1" 
AR Path="/614102B7/61A702A7/61BC38E6" Ref="C511"  Part="1" 
AR Path="/614102B7/61A71E43/61BC38E6" Ref="C611"  Part="1" 
AR Path="/614102B7/61A73D1E/61BC38E6" Ref="C711"  Part="1" 
F 0 "C711" H 8638 4046 50  0000 L CNN
F 1 "330u/35" H 8638 3955 50  0000 L CNN
F 2 "Capacitor_SMD:CP_Elec_10x10.5" H 8550 4000 50  0001 C CNN
F 3 "~" H 8550 4000 50  0001 C CNN
	1    8550 4000
	1    0    0    -1  
$EndComp
Wire Wire Line
	8550 3900 8550 3750
Wire Wire Line
	8550 3750 8400 3750
Wire Wire Line
	8550 4100 8550 4200
Wire Wire Line
	8550 4200 8400 4200
Connection ~ 8400 4200
$Comp
L project_power:GNDM #PWR0404
U 1 1 61811053
P 4900 3000
AR Path="/614102B7/6158E0F0/61811053" Ref="#PWR0404"  Part="1" 
AR Path="/614102B7/61A73D1E/61811053" Ref="#PWR0704"  Part="1" 
AR Path="/614102B7/61A702A7/61811053" Ref="#PWR0504"  Part="1" 
AR Path="/614102B7/61A71E43/61811053" Ref="#PWR0604"  Part="1" 
F 0 "#PWR0704" H 4900 2750 50  0001 C CNN
F 1 "GNDM" H 4905 2827 50  0000 C CNN
F 2 "" H 4900 3000 50  0001 C CNN
F 3 "" H 4900 3000 50  0001 C CNN
	1    4900 3000
	1    0    0    -1  
$EndComp
$Comp
L power:+24V #PWR0410
U 1 1 61811F40
P 8550 3750
AR Path="/614102B7/6158E0F0/61811F40" Ref="#PWR0410"  Part="1" 
AR Path="/614102B7/61A73D1E/61811F40" Ref="#PWR0710"  Part="1" 
AR Path="/614102B7/61A702A7/61811F40" Ref="#PWR0510"  Part="1" 
AR Path="/614102B7/61A71E43/61811F40" Ref="#PWR0610"  Part="1" 
F 0 "#PWR0710" H 8550 3600 50  0001 C CNN
F 1 "+24V" H 8565 3923 50  0000 C CNN
F 2 "" H 8550 3750 50  0001 C CNN
F 3 "" H 8550 3750 50  0001 C CNN
	1    8550 3750
	1    0    0    -1  
$EndComp
Connection ~ 8550 3750
$Comp
L project_power:GNDM #PWR0409
U 1 1 61812811
P 7650 4200
AR Path="/614102B7/6158E0F0/61812811" Ref="#PWR0409"  Part="1" 
AR Path="/614102B7/61A73D1E/61812811" Ref="#PWR0709"  Part="1" 
AR Path="/614102B7/61A702A7/61812811" Ref="#PWR0509"  Part="1" 
AR Path="/614102B7/61A71E43/61812811" Ref="#PWR0609"  Part="1" 
F 0 "#PWR0709" H 7650 3950 50  0001 C CNN
F 1 "GNDM" H 7655 4027 50  0000 C CNN
F 2 "" H 7650 4200 50  0001 C CNN
F 3 "" H 7650 4200 50  0001 C CNN
	1    7650 4200
	1    0    0    -1  
$EndComp
$Comp
L project_power:GNDM #PWR0407
U 1 1 61813455
P 6000 4200
AR Path="/614102B7/6158E0F0/61813455" Ref="#PWR0407"  Part="1" 
AR Path="/614102B7/61A73D1E/61813455" Ref="#PWR0707"  Part="1" 
AR Path="/614102B7/61A702A7/61813455" Ref="#PWR0507"  Part="1" 
AR Path="/614102B7/61A71E43/61813455" Ref="#PWR0607"  Part="1" 
F 0 "#PWR0707" H 6000 3950 50  0001 C CNN
F 1 "GNDM" H 6005 4027 50  0000 C CNN
F 2 "" H 6000 4200 50  0001 C CNN
F 3 "" H 6000 4200 50  0001 C CNN
	1    6000 4200
	1    0    0    -1  
$EndComp
Connection ~ 6000 4200
$Comp
L power:GND #PWR0401
U 1 1 61813B70
P 3600 3000
AR Path="/614102B7/6158E0F0/61813B70" Ref="#PWR0401"  Part="1" 
AR Path="/614102B7/61A73D1E/61813B70" Ref="#PWR0701"  Part="1" 
AR Path="/614102B7/61A702A7/61813B70" Ref="#PWR0501"  Part="1" 
AR Path="/614102B7/61A71E43/61813B70" Ref="#PWR0601"  Part="1" 
F 0 "#PWR0701" H 3600 2750 50  0001 C CNN
F 1 "GND" H 3605 2827 50  0000 C CNN
F 2 "" H 3600 3000 50  0001 C CNN
F 3 "" H 3600 3000 50  0001 C CNN
	1    3600 3000
	1    0    0    -1  
$EndComp
$Comp
L power:+2V5 #PWR0402
U 1 1 618189F2
P 3800 2900
AR Path="/614102B7/6158E0F0/618189F2" Ref="#PWR0402"  Part="1" 
AR Path="/614102B7/61A73D1E/618189F2" Ref="#PWR0702"  Part="1" 
AR Path="/614102B7/61A702A7/618189F2" Ref="#PWR0502"  Part="1" 
AR Path="/614102B7/61A71E43/618189F2" Ref="#PWR0602"  Part="1" 
F 0 "#PWR0702" H 3800 2750 50  0001 C CNN
F 1 "+2V5" H 3815 3073 50  0000 C CNN
F 2 "" H 3800 2900 50  0001 C CNN
F 3 "" H 3800 2900 50  0001 C CNN
	1    3800 2900
	1    0    0    -1  
$EndComp
Connection ~ 3800 2900
Wire Wire Line
	6350 3100 6450 3100
$Comp
L project_power:+5VM #PWR0408
U 1 1 6183C6F6
P 6450 3100
AR Path="/614102B7/6158E0F0/6183C6F6" Ref="#PWR0408"  Part="1" 
AR Path="/614102B7/61A73D1E/6183C6F6" Ref="#PWR0708"  Part="1" 
AR Path="/614102B7/61A702A7/6183C6F6" Ref="#PWR0508"  Part="1" 
AR Path="/614102B7/61A71E43/6183C6F6" Ref="#PWR0608"  Part="1" 
F 0 "#PWR0708" H 6450 2950 50  0001 C CNN
F 1 "+5VM" H 6465 3273 50  0000 C CNN
F 2 "" H 6450 3100 50  0001 C CNN
F 3 "" H 6450 3100 50  0001 C CNN
	1    6450 3100
	1    0    0    -1  
$EndComp
Connection ~ 6450 3100
Wire Wire Line
	6450 3100 6550 3100
$Comp
L project_power:+5VM #PWR0406
U 1 1 6183CE5A
P 6000 3100
AR Path="/614102B7/6158E0F0/6183CE5A" Ref="#PWR0406"  Part="1" 
AR Path="/614102B7/61A73D1E/6183CE5A" Ref="#PWR0706"  Part="1" 
AR Path="/614102B7/61A702A7/6183CE5A" Ref="#PWR0506"  Part="1" 
AR Path="/614102B7/61A71E43/6183CE5A" Ref="#PWR0606"  Part="1" 
F 0 "#PWR0706" H 6000 2950 50  0001 C CNN
F 1 "+5VM" H 6015 3273 50  0000 C CNN
F 2 "" H 6000 3100 50  0001 C CNN
F 3 "" H 6000 3100 50  0001 C CNN
	1    6000 3100
	1    0    0    -1  
$EndComp
Connection ~ 6000 3100
$Comp
L project_power:+5VM #PWR0403
U 1 1 6183D253
P 4700 2900
AR Path="/614102B7/6158E0F0/6183D253" Ref="#PWR0403"  Part="1" 
AR Path="/614102B7/61A73D1E/6183D253" Ref="#PWR0703"  Part="1" 
AR Path="/614102B7/61A702A7/6183D253" Ref="#PWR0503"  Part="1" 
AR Path="/614102B7/61A71E43/6183D253" Ref="#PWR0603"  Part="1" 
F 0 "#PWR0703" H 4700 2750 50  0001 C CNN
F 1 "+5VM" H 4715 3073 50  0000 C CNN
F 2 "" H 4700 2900 50  0001 C CNN
F 3 "" H 4700 2900 50  0001 C CNN
	1    4700 2900
	1    0    0    -1  
$EndComp
Wire Wire Line
	3600 3000 3850 3000
Wire Wire Line
	3600 2900 3600 3000
Connection ~ 3600 3000
$Comp
L project_power:GNDM #PWR0405
U 1 1 61882866
P 5800 3400
AR Path="/614102B7/6158E0F0/61882866" Ref="#PWR0405"  Part="1" 
AR Path="/614102B7/61A73D1E/61882866" Ref="#PWR0705"  Part="1" 
AR Path="/614102B7/61A702A7/61882866" Ref="#PWR0505"  Part="1" 
AR Path="/614102B7/61A71E43/61882866" Ref="#PWR0605"  Part="1" 
F 0 "#PWR0705" H 5800 3150 50  0001 C CNN
F 1 "GNDM" H 5805 3227 50  0000 C CNN
F 2 "" H 5800 3400 50  0001 C CNN
F 3 "" H 5800 3400 50  0001 C CNN
	1    5800 3400
	1    0    0    -1  
$EndComp
Connection ~ 5800 3400
Wire Wire Line
	5150 3400 4650 3400
Wire Wire Line
	5150 3500 4650 3500
Wire Wire Line
	5050 3600 4650 3600
$EndSCHEMATC
