EESchema Schematic File Version 4
EELAYER 30 0
EELAYER END
$Descr A3 16535 11693
encoding utf-8
Sheet 1 16
Title "SumIntADC NX breadboard"
Date "2021-11-12"
Rev "1.0"
Comp "PiKRON"
Comment1 "Pavel Píša, Petr Porazil, Jakub Ladman"
Comment2 "Top level schematic, FPGA board interface"
Comment3 ""
Comment4 ""
$EndDescr
$Comp
L Mechanical:MountingHole H101
U 1 1 61AF9638
P 7600 1050
AR Path="/61AF9638" Ref="H101"  Part="1" 
AR Path="/61A3FEC3/61AF9638" Ref="H?"  Part="1" 
F 0 "H101" H 7700 1096 50  0000 L CNN
F 1 "MountingHole" H 7700 1005 50  0000 L CNN
F 2 "MountingHole:MountingHole_3.2mm_M3" H 7600 1050 50  0001 C CNN
F 3 "~" H 7600 1050 50  0001 C CNN
	1    7600 1050
	1    0    0    -1  
$EndComp
$Comp
L Mechanical:MountingHole H102
U 1 1 61AF963E
P 7600 10550
AR Path="/61AF963E" Ref="H102"  Part="1" 
AR Path="/61A3FEC3/61AF963E" Ref="H?"  Part="1" 
F 0 "H102" H 7700 10596 50  0000 L CNN
F 1 "MountingHole" H 7700 10505 50  0000 L CNN
F 2 "MountingHole:MountingHole_3.2mm_M3" H 7600 10550 50  0001 C CNN
F 3 "~" H 7600 10550 50  0001 C CNN
	1    7600 10550
	1    0    0    -1  
$EndComp
Wire Wire Line
	7100 3900 6550 3900
Wire Wire Line
	6550 3900 6550 3650
$Comp
L power:+3.3V #PWR0117
U 1 1 61C50240
P 6550 3650
F 0 "#PWR0117" H 6550 3500 50  0001 C CNN
F 1 "+3.3V" H 6565 3823 50  0000 C CNN
F 2 "" H 6550 3650 50  0001 C CNN
F 3 "" H 6550 3650 50  0001 C CNN
	1    6550 3650
	1    0    0    -1  
$EndComp
Wire Wire Line
	8100 3900 8650 3900
Wire Wire Line
	8650 3900 8650 3650
$Comp
L power:+12V #PWR0120
U 1 1 61C93F3A
P 8650 3650
F 0 "#PWR0120" H 8650 3500 50  0001 C CNN
F 1 "+12V" H 8665 3823 50  0000 C CNN
F 2 "" H 8650 3650 50  0001 C CNN
F 3 "" H 8650 3650 50  0001 C CNN
	1    8650 3650
	1    0    0    -1  
$EndComp
$Comp
L power:GND #PWR0118
U 1 1 61C9652B
P 6950 10350
F 0 "#PWR0118" H 6950 10100 50  0001 C CNN
F 1 "GND" H 6955 10177 50  0000 C CNN
F 2 "" H 6950 10350 50  0001 C CNN
F 3 "" H 6950 10350 50  0001 C CNN
	1    6950 10350
	1    0    0    -1  
$EndComp
$Comp
L power:GND #PWR0119
U 1 1 61C98A4B
P 8250 10350
F 0 "#PWR0119" H 8250 10100 50  0001 C CNN
F 1 "GND" H 8255 10177 50  0000 C CNN
F 2 "" H 8250 10350 50  0001 C CNN
F 3 "" H 8250 10350 50  0001 C CNN
	1    8250 10350
	1    0    0    -1  
$EndComp
Wire Wire Line
	8250 10350 8250 10150
Wire Wire Line
	8250 3450 8100 3450
Wire Wire Line
	8100 3550 8250 3550
Connection ~ 8250 3550
Wire Wire Line
	8250 3550 8250 3450
Wire Wire Line
	8100 6750 8250 6750
Connection ~ 8250 6750
Wire Wire Line
	8250 6750 8250 3550
Wire Wire Line
	8100 6850 8250 6850
Connection ~ 8250 6850
Wire Wire Line
	8250 6850 8250 6750
Wire Wire Line
	8100 10050 8250 10050
Connection ~ 8250 10050
Wire Wire Line
	8250 10050 8250 6850
Wire Wire Line
	8100 10150 8250 10150
Connection ~ 8250 10150
Wire Wire Line
	8250 10150 8250 10050
Wire Wire Line
	6950 10350 6950 10150
Wire Wire Line
	6950 3450 7100 3450
Wire Wire Line
	7100 3550 6950 3550
Connection ~ 6950 3550
Wire Wire Line
	6950 3550 6950 3450
Wire Wire Line
	7100 6750 6950 6750
Connection ~ 6950 6750
Wire Wire Line
	7100 6850 6950 6850
Connection ~ 6950 6850
Wire Wire Line
	6950 6850 6950 6750
Wire Wire Line
	7100 10050 6950 10050
Wire Wire Line
	7100 10150 6950 10150
Connection ~ 6950 10150
Wire Wire Line
	6950 10150 6950 10050
Wire Wire Line
	7100 4200 6550 4200
Wire Wire Line
	6550 4200 6550 3900
Connection ~ 6550 3900
Wire Wire Line
	7100 9900 6550 9900
Connection ~ 6550 4200
Wire Wire Line
	7100 4500 6550 4500
Wire Wire Line
	7100 4800 6550 4800
Connection ~ 6550 4500
Wire Wire Line
	6550 4500 6550 4200
Connection ~ 6550 4800
Wire Wire Line
	6550 4800 6550 4500
Wire Wire Line
	7100 5100 6550 5100
Wire Wire Line
	7100 5400 6550 5400
Wire Wire Line
	7100 5700 6550 5700
Wire Wire Line
	7100 6000 6550 6000
Connection ~ 6550 5100
Wire Wire Line
	6550 5100 6550 4800
Connection ~ 6550 5400
Wire Wire Line
	6550 5400 6550 5100
Connection ~ 6550 5700
Wire Wire Line
	6550 5700 6550 5400
Connection ~ 6550 6000
Wire Wire Line
	6550 6000 6550 5700
Wire Wire Line
	7100 6300 6550 6300
Wire Wire Line
	7100 6600 6550 6600
Connection ~ 6550 6300
Wire Wire Line
	6550 6300 6550 6000
Connection ~ 6550 6600
Wire Wire Line
	6550 6600 6550 6300
Wire Wire Line
	7100 7200 6550 7200
Wire Wire Line
	7100 7500 6550 7500
Wire Wire Line
	7100 7800 6550 7800
Wire Wire Line
	7100 8100 6550 8100
Wire Wire Line
	7100 8400 6550 8400
Wire Wire Line
	7100 8700 6550 8700
Wire Wire Line
	7100 9000 6550 9000
Wire Wire Line
	7100 9300 6550 9300
Wire Wire Line
	7100 9600 6550 9600
Connection ~ 6550 7200
Wire Wire Line
	6550 7200 6550 6600
Wire Wire Line
	6950 3550 6950 6750
Connection ~ 6950 10050
Wire Wire Line
	6950 6850 6950 10050
Wire Wire Line
	8100 4200 8650 4200
Wire Wire Line
	8650 4200 8650 3900
Connection ~ 8650 4200
Wire Wire Line
	8100 4500 8650 4500
Wire Wire Line
	8100 4800 8650 4800
Connection ~ 8650 4500
Wire Wire Line
	8650 4500 8650 4200
Connection ~ 8650 4800
Wire Wire Line
	8650 4800 8650 4500
Wire Wire Line
	8100 5100 8650 5100
Wire Wire Line
	8100 5400 8650 5400
Wire Wire Line
	8100 5700 8650 5700
Wire Wire Line
	8100 6000 8650 6000
Connection ~ 8650 5100
Wire Wire Line
	8650 5100 8650 4800
Connection ~ 8650 5400
Wire Wire Line
	8650 5400 8650 5100
Connection ~ 8650 5700
Wire Wire Line
	8650 5700 8650 5400
Connection ~ 8650 6000
Wire Wire Line
	8650 6000 8650 5700
Wire Wire Line
	8100 6300 8650 6300
Wire Wire Line
	8100 6600 8650 6600
Connection ~ 8650 6300
Wire Wire Line
	8650 6300 8650 6000
Connection ~ 8650 6600
Wire Wire Line
	8650 6600 8650 6300
Wire Wire Line
	8100 7200 8650 7200
Wire Wire Line
	8100 7500 8650 7500
Wire Wire Line
	8100 7800 8650 7800
Wire Wire Line
	8100 8100 8650 8100
Wire Wire Line
	8100 8400 8650 8400
Wire Wire Line
	8100 8700 8650 8700
Wire Wire Line
	8100 9000 8650 9000
Wire Wire Line
	8100 9300 8650 9300
Wire Wire Line
	8100 9600 8650 9600
Connection ~ 8650 3900
Wire Wire Line
	8100 9900 8650 9900
Text Label 8650 9900 2    50   ~ 0
PSN_N_33
$Comp
L 74xx:74LS125 U?
U 2 1 61D6152E
P 3550 4950
AR Path="/61833839/61D6152E" Ref="U?"  Part="2" 
AR Path="/622F77ED/61D6152E" Ref="U?"  Part="2" 
AR Path="/61D6152E" Ref="U103"  Part="2" 
F 0 "U103" H 3550 5267 50  0000 C CNN
F 1 "74HC125D" H 3550 5176 50  0000 C CNN
F 2 "Package_SO:SOIC-14_3.9x8.7mm_P1.27mm" H 3550 4950 50  0001 C CNN
F 3 "https://assets.nexperia.com/documents/data-sheet/74HC_HCT125.pdf" H 3550 4950 50  0001 C CNN
	2    3550 4950
	1    0    0    -1  
$EndComp
$Comp
L 74xx:74LS125 U?
U 5 1 61D6153A
P 3550 3050
AR Path="/61833839/61D6153A" Ref="U?"  Part="5" 
AR Path="/622F77ED/61D6153A" Ref="U?"  Part="5" 
AR Path="/61D6153A" Ref="U103"  Part="5" 
F 0 "U103" H 3780 3096 50  0000 L CNN
F 1 "74HC125D" H 3780 3005 50  0000 L CNN
F 2 "Package_SO:SOIC-14_3.9x8.7mm_P1.27mm" H 3550 3050 50  0001 C CNN
F 3 "https://assets.nexperia.com/documents/data-sheet/74HC_HCT125.pdf" H 3550 3050 50  0001 C CNN
	5    3550 3050
	1    0    0    -1  
$EndComp
$Comp
L Reference_Voltage:REF03GS U102
U 1 1 61AAFA2F
P 1600 6400
AR Path="/61AAFA2F" Ref="U102"  Part="1" 
AR Path="/622F77ED/61AAFA2F" Ref="U?"  Part="1" 
F 0 "U102" H 1450 6650 50  0000 C CNN
F 1 "REF43S" H 1750 6650 50  0000 C CNN
F 2 "Package_SO:SOIC-8_3.9x4.9mm_P1.27mm" H 1550 6450 50  0001 C CIN
F 3 "https://www.analog.com/media/en/technical-documentation/data-sheets/REF01_02_03.pdf" H 1550 6400 50  0001 C CIN
	1    1600 6400
	1    0    0    -1  
$EndComp
$Comp
L Device:R_Small R?
U 1 1 61AAFA35
P 1600 5900
AR Path="/61833839/61AAFA35" Ref="R?"  Part="1" 
AR Path="/622F77ED/61AAFA35" Ref="R?"  Part="1" 
AR Path="/61AAFA35" Ref="R101"  Part="1" 
F 0 "R101" V 1450 5900 50  0000 C CNN
F 1 "22R" V 1700 5900 50  0000 C CNN
F 2 "Resistor_SMD:R_0805_2012Metric" H 1600 5900 50  0001 C CNN
F 3 "~" H 1600 5900 50  0001 C CNN
	1    1600 5900
	-1   0    0    1   
$EndComp
$Comp
L Device:C_Small C101
U 1 1 61AAFA3B
P 1000 6400
AR Path="/61AAFA3B" Ref="C101"  Part="1" 
AR Path="/622F77ED/61AAFA3B" Ref="C?"  Part="1" 
F 0 "C101" V 1050 6250 50  0000 C CNN
F 1 "10u/16" V 1050 6600 50  0000 C CNN
F 2 "Capacitor_SMD:C_0805_2012Metric" H 1000 6400 50  0001 C CNN
F 3 "https://cz.mouser.com/datasheet/2/396/mlcc02_e-1307760.pdf" H 1000 6400 50  0001 C CNN
	1    1000 6400
	-1   0    0    1   
$EndComp
$Comp
L Device:C_Small C102
U 1 1 61AAFA41
P 1150 6400
AR Path="/61AAFA41" Ref="C102"  Part="1" 
AR Path="/622F77ED/61AAFA41" Ref="C?"  Part="1" 
F 0 "C102" V 1200 6250 50  0000 C CNN
F 1 "10u/16" V 1200 6600 50  0000 C CNN
F 2 "Capacitor_SMD:C_0805_2012Metric" H 1150 6400 50  0001 C CNN
F 3 "https://cz.mouser.com/datasheet/2/396/mlcc02_e-1307760.pdf" H 1150 6400 50  0001 C CNN
	1    1150 6400
	-1   0    0    1   
$EndComp
Wire Wire Line
	1150 6300 1150 6050
Wire Wire Line
	1150 6050 1000 6050
Wire Wire Line
	1000 6300 1000 6050
Wire Wire Line
	1000 6500 1000 6700
Wire Wire Line
	1150 6500 1150 6700
$Comp
L power:+5V #PWR?
U 1 1 61AAFA4F
P 1600 5750
AR Path="/622F77ED/61AAFA4F" Ref="#PWR?"  Part="1" 
AR Path="/61AAFA4F" Ref="#PWR0105"  Part="1" 
F 0 "#PWR0105" H 1600 5600 50  0001 C CNN
F 1 "+5V" H 1615 5923 50  0000 C CNN
F 2 "" H 1600 5750 50  0001 C CNN
F 3 "" H 1600 5750 50  0001 C CNN
	1    1600 5750
	1    0    0    -1  
$EndComp
NoConn ~ 1300 6400
NoConn ~ 2000 6500
$Comp
L Device:C_Small C106
U 1 1 61AFD11C
P 2250 6500
F 0 "C106" H 2158 6454 50  0000 R CNN
F 1 "10u/16" H 2158 6545 50  0000 R CNN
F 2 "Capacitor_SMD:C_0805_2012Metric" H 2250 6500 50  0001 C CNN
F 3 "https://cz.mouser.com/datasheet/2/396/mlcc02_e-1307760.pdf" H 2250 6500 50  0001 C CNN
	1    2250 6500
	-1   0    0    1   
$EndComp
Connection ~ 2250 6300
Wire Wire Line
	2250 6300 2000 6300
$Comp
L power:GND #PWR0111
U 1 1 61B06ED9
P 3550 3550
F 0 "#PWR0111" H 3550 3300 50  0001 C CNN
F 1 "GND" H 3555 3377 50  0000 C CNN
F 2 "" H 3550 3550 50  0001 C CNN
F 3 "" H 3550 3550 50  0001 C CNN
	1    3550 3550
	1    0    0    -1  
$EndComp
$Comp
L Device:C_Small C109
U 1 1 61B07F05
P 3650 2550
F 0 "C109" V 3700 2250 50  0000 C CNN
F 1 "100p" V 3650 2850 50  0000 C CNN
F 2 "Capacitor_SMD:C_0805_2012Metric" H 3650 2550 50  0001 C CNN
F 3 "~" H 3650 2550 50  0001 C CNN
	1    3650 2550
	0    1    1    0   
$EndComp
$Comp
L Device:C_Small C107
U 1 1 61B09D2D
P 3650 2250
F 0 "C107" V 3700 1950 50  0000 C CNN
F 1 "100n" V 3650 2550 50  0000 C CNN
F 2 "Capacitor_SMD:C_0805_2012Metric" H 3650 2250 50  0001 C CNN
F 3 "~" H 3650 2250 50  0001 C CNN
	1    3650 2250
	0    1    1    0   
$EndComp
$Comp
L Device:C_Small C108
U 1 1 61B09D37
P 3650 2400
F 0 "C108" V 3700 2100 50  0000 C CNN
F 1 "10n" V 3650 2700 50  0000 C CNN
F 2 "Capacitor_SMD:C_0805_2012Metric" H 3650 2400 50  0001 C CNN
F 3 "~" H 3650 2400 50  0001 C CNN
	1    3650 2400
	0    1    1    0   
$EndComp
Wire Wire Line
	3750 2250 3750 2400
Connection ~ 3750 2400
Wire Wire Line
	3750 2400 3750 2550
Connection ~ 3550 2550
Wire Wire Line
	3550 2250 3550 2400
Connection ~ 3550 2400
Wire Wire Line
	3550 2400 3550 2550
$Comp
L power:GND #PWR0116
U 1 1 61BA202C
P 3750 2550
F 0 "#PWR0116" H 3750 2300 50  0001 C CNN
F 1 "GND" H 3755 2377 50  0000 C CNN
F 2 "" H 3750 2550 50  0001 C CNN
F 3 "" H 3750 2550 50  0001 C CNN
	1    3750 2550
	1    0    0    -1  
$EndComp
Connection ~ 3750 2550
$Comp
L power:GND #PWR0112
U 1 1 61BA2711
P 3550 4400
F 0 "#PWR0112" H 3550 4150 50  0001 C CNN
F 1 "GND" H 3555 4227 50  0000 C CNN
F 2 "" H 3550 4400 50  0001 C CNN
F 3 "" H 3550 4400 50  0001 C CNN
	1    3550 4400
	-1   0    0    -1  
$EndComp
$Comp
L power:GND #PWR0113
U 1 1 61BA332C
P 3550 5200
F 0 "#PWR0113" H 3550 4950 50  0001 C CNN
F 1 "GND" H 3555 5027 50  0000 C CNN
F 2 "" H 3550 5200 50  0001 C CNN
F 3 "" H 3550 5200 50  0001 C CNN
	1    3550 5200
	-1   0    0    -1  
$EndComp
$Sheet
S 4300 4000 800  300 
U 617B514C
F0 "Sheet617B514B" 50
F1 "advanced.sch" 50
F2 "SW" I L 4300 4150 50 
F3 "OUT" O R 5100 4150 50 
$EndSheet
Wire Wire Line
	4300 4150 3850 4150
Wire Wire Line
	4300 4950 3850 4950
$Sheet
S 10850 4400 1300 2200
U 614102B7
F0 "Sheet614102B6" 50
F1 "motor.sch" 50
F2 "IRC_A" O R 12150 5400 50 
F3 "IRC_I" O R 12150 5600 50 
F4 "MARK" O R 12150 5700 50 
F5 "IRC_B" O R 12150 5500 50 
F6 "PWM_2_A" I L 10850 5150 50 
F7 "PWM_2_B" I L 10850 5250 50 
F8 "PWM_1_A" I L 10850 4700 50 
F9 "PWM_1_B" I L 10850 4800 50 
F10 "PWM_3_A" I L 10850 5600 50 
F11 "PWM_3_B" I L 10850 5700 50 
F12 "PWM_4_A" I L 10850 6050 50 
F13 "PWM_4_B" I L 10850 6150 50 
F14 "ADC_1_SW" I L 10850 4900 50 
F15 "ADC_1_OUT" O L 10850 5000 50 
F16 "ADC_2_SW" I L 10850 5350 50 
F17 "ADC_2_OUT" O L 10850 5450 50 
F18 "ADC_3_SW" I L 10850 5800 50 
F19 "ADC_3_OUT" O L 10850 5900 50 
F20 "ADC_4_SW" I L 10850 6250 50 
F21 "ADC_4_OUT" O L 10850 6350 50 
$EndSheet
$Sheet
S 10850 2400 1300 1050
U 622F77ED
F0 "sheet622F77ED" 50
F1 "hires.sch" 50
F2 "MUX_A" I L 10850 2500 50 
F3 "OUT_A" O L 10850 2600 50 
F4 "MUX_B" I L 10850 2750 50 
F5 "OUT_B" O L 10850 2850 50 
F6 "MOSI" I L 10850 3150 50 
F7 "SEL" I L 10850 3350 50 
F8 "~CS" I L 10850 3050 50 
F9 "SCLK" I L 10850 3250 50 
$EndSheet
$Comp
L power:+2V5 #PWR0108
U 1 1 61B00F50
P 3250 8850
F 0 "#PWR0108" H 3250 8700 50  0001 C CNN
F 1 "+2V5" H 3265 9023 50  0000 C CNN
F 2 "" H 3250 8850 50  0001 C CNN
F 3 "" H 3250 8850 50  0001 C CNN
	1    3250 8850
	1    0    0    -1  
$EndComp
Wire Wire Line
	2100 5150 2100 5350
Wire Wire Line
	1950 5150 1950 5350
Wire Wire Line
	1950 4950 1950 4750
Wire Wire Line
	2100 4950 2100 4750
$Comp
L Device:C_Small C105
U 1 1 61B80D89
P 2100 5050
AR Path="/61B80D89" Ref="C105"  Part="1" 
AR Path="/622F77ED/61B80D89" Ref="C?"  Part="1" 
F 0 "C105" V 2150 4900 50  0000 C CNN
F 1 "10u/16" V 2150 5250 50  0000 C CNN
F 2 "Capacitor_SMD:C_0805_2012Metric" H 2100 5050 50  0001 C CNN
F 3 "https://cz.mouser.com/datasheet/2/396/mlcc02_e-1307760.pdf" H 2100 5050 50  0001 C CNN
	1    2100 5050
	-1   0    0    1   
$EndComp
$Comp
L Device:C_Small C104
U 1 1 61B801A1
P 1950 5050
AR Path="/61B801A1" Ref="C104"  Part="1" 
AR Path="/622F77ED/61B801A1" Ref="C?"  Part="1" 
F 0 "C104" V 2000 4900 50  0000 C CNN
F 1 "10u/16" V 2000 5250 50  0000 C CNN
F 2 "Capacitor_SMD:C_0805_2012Metric" H 1950 5050 50  0001 C CNN
F 3 "https://cz.mouser.com/datasheet/2/396/mlcc02_e-1307760.pdf" H 1950 5050 50  0001 C CNN
	1    1950 5050
	-1   0    0    1   
$EndComp
Wire Wire Line
	4300 5750 3850 5750
Wire Wire Line
	4300 6550 3850 6550
$Sheet
S 4300 7000 800  400 
U 6169E126
F0 "Sheet6169E125" 50
F1 "simple.sch" 50
F2 "REF" I L 4300 7150 50 
F3 "SW" I L 4300 7250 50 
F4 "OUT" O R 5100 7200 50 
$EndSheet
$Comp
L power:+5V #PWR0107
U 1 1 61ED0A7D
P 2100 4750
F 0 "#PWR0107" H 2100 4600 50  0001 C CNN
F 1 "+5V" H 2100 4900 50  0000 C CNN
F 2 "" H 2100 4750 50  0001 C CNN
F 3 "" H 2100 4750 50  0001 C CNN
	1    2100 4750
	1    0    0    -1  
$EndComp
$Comp
L power:GND #PWR?
U 1 1 61BA3CBE
P 3550 6800
AR Path="/61833839/61BA3CBE" Ref="#PWR?"  Part="1" 
AR Path="/622F77ED/61BA3CBE" Ref="#PWR?"  Part="1" 
AR Path="/61BA3CBE" Ref="#PWR0115"  Part="1" 
F 0 "#PWR0115" H 3550 6550 50  0001 C CNN
F 1 "GND" H 3555 6627 50  0000 C CNN
F 2 "" H 3550 6800 50  0001 C CNN
F 3 "" H 3550 6800 50  0001 C CNN
	1    3550 6800
	-1   0    0    -1  
$EndComp
$Comp
L power:GND #PWR?
U 1 1 61BA3768
P 3550 6000
AR Path="/61833839/61BA3768" Ref="#PWR?"  Part="1" 
AR Path="/622F77ED/61BA3768" Ref="#PWR?"  Part="1" 
AR Path="/61BA3768" Ref="#PWR0114"  Part="1" 
F 0 "#PWR0114" H 3550 5750 50  0001 C CNN
F 1 "GND" H 3555 5827 50  0000 C CNN
F 2 "" H 3550 6000 50  0001 C CNN
F 3 "" H 3550 6000 50  0001 C CNN
	1    3550 6000
	-1   0    0    -1  
$EndComp
$Comp
L 74xx:74LS125 U?
U 4 1 61D61528
P 3550 5750
AR Path="/61833839/61D61528" Ref="U?"  Part="4" 
AR Path="/622F77ED/61D61528" Ref="U?"  Part="4" 
AR Path="/61D61528" Ref="U103"  Part="4" 
F 0 "U103" H 3550 6067 50  0000 C CNN
F 1 "74HC125D" H 3550 5976 50  0000 C CNN
F 2 "Package_SO:SOIC-14_3.9x8.7mm_P1.27mm" H 3550 5750 50  0001 C CNN
F 3 "https://assets.nexperia.com/documents/data-sheet/74HC_HCT125.pdf" H 3550 5750 50  0001 C CNN
	4    3550 5750
	1    0    0    -1  
$EndComp
$Comp
L 74xx:74LS125 U?
U 3 1 61D61534
P 3550 6550
AR Path="/61833839/61D61534" Ref="U?"  Part="3" 
AR Path="/622F77ED/61D61534" Ref="U?"  Part="3" 
AR Path="/61D61534" Ref="U103"  Part="3" 
F 0 "U103" H 3550 6867 50  0000 C CNN
F 1 "74HC125D" H 3550 6776 50  0000 C CNN
F 2 "Package_SO:SOIC-14_3.9x8.7mm_P1.27mm" H 3550 6550 50  0001 C CNN
F 3 "https://assets.nexperia.com/documents/data-sheet/74HC_HCT125.pdf" H 3550 6550 50  0001 C CNN
	3    3550 6550
	1    0    0    -1  
$EndComp
$Comp
L power:GND #PWR0104
U 1 1 61641AFB
P 1600 5350
F 0 "#PWR0104" H 1600 5100 50  0001 C CNN
F 1 "GND" H 1605 5177 50  0000 C CNN
F 2 "" H 1600 5350 50  0001 C CNN
F 3 "" H 1600 5350 50  0001 C CNN
	1    1600 5350
	1    0    0    -1  
$EndComp
$Comp
L power:+12V #PWR0103
U 1 1 61641AEF
P 1250 4750
F 0 "#PWR0103" H 1250 4600 50  0001 C CNN
F 1 "+12V" H 1200 4900 50  0000 C CNN
F 2 "" H 1250 4750 50  0001 C CNN
F 3 "" H 1250 4750 50  0001 C CNN
	1    1250 4750
	1    0    0    -1  
$EndComp
$Comp
L Regulator_Linear:LM2937xS U101
U 1 1 61641AE9
P 1600 4750
AR Path="/61641AE9" Ref="U101"  Part="1" 
AR Path="/615D4F53/61641AE9" Ref="U?"  Part="1" 
F 0 "U101" H 1600 4992 50  0000 C CNN
F 1 "LM2940CS-5.0" H 1600 4901 50  0000 C CNN
F 2 "Package_TO_SOT_SMD:TO-263-3_TabPin2" H 1600 4975 50  0001 C CIN
F 3 "http://www.ti.com/lit/ds/symlink/lm2937.pdf" H 1600 4700 50  0001 C CNN
	1    1600 4750
	1    0    0    -1  
$EndComp
Wire Wire Line
	1600 5350 1600 5050
Wire Wire Line
	1300 4750 1250 4750
Wire Wire Line
	1900 4750 1950 4750
Connection ~ 2100 4750
Connection ~ 1950 4750
Wire Wire Line
	1950 4750 2100 4750
Wire Wire Line
	2100 5350 1950 5350
Connection ~ 1600 5350
Connection ~ 1950 5350
Wire Wire Line
	1950 5350 1600 5350
$Comp
L power:GND #PWR0106
U 1 1 61E49B9D
P 1600 6700
F 0 "#PWR0106" H 1600 6450 50  0001 C CNN
F 1 "GND" H 1605 6527 50  0000 C CNN
F 2 "" H 1600 6700 50  0001 C CNN
F 3 "" H 1600 6700 50  0001 C CNN
	1    1600 6700
	1    0    0    -1  
$EndComp
$Comp
L power:GND #PWR0102
U 1 1 61E4A106
P 1150 6700
F 0 "#PWR0102" H 1150 6450 50  0001 C CNN
F 1 "GND" H 1155 6527 50  0000 C CNN
F 2 "" H 1150 6700 50  0001 C CNN
F 3 "" H 1150 6700 50  0001 C CNN
	1    1150 6700
	1    0    0    -1  
$EndComp
$Comp
L power:GND #PWR0101
U 1 1 61E4A3C3
P 1000 6700
F 0 "#PWR0101" H 1000 6450 50  0001 C CNN
F 1 "GND" H 1005 6527 50  0000 C CNN
F 2 "" H 1000 6700 50  0001 C CNN
F 3 "" H 1000 6700 50  0001 C CNN
	1    1000 6700
	1    0    0    -1  
$EndComp
$Comp
L power:GND #PWR0109
U 1 1 61E4A4D3
P 2250 6700
F 0 "#PWR0109" H 2250 6450 50  0001 C CNN
F 1 "GND" H 2255 6527 50  0000 C CNN
F 2 "" H 2250 6700 50  0001 C CNN
F 3 "" H 2250 6700 50  0001 C CNN
	1    2250 6700
	1    0    0    -1  
$EndComp
Wire Wire Line
	2250 6600 2250 6700
Wire Wire Line
	2250 6400 2250 6300
$Comp
L Device:C_Small C103
U 1 1 61E57117
P 1250 5050
F 0 "C103" H 1342 5004 50  0000 L CNN
F 1 "100n" H 1342 5095 50  0000 L CNN
F 2 "Capacitor_SMD:C_0805_2012Metric" H 1250 5050 50  0001 C CNN
F 3 "~" H 1250 5050 50  0001 C CNN
	1    1250 5050
	-1   0    0    1   
$EndComp
Wire Wire Line
	1250 4750 1250 4950
Connection ~ 1250 4750
Wire Wire Line
	1250 5150 1250 5350
Wire Wire Line
	1250 5350 1600 5350
Text Label 6650 3300 0    50   ~ 0
HCKO0
Wire Wire Line
	7100 3300 6650 3300
Text Label 6650 3200 0    50   ~ 0
HTDO_33
Wire Wire Line
	7100 3200 6650 3200
Text Label 6650 3100 0    50   ~ 0
HTCK_33
Wire Wire Line
	7100 3100 6650 3100
Text Label 6650 3000 0    50   ~ 0
HSDA_33
Wire Wire Line
	7100 3000 6650 3000
Wire Wire Line
	7100 2900 6650 2900
Text Label 6650 2800 0    50   ~ 0
HTX0P
Wire Wire Line
	7100 2800 6650 2800
Text Label 6650 2700 0    50   ~ 0
HTX1N
Wire Wire Line
	7100 2700 6650 2700
Text Label 6650 2600 0    50   ~ 0
HTX1P
Wire Wire Line
	7100 2600 6650 2600
Text Label 6650 2500 0    50   ~ 0
HTX2N
Wire Wire Line
	7100 2500 6650 2500
Text Label 6650 2400 0    50   ~ 0
HTX2P
Wire Wire Line
	7100 2400 6650 2400
Text Label 6650 2300 0    50   ~ 0
HTX3N
Wire Wire Line
	7100 2300 6650 2300
Text Label 6650 2200 0    50   ~ 0
HTX3P
Wire Wire Line
	7100 2200 6650 2200
Text Label 6650 2100 0    50   ~ 0
HTX4N
Wire Wire Line
	7100 2100 6650 2100
Text Label 6650 2000 0    50   ~ 0
HTX4P
Wire Wire Line
	7100 2000 6650 2000
Text Label 6650 1900 0    50   ~ 0
HTX5N
Wire Wire Line
	7100 1900 6650 1900
Text Label 6650 1800 0    50   ~ 0
HTX5P
Wire Wire Line
	7100 1800 6650 1800
Text Label 6650 1700 0    50   ~ 0
HTX6N
Wire Wire Line
	7100 1700 6650 1700
Text Label 6650 1600 0    50   ~ 0
HTX6P
Wire Wire Line
	7100 1600 6650 1600
Text Label 6650 1500 0    50   ~ 0
HTX7N
Wire Wire Line
	7100 1500 6650 1500
Text Label 6650 1400 0    50   ~ 0
HTX7P
Wire Wire Line
	7100 1400 6650 1400
Text Label 8550 3300 2    50   ~ 0
HCKI0
Wire Wire Line
	8100 3300 8550 3300
Text Label 8550 3200 2    50   ~ 0
HTDI_33
Wire Wire Line
	8100 3200 8550 3200
Text Label 8550 3100 2    50   ~ 0
HTMS_33
Wire Wire Line
	8100 3100 8550 3100
Text Label 6650 3800 0    50   ~ 0
HD0N
Wire Wire Line
	7100 3800 6650 3800
Text Label 6650 3700 0    50   ~ 0
HD0P
Wire Wire Line
	7100 3700 6650 3700
Text Label 8550 3800 2    50   ~ 0
HD1N
Wire Wire Line
	7100 4100 6650 4100
Text Label 8550 3700 2    50   ~ 0
HD1P
Wire Wire Line
	7100 4000 6650 4000
Text Label 6650 4100 0    50   ~ 0
HD2N
Wire Wire Line
	7100 4400 6650 4400
Text Label 6650 4000 0    50   ~ 0
HD2P
Wire Wire Line
	7100 4300 6650 4300
Text Label 8550 4100 2    50   ~ 0
HD3N
Wire Wire Line
	7100 4700 6650 4700
Text Label 8550 4000 2    50   ~ 0
HD3P
Wire Wire Line
	7100 4600 6650 4600
Text Label 6650 4400 0    50   ~ 0
HD4N
Wire Wire Line
	7100 5000 6650 5000
Text Label 6650 4300 0    50   ~ 0
HD4P
Wire Wire Line
	7100 4900 6650 4900
Text Label 8550 4400 2    50   ~ 0
HD5N
Wire Wire Line
	7100 5300 6650 5300
Text Label 8550 4300 2    50   ~ 0
HD5P
Wire Wire Line
	7100 5200 6650 5200
Text Label 6650 4700 0    50   ~ 0
HD6N
Wire Wire Line
	7100 5600 6650 5600
Text Label 6650 4600 0    50   ~ 0
HD6P
Wire Wire Line
	7100 5500 6650 5500
Text Label 8550 4700 2    50   ~ 0
HD7N
Wire Wire Line
	7100 5900 6650 5900
Text Label 8550 4600 2    50   ~ 0
HD7P
Wire Wire Line
	7100 5800 6650 5800
Text Label 6650 5000 0    50   ~ 0
HD8N
Text Label 6650 4900 0    50   ~ 0
HD8P
Wire Wire Line
	7100 6100 6650 6100
Text Label 8550 5000 2    50   ~ 0
HD9N
Text Label 8550 4900 2    50   ~ 0
HD9P
Wire Wire Line
	7100 6400 6650 6400
Text Label 6650 5300 0    50   ~ 0
HD10N
Text Label 6650 5200 0    50   ~ 0
HD10P
Wire Wire Line
	7100 7000 6650 7000
Text Label 8550 5300 2    50   ~ 0
HD11N
Text Label 8550 5200 2    50   ~ 0
HD11P
Wire Wire Line
	7100 7300 6650 7300
Text Label 6650 5600 0    50   ~ 0
HD12N
Wire Wire Line
	7100 7700 6650 7700
Text Label 6650 5500 0    50   ~ 0
HD12P
Wire Wire Line
	7100 7600 6650 7600
Text Label 8550 5600 2    50   ~ 0
HD13N
Wire Wire Line
	7100 8000 6650 8000
Text Label 8550 5500 2    50   ~ 0
HD13P
Wire Wire Line
	7100 7900 6650 7900
Text Label 6650 5900 0    50   ~ 0
HD14N
Wire Wire Line
	7100 8300 6650 8300
Text Label 6650 5800 0    50   ~ 0
HD14P
Wire Wire Line
	7100 8200 6650 8200
Text Label 8550 5900 2    50   ~ 0
HD15N
Wire Wire Line
	7100 8600 6650 8600
Text Label 8550 5800 2    50   ~ 0
HD15P
Wire Wire Line
	7100 8500 6650 8500
Text Label 6650 6200 0    50   ~ 0
HD16N
Wire Wire Line
	7100 8900 6650 8900
Text Label 6650 6100 0    50   ~ 0
HD16P
Wire Wire Line
	7100 8800 6650 8800
Text Label 8550 6200 2    50   ~ 0
HD17N
Wire Wire Line
	7100 9200 6650 9200
Text Label 8550 6100 2    50   ~ 0
HD17P
Wire Wire Line
	7100 9100 6650 9100
Text Label 6650 6500 0    50   ~ 0
HD18N
Wire Wire Line
	7100 9500 6650 9500
Text Label 6650 6400 0    50   ~ 0
HD18P
Wire Wire Line
	7100 9400 6650 9400
Text Label 8550 6500 2    50   ~ 0
HD19N
Wire Wire Line
	7100 9800 6650 9800
Text Label 8550 6400 2    50   ~ 0
HD19P
Wire Wire Line
	7100 9700 6650 9700
Text Label 6650 7100 0    50   ~ 0
HD20N
Wire Wire Line
	8100 7100 8550 7100
Text Label 6650 7000 0    50   ~ 0
HD20P
Wire Wire Line
	8100 7000 8550 7000
Text Label 8550 7100 2    50   ~ 0
HD21N
Wire Wire Line
	8100 7400 8550 7400
Text Label 8550 7000 2    50   ~ 0
HD21P
Wire Wire Line
	8100 7300 8550 7300
Text Label 6650 7400 0    50   ~ 0
HD22N
Wire Wire Line
	8100 7700 8550 7700
Text Label 6650 7300 0    50   ~ 0
HD22P
Wire Wire Line
	8100 7600 8550 7600
Text Label 8550 7400 2    50   ~ 0
HD23N
Wire Wire Line
	8100 8000 8550 8000
Text Label 8550 7300 2    50   ~ 0
HD23P
Wire Wire Line
	8100 7900 8550 7900
Text Label 6650 7700 0    50   ~ 0
HD24N
Wire Wire Line
	8100 8300 8550 8300
Text Label 6650 7600 0    50   ~ 0
HD24P
Wire Wire Line
	8100 8200 8550 8200
Text Label 8550 7700 2    50   ~ 0
HD25N
Wire Wire Line
	8100 8600 8550 8600
Text Label 8550 7600 2    50   ~ 0
HD25P
Wire Wire Line
	8100 8500 8550 8500
Text Label 6650 8000 0    50   ~ 0
HD26N
Wire Wire Line
	8100 8900 8550 8900
Text Label 6650 7900 0    50   ~ 0
HD26P
Wire Wire Line
	8100 8800 8550 8800
Text Label 8550 8000 2    50   ~ 0
HD27N
Wire Wire Line
	8100 9200 8550 9200
Text Label 8550 7900 2    50   ~ 0
HD27P
Wire Wire Line
	8100 9100 8550 9100
Text Label 6650 8300 0    50   ~ 0
HD28N
Wire Wire Line
	8100 9500 8550 9500
Text Label 6650 8200 0    50   ~ 0
HD28P
Wire Wire Line
	8100 9400 8550 9400
Text Label 8550 8200 2    50   ~ 0
HD29P
Wire Wire Line
	8100 9700 8550 9700
Text Label 8550 8300 2    50   ~ 0
HD29N
Wire Wire Line
	8100 3800 8550 3800
Text Label 6650 8500 0    50   ~ 0
HD30P
Wire Wire Line
	8100 3700 8550 3700
Text Label 6650 8600 0    50   ~ 0
HD30N
Wire Wire Line
	8100 4100 8550 4100
Text Label 8550 8500 2    50   ~ 0
HD31P
Wire Wire Line
	8100 4000 8550 4000
Text Label 8550 8600 2    50   ~ 0
HD31N
Wire Wire Line
	8100 4400 8550 4400
Text Label 6650 8800 0    50   ~ 0
HD32P
Wire Wire Line
	8100 4300 8550 4300
Text Label 6650 8900 0    50   ~ 0
HD32N
Wire Wire Line
	8100 4700 8550 4700
Text Label 8550 8800 2    50   ~ 0
HD33P
Wire Wire Line
	8100 4600 8550 4600
Text Label 8550 8900 2    50   ~ 0
HD33N
Wire Wire Line
	8100 5000 8550 5000
Text Label 6650 9100 0    50   ~ 0
HD34P
Wire Wire Line
	8100 4900 8550 4900
Text Label 6650 9200 0    50   ~ 0
HD34N
Wire Wire Line
	8100 5300 8550 5300
Text Label 8550 9100 2    50   ~ 0
HD35P
Wire Wire Line
	8100 5200 8550 5200
Text Label 8550 9200 2    50   ~ 0
HD35N
Wire Wire Line
	8100 5600 8550 5600
Text Label 6650 9400 0    50   ~ 0
HD36P
Wire Wire Line
	8100 5500 8550 5500
Text Label 6650 9500 0    50   ~ 0
HD36N
Wire Wire Line
	8100 5900 8550 5900
Text Label 8550 9400 2    50   ~ 0
HD37P
Wire Wire Line
	8100 5800 8550 5800
Text Label 8550 9500 2    50   ~ 0
HD37N
Wire Wire Line
	8100 6200 8550 6200
Text Label 6650 9700 0    50   ~ 0
HD38P
Wire Wire Line
	8100 6100 8550 6100
Text Label 8550 9700 2    50   ~ 0
HD39P
Wire Wire Line
	8100 6400 8550 6400
Wire Wire Line
	8100 6500 8550 6500
Text Label 6650 9800 0    50   ~ 0
HD38N
Wire Wire Line
	8100 9800 8550 9800
Text Label 8550 2900 2    50   ~ 0
HRX0N
Wire Wire Line
	8100 2900 8550 2900
Text Label 8550 2800 2    50   ~ 0
HRX0P
Wire Wire Line
	8100 2800 8550 2800
Text Label 8550 2700 2    50   ~ 0
HRX1N
Wire Wire Line
	8100 2700 8550 2700
Text Label 8550 2600 2    50   ~ 0
HRX1P
Wire Wire Line
	8100 2600 8550 2600
Text Label 8550 2500 2    50   ~ 0
HRX2N
Text Label 8550 2400 2    50   ~ 0
HRX2P
Text Label 8550 2300 2    50   ~ 0
HRX3N
Text Label 8550 2200 2    50   ~ 0
HRX3P
Wire Wire Line
	8100 2200 8550 2200
Text Label 8550 2100 2    50   ~ 0
HRX4N
Text Label 8550 2000 2    50   ~ 0
HRX4P
Wire Wire Line
	8100 2000 8550 2000
Text Label 8550 1900 2    50   ~ 0
HRX5N
Text Label 8550 1800 2    50   ~ 0
HRX5P
Wire Wire Line
	8100 1800 8550 1800
Text Label 8550 1700 2    50   ~ 0
HRX6N
Wire Wire Line
	8100 1700 8550 1700
Text Label 8550 1600 2    50   ~ 0
HRX6P
Wire Wire Line
	8100 1600 8550 1600
Text Label 8550 1500 2    50   ~ 0
HRX7N
Wire Wire Line
	8100 1500 8550 1500
Text Label 8550 1400 2    50   ~ 0
HRX7P
Wire Wire Line
	8100 1400 8550 1400
Text Label 8550 3000 2    50   ~ 0
HSCL_33
Wire Wire Line
	8100 3000 8550 3000
Text Label 6650 2900 0    50   ~ 0
HTX0N
Text Label 8550 9800 2    50   ~ 0
HD39N
Wire Wire Line
	6550 7200 6550 7500
Connection ~ 6550 7500
Wire Wire Line
	6550 7500 6550 7800
Connection ~ 6550 7800
Wire Wire Line
	6550 7800 6550 8100
Connection ~ 6550 8100
Wire Wire Line
	6550 8100 6550 8400
Connection ~ 6550 8400
Wire Wire Line
	6550 8400 6550 8700
Connection ~ 6550 8700
Wire Wire Line
	6550 8700 6550 9000
Connection ~ 6550 9000
Wire Wire Line
	6550 9000 6550 9300
Connection ~ 6550 9300
Wire Wire Line
	6550 9300 6550 9600
Connection ~ 6550 9600
Wire Wire Line
	6550 9600 6550 9900
Wire Wire Line
	8650 6600 8650 7200
Connection ~ 8650 7200
Wire Wire Line
	8650 7200 8650 7500
Connection ~ 8650 7500
Wire Wire Line
	8650 7500 8650 7800
Connection ~ 8650 7800
Wire Wire Line
	8650 7800 8650 8100
Connection ~ 8650 8100
Wire Wire Line
	8650 8100 8650 8400
Connection ~ 8650 8400
Wire Wire Line
	8650 8400 8650 8700
Connection ~ 8650 8700
Wire Wire Line
	8650 8700 8650 9000
Connection ~ 8650 9000
Wire Wire Line
	8650 9000 8650 9300
Connection ~ 8650 9300
Wire Wire Line
	8650 9300 8650 9600
$Sheet
S 4300 7650 800  400 
U 619D5072
F0 "sheet619D5072" 50
F1 "simple.sch" 50
F2 "REF" I L 4300 7800 50 
F3 "SW" I L 4300 7900 50 
F4 "OUT" O R 5100 7850 50 
$EndSheet
$Sheet
S 4300 4800 800  300 
U 619BE637
F0 "sheet619BE633" 50
F1 "advanced.sch" 50
F2 "SW" I L 4300 4950 50 
F3 "OUT" O R 5100 4950 50 
$EndSheet
$Sheet
S 4300 5600 800  300 
U 619D45F6
F0 "sheet619D45F2" 50
F1 "advanced.sch" 50
F2 "SW" I L 4300 5750 50 
F3 "OUT" O R 5100 5750 50 
$EndSheet
$Sheet
S 4300 6400 800  300 
U 619EA585
F0 "sheet619EA581" 50
F1 "advanced.sch" 50
F2 "SW" I L 4300 6550 50 
F3 "OUT" O R 5100 6550 50 
$EndSheet
NoConn ~ 7100 2600
NoConn ~ 7100 2700
NoConn ~ 7100 2800
NoConn ~ 7100 2900
NoConn ~ 7100 1800
NoConn ~ 7100 1900
NoConn ~ 7100 2000
NoConn ~ 7100 2100
NoConn ~ 7100 2200
NoConn ~ 7100 2300
NoConn ~ 8100 2600
NoConn ~ 8100 2700
NoConn ~ 8100 2800
NoConn ~ 8100 2900
NoConn ~ 7100 5600
NoConn ~ 7100 5800
NoConn ~ 7100 5900
NoConn ~ 7100 7600
NoConn ~ 7100 7700
NoConn ~ 7100 7900
NoConn ~ 7100 8000
NoConn ~ 7100 9700
NoConn ~ 7100 9800
NoConn ~ 7100 4900
NoConn ~ 8100 7400
NoConn ~ 7100 5000
NoConn ~ 7100 5200
NoConn ~ 7100 5300
NoConn ~ 7100 5500
NoConn ~ 8100 9700
NoConn ~ 8100 9800
$Comp
L power:PWR_FLAG #FLG0101
U 1 1 61E87936
P 8650 3900
F 0 "#FLG0101" H 8650 3975 50  0001 C CNN
F 1 "PWR_FLAG" V 8650 4028 50  0000 L CNN
F 2 "" H 8650 3900 50  0001 C CNN
F 3 "~" H 8650 3900 50  0001 C CNN
	1    8650 3900
	0    1    1    0   
$EndComp
$Comp
L power:PWR_FLAG #FLG0102
U 1 1 61E88B7E
P 6550 3900
F 0 "#FLG0102" H 6550 3975 50  0001 C CNN
F 1 "PWR_FLAG" V 6550 4027 50  0000 L CNN
F 2 "" H 6550 3900 50  0001 C CNN
F 3 "~" H 6550 3900 50  0001 C CNN
	1    6550 3900
	0    -1   -1   0   
$EndComp
$Comp
L power:PWR_FLAG #FLG0103
U 1 1 61E8AA28
P 6950 10150
F 0 "#FLG0103" H 6950 10225 50  0001 C CNN
F 1 "PWR_FLAG" V 6950 10277 50  0000 L CNN
F 2 "" H 6950 10150 50  0001 C CNN
F 3 "~" H 6950 10150 50  0001 C CNN
	1    6950 10150
	0    -1   -1   0   
$EndComp
Wire Wire Line
	1600 6100 1600 6050
Wire Wire Line
	1600 6050 1150 6050
Connection ~ 1600 6050
Wire Wire Line
	1600 6050 1600 6000
Connection ~ 1150 6050
Wire Wire Line
	1600 5750 1600 5800
$Comp
L power:PWR_FLAG #FLG0104
U 1 1 61EE8B65
P 1150 6050
F 0 "#FLG0104" H 1150 6125 50  0001 C CNN
F 1 "PWR_FLAG" H 1150 6223 50  0000 C CNN
F 2 "" H 1150 6050 50  0001 C CNN
F 3 "~" H 1150 6050 50  0001 C CNN
	1    1150 6050
	1    0    0    -1  
$EndComp
Text Label 10400 5000 0    50   ~ 0
HD32P
Text Label 10400 4900 0    50   ~ 0
HD34N
Wire Wire Line
	10850 5000 10400 5000
Wire Wire Line
	10850 4900 10400 4900
Wire Wire Line
	10850 5250 10400 5250
Wire Wire Line
	10850 5150 10400 5150
Wire Wire Line
	10850 5450 10400 5450
Wire Wire Line
	10850 5350 10400 5350
Wire Wire Line
	10850 5700 10400 5700
Wire Wire Line
	10850 5600 10400 5600
Wire Wire Line
	10850 5900 10400 5900
Wire Wire Line
	10850 5800 10400 5800
Wire Wire Line
	10850 6150 10400 6150
Wire Wire Line
	10850 6050 10400 6050
Text Label 10400 6250 0    50   ~ 0
HD29P
Wire Wire Line
	10850 6350 10400 6350
Wire Wire Line
	10850 6250 10400 6250
Text Label 12600 5500 2    50   ~ 0
HD28N
Text Label 12600 5400 2    50   ~ 0
HD30P
Wire Wire Line
	12150 5500 12600 5500
Wire Wire Line
	12150 5400 12600 5400
Text Label 12600 5700 2    50   ~ 0
HD30N
Text Label 12600 5600 2    50   ~ 0
HD28P
Wire Wire Line
	12150 5600 12600 5600
Wire Wire Line
	12150 5700 12600 5700
$Comp
L 74xx:74LS125 U?
U 1 1 61D61522
P 3550 4150
AR Path="/61833839/61D61522" Ref="U?"  Part="1" 
AR Path="/622F77ED/61D61522" Ref="U?"  Part="1" 
AR Path="/61D61522" Ref="U103"  Part="1" 
F 0 "U103" H 3550 4467 50  0000 C CNN
F 1 "74HC125D" H 3550 4376 50  0000 C CNN
F 2 "Package_SO:SOIC-14_3.9x8.7mm_P1.27mm" H 3550 4150 50  0001 C CNN
F 3 "https://assets.nexperia.com/documents/data-sheet/74HC_HCT125.pdf" H 3550 4150 50  0001 C CNN
	1    3550 4150
	1    0    0    -1  
$EndComp
Wire Wire Line
	5100 4150 5550 4150
Text Label 2800 6550 0    50   ~ 0
HD0P
Wire Wire Line
	3250 4150 2800 4150
Wire Wire Line
	5100 4950 5550 4950
Wire Wire Line
	3250 4950 2800 4950
Text Label 2800 4950 0    50   ~ 0
HD3P
Wire Wire Line
	5100 5750 5550 5750
Wire Wire Line
	3250 5750 2800 5750
Text Label 2800 4150 0    50   ~ 0
HD7P
Wire Wire Line
	3250 6550 2800 6550
Text Label 2800 5750 0    50   ~ 0
HD6P
Wire Wire Line
	5100 6550 5550 6550
Wire Wire Line
	4300 7250 3850 7250
Wire Wire Line
	4300 7150 3850 7150
Text Label 3850 7250 0    50   ~ 0
HD17N
Text Label 3850 7150 0    50   ~ 0
HD17P
Wire Wire Line
	4300 7900 3850 7900
Wire Wire Line
	4300 7800 3850 7800
Text Label 3850 7900 0    50   ~ 0
HD19N
Text Label 3850 7800 0    50   ~ 0
HD19P
Wire Wire Line
	5100 7850 5550 7850
Wire Wire Line
	5100 7200 5550 7200
$Comp
L hsmc:ASP-122952-01_odd_even J101
U 1 1 61AF9614
P 7600 5550
AR Path="/61AF9614" Ref="J101"  Part="1" 
AR Path="/61A3FEC3/61AF9614" Ref="J?"  Part="1" 
F 0 "J101" H 7650 9800 50  0000 R CNN
F 1 "ASP-122952-01" V 7600 5900 50  0000 R CNN
F 2 "hsmc:ASP12295201" H 8450 5650 50  0001 L CNN
F 3 "https://www.arrow.com/en/products/asp-122952-01/samtec" H 8450 5550 50  0001 L CNN
F 4 "Samtec ASP Series 0.5mm Pitch 160 Way 2 Row Straight PCB Socket, Surface Mount, Solder Termination" H 8450 5450 50  0001 L CNN "Description"
F 5 "4.35" H 8450 5350 50  0001 L CNN "Height"
F 6 "200-ASP-122952-01" H 8450 5250 50  0001 L CNN "Mouser Part Number"
F 7 "https://www.mouser.co.uk/ProductDetail/Samtec/ASP-122952-01/?qs=UXgszm6BlbG4MEUfvrbw%252BA%3D%3D" H 8450 5150 50  0001 L CNN "Mouser Price/Stock"
F 8 "SAMTEC" H 8450 5050 50  0001 L CNN "Manufacturer_Name"
F 9 "ASP-122952-01" H 8450 4950 50  0001 L CNN "Manufacturer_Part_Number"
	1    7600 5550
	1    0    0    -1  
$EndComp
Wire Wire Line
	10850 2600 10400 2600
Wire Wire Line
	10850 2500 10400 2500
Text Label 10400 2600 0    50   ~ 0
HD20P
Text Label 10400 2500 0    50   ~ 0
HD21P
Wire Wire Line
	10850 2850 10400 2850
Wire Wire Line
	10850 2750 10400 2750
Text Label 10400 2850 0    50   ~ 0
HD22P
Text Label 10400 2750 0    50   ~ 0
HD23P
Wire Wire Line
	10850 3150 10400 3150
Wire Wire Line
	10850 3050 10400 3050
Wire Wire Line
	10850 3350 10400 3350
Wire Wire Line
	10850 3250 10400 3250
Text Label 10400 4800 0    50   ~ 0
HD32N
Text Label 10400 4700 0    50   ~ 0
HD34P
Wire Wire Line
	10850 4800 10400 4800
Wire Wire Line
	10850 4700 10400 4700
NoConn ~ 8100 7100
$Comp
L Mechanical:MountingHole H103
U 1 1 629687DF
P 4750 9500
AR Path="/629687DF" Ref="H103"  Part="1" 
AR Path="/61A3FEC3/629687DF" Ref="H?"  Part="1" 
F 0 "H103" H 4850 9546 50  0000 L CNN
F 1 "MountingHole" H 4850 9455 50  0000 L CNN
F 2 "MountingHole:MountingHole_3.2mm_M3" H 4750 9500 50  0001 C CNN
F 3 "~" H 4750 9500 50  0001 C CNN
	1    4750 9500
	1    0    0    -1  
$EndComp
$Comp
L Mechanical:MountingHole H104
U 1 1 62969587
P 4750 9700
AR Path="/62969587" Ref="H104"  Part="1" 
AR Path="/61A3FEC3/62969587" Ref="H?"  Part="1" 
F 0 "H104" H 4850 9746 50  0000 L CNN
F 1 "MountingHole" H 4850 9655 50  0000 L CNN
F 2 "MountingHole:MountingHole_3.2mm_M3" H 4750 9700 50  0001 C CNN
F 3 "~" H 4750 9700 50  0001 C CNN
	1    4750 9700
	1    0    0    -1  
$EndComp
$Comp
L Mechanical:MountingHole H105
U 1 1 62969B13
P 4750 9900
AR Path="/62969B13" Ref="H105"  Part="1" 
AR Path="/61A3FEC3/62969B13" Ref="H?"  Part="1" 
F 0 "H105" H 4850 9946 50  0000 L CNN
F 1 "MountingHole" H 4850 9855 50  0000 L CNN
F 2 "MountingHole:MountingHole_3.2mm_M3" H 4750 9900 50  0001 C CNN
F 3 "~" H 4750 9900 50  0001 C CNN
	1    4750 9900
	1    0    0    -1  
$EndComp
$Comp
L Mechanical:MountingHole H106
U 1 1 62969E7F
P 4750 10100
AR Path="/62969E7F" Ref="H106"  Part="1" 
AR Path="/61A3FEC3/62969E7F" Ref="H?"  Part="1" 
F 0 "H106" H 4850 10146 50  0000 L CNN
F 1 "MountingHole" H 4850 10055 50  0000 L CNN
F 2 "MountingHole:MountingHole_3.2mm_M3" H 4750 10100 50  0001 C CNN
F 3 "~" H 4750 10100 50  0001 C CNN
	1    4750 10100
	1    0    0    -1  
$EndComp
Connection ~ 3550 2250
$Comp
L Amplifier_Operational:MCP6001-OT U104
U 1 1 6190A3D4
P 1600 8600
AR Path="/6190A3D4" Ref="U104"  Part="1" 
AR Path="/617B514C/6190A3D4" Ref="U?"  Part="1" 
AR Path="/619065BF/6190A3D4" Ref="U?"  Part="1" 
AR Path="/61908BA4/6190A3D4" Ref="U?"  Part="1" 
AR Path="/6192AB24/6190A3D4" Ref="U?"  Part="1" 
AR Path="/619332FF/6190A3D4" Ref="U?"  Part="1" 
AR Path="/619B691C/6190A3D4" Ref="U?"  Part="1" 
AR Path="/619BF925/6190A3D4" Ref="U?"  Part="1" 
AR Path="/619C8940/6190A3D4" Ref="U?"  Part="1" 
AR Path="/619BE637/6190A3D4" Ref="U?"  Part="1" 
AR Path="/619D45F6/6190A3D4" Ref="U?"  Part="1" 
AR Path="/619EA585/6190A3D4" Ref="U?"  Part="1" 
F 0 "U104" H 1150 8600 50  0000 L CNN
F 1 "ADA4084-1ARJZ-R2" H 1200 7650 50  0000 L CNN
F 2 "Package_TO_SOT_SMD:SOT-23-5" H 1500 8400 50  0001 L CNN
F 3 "https://www.analog.com/media/en/technical-documentation/data-sheets/ADA4084-1_4084-2_4084-4.pdf" H 1600 8800 50  0001 C CNN
	1    1600 8600
	1    0    0    -1  
$EndComp
$Comp
L Device:C_Small C113
U 1 1 6190A3E0
P 1600 8300
AR Path="/6190A3E0" Ref="C113"  Part="1" 
AR Path="/617B514C/6190A3E0" Ref="C?"  Part="1" 
AR Path="/619065BF/6190A3E0" Ref="C?"  Part="1" 
AR Path="/61908BA4/6190A3E0" Ref="C?"  Part="1" 
AR Path="/6192AB24/6190A3E0" Ref="C?"  Part="1" 
AR Path="/619332FF/6190A3E0" Ref="C?"  Part="1" 
AR Path="/619B691C/6190A3E0" Ref="C?"  Part="1" 
AR Path="/619BF925/6190A3E0" Ref="C?"  Part="1" 
AR Path="/619C8940/6190A3E0" Ref="C?"  Part="1" 
AR Path="/619BE637/6190A3E0" Ref="C?"  Part="1" 
AR Path="/619D45F6/6190A3E0" Ref="C?"  Part="1" 
AR Path="/619EA585/6190A3E0" Ref="C?"  Part="1" 
F 0 "C113" V 1600 8100 50  0000 C CNN
F 1 "100p" V 1600 8600 50  0000 C CNN
F 2 "Capacitor_SMD:C_0805_2012Metric" H 1600 8300 50  0001 C CNN
F 3 "~" H 1600 8300 50  0001 C CNN
	1    1600 8300
	0    1    1    0   
$EndComp
$Comp
L Device:C_Small C111
U 1 1 6190A3E6
P 1600 8000
AR Path="/6190A3E6" Ref="C111"  Part="1" 
AR Path="/617B514C/6190A3E6" Ref="C?"  Part="1" 
AR Path="/619065BF/6190A3E6" Ref="C?"  Part="1" 
AR Path="/61908BA4/6190A3E6" Ref="C?"  Part="1" 
AR Path="/6192AB24/6190A3E6" Ref="C?"  Part="1" 
AR Path="/619332FF/6190A3E6" Ref="C?"  Part="1" 
AR Path="/619B691C/6190A3E6" Ref="C?"  Part="1" 
AR Path="/619BF925/6190A3E6" Ref="C?"  Part="1" 
AR Path="/619C8940/6190A3E6" Ref="C?"  Part="1" 
AR Path="/619BE637/6190A3E6" Ref="C?"  Part="1" 
AR Path="/619D45F6/6190A3E6" Ref="C?"  Part="1" 
AR Path="/619EA585/6190A3E6" Ref="C?"  Part="1" 
F 0 "C111" V 1600 7800 50  0000 C CNN
F 1 "100n" V 1600 8300 50  0000 C CNN
F 2 "Capacitor_SMD:C_0805_2012Metric" H 1600 8000 50  0001 C CNN
F 3 "~" H 1600 8000 50  0001 C CNN
	1    1600 8000
	0    1    1    0   
$EndComp
$Comp
L Device:C_Small C112
U 1 1 6190A3EC
P 1600 8150
AR Path="/6190A3EC" Ref="C112"  Part="1" 
AR Path="/617B514C/6190A3EC" Ref="C?"  Part="1" 
AR Path="/619065BF/6190A3EC" Ref="C?"  Part="1" 
AR Path="/61908BA4/6190A3EC" Ref="C?"  Part="1" 
AR Path="/6192AB24/6190A3EC" Ref="C?"  Part="1" 
AR Path="/619332FF/6190A3EC" Ref="C?"  Part="1" 
AR Path="/619B691C/6190A3EC" Ref="C?"  Part="1" 
AR Path="/619BF925/6190A3EC" Ref="C?"  Part="1" 
AR Path="/619C8940/6190A3EC" Ref="C?"  Part="1" 
AR Path="/619BE637/6190A3EC" Ref="C?"  Part="1" 
AR Path="/619D45F6/6190A3EC" Ref="C?"  Part="1" 
AR Path="/619EA585/6190A3EC" Ref="C?"  Part="1" 
F 0 "C112" V 1600 7950 50  0000 C CNN
F 1 "10n" V 1600 8450 50  0000 C CNN
F 2 "Capacitor_SMD:C_0805_2012Metric" H 1600 8150 50  0001 C CNN
F 3 "~" H 1600 8150 50  0001 C CNN
	1    1600 8150
	0    1    1    0   
$EndComp
Wire Wire Line
	1500 8300 1500 8150
Connection ~ 1500 8300
Connection ~ 1500 8150
Wire Wire Line
	1500 8150 1500 8000
$Comp
L power:GND #PWR?
U 1 1 6190A3FB
P 1500 9150
AR Path="/619C8940/6190A3FB" Ref="#PWR?"  Part="1" 
AR Path="/619BF925/6190A3FB" Ref="#PWR?"  Part="1" 
AR Path="/617B514C/6190A3FB" Ref="#PWR?"  Part="1" 
AR Path="/619BE637/6190A3FB" Ref="#PWR?"  Part="1" 
AR Path="/619D45F6/6190A3FB" Ref="#PWR?"  Part="1" 
AR Path="/619EA585/6190A3FB" Ref="#PWR?"  Part="1" 
AR Path="/6190A3FB" Ref="#PWR0124"  Part="1" 
F 0 "#PWR0124" H 1500 8900 50  0001 C CNN
F 1 "GND" H 1505 8977 50  0000 C CNN
F 2 "" H 1500 9150 50  0001 C CNN
F 3 "" H 1500 9150 50  0001 C CNN
	1    1500 9150
	1    0    0    -1  
$EndComp
$Comp
L power:+5V #PWR?
U 1 1 6190A401
P 1500 8000
AR Path="/619C8940/6190A401" Ref="#PWR?"  Part="1" 
AR Path="/619BF925/6190A401" Ref="#PWR?"  Part="1" 
AR Path="/617B514C/6190A401" Ref="#PWR?"  Part="1" 
AR Path="/619BE637/6190A401" Ref="#PWR?"  Part="1" 
AR Path="/619D45F6/6190A401" Ref="#PWR?"  Part="1" 
AR Path="/619EA585/6190A401" Ref="#PWR?"  Part="1" 
AR Path="/6190A401" Ref="#PWR0123"  Part="1" 
F 0 "#PWR0123" H 1500 7850 50  0001 C CNN
F 1 "+5V" H 1515 8173 50  0000 C CNN
F 2 "" H 1500 8000 50  0001 C CNN
F 3 "" H 1500 8000 50  0001 C CNN
	1    1500 8000
	1    0    0    -1  
$EndComp
Connection ~ 1500 8000
Wire Wire Line
	1500 8900 1500 9150
$Comp
L Device:R_Small R?
U 1 1 619598B7
P 950 8850
AR Path="/61833839/619598B7" Ref="R?"  Part="1" 
AR Path="/622F77ED/619598B7" Ref="R?"  Part="1" 
AR Path="/619598B7" Ref="R102"  Part="1" 
F 0 "R102" V 754 8850 50  0000 C CNN
F 1 "47k 0.1%" V 850 8800 50  0000 C CNN
F 2 "Resistor_SMD:R_0805_2012Metric" H 950 8850 50  0001 C CNN
F 3 "http://industrial.panasonic.com/cdbs/www-data/pdf/RDM0000/AOA0000C307.pdf" H 950 8850 50  0001 C CNN
F 4 "ERA6ARW473V" V 950 8850 50  0001 C CNN "PN"
	1    950  8850
	0    -1   -1   0   
$EndComp
$Comp
L Device:R_Small R?
U 1 1 619598C9
P 2100 8600
AR Path="/61833839/619598C9" Ref="R?"  Part="1" 
AR Path="/622F77ED/619598C9" Ref="R?"  Part="1" 
AR Path="/619598C9" Ref="R104"  Part="1" 
F 0 "R104" V 1904 8600 50  0000 C CNN
F 1 "2k2" V 1995 8600 50  0000 C CNN
F 2 "Resistor_SMD:R_0805_2012Metric" H 2100 8600 50  0001 C CNN
F 3 "~" H 2100 8600 50  0001 C CNN
	1    2100 8600
	0    1    1    0   
$EndComp
Wire Wire Line
	850  8850 800  8850
Wire Wire Line
	800  8850 800  9150
Wire Wire Line
	2200 8850 2500 8850
Wire Wire Line
	2500 8850 2500 8800
Wire Wire Line
	1300 8500 800  8500
$Comp
L Device:C_Small C115
U 1 1 619598E5
P 2950 9050
AR Path="/619598E5" Ref="C115"  Part="1" 
AR Path="/622F77ED/619598E5" Ref="C?"  Part="1" 
F 0 "C115" H 3042 9004 50  0000 L CNN
F 1 "10u/16" H 3042 9095 50  0000 L CNN
F 2 "Capacitor_SMD:C_0805_2012Metric" H 2950 9050 50  0001 C CNN
F 3 "https://cz.mouser.com/datasheet/2/396/mlcc02_e-1307760.pdf" H 2950 9050 50  0001 C CNN
	1    2950 9050
	1    0    0    1   
$EndComp
$Comp
L Device:C_Small C114
U 1 1 619598EB
P 2800 9050
AR Path="/619598EB" Ref="C114"  Part="1" 
AR Path="/622F77ED/619598EB" Ref="C?"  Part="1" 
F 0 "C114" H 2708 9004 50  0000 R CNN
F 1 "10u/16" H 2708 9095 50  0000 R CNN
F 2 "Capacitor_SMD:C_0805_2012Metric" H 2800 9050 50  0001 C CNN
F 3 "https://cz.mouser.com/datasheet/2/396/mlcc02_e-1307760.pdf" H 2800 9050 50  0001 C CNN
	1    2800 9050
	1    0    0    1   
$EndComp
Wire Wire Line
	2800 8950 2800 8850
Wire Wire Line
	2800 8850 2950 8850
Wire Wire Line
	2950 8950 2950 8850
Wire Wire Line
	2950 9150 2950 9250
Wire Wire Line
	2800 9150 2800 9250
Wire Wire Line
	2500 8850 2800 8850
Connection ~ 2800 8850
Connection ~ 2500 8850
$Comp
L power:PWR_FLAG #FLG?
U 1 1 619598F9
P 3550 8850
AR Path="/622F77ED/619598F9" Ref="#FLG?"  Part="1" 
AR Path="/619598F9" Ref="#FLG0108"  Part="1" 
F 0 "#FLG0108" H 3550 8925 50  0001 C CNN
F 1 "PWR_FLAG" V 3550 8978 50  0000 L CNN
F 2 "" H 3550 8850 50  0001 C CNN
F 3 "~" H 3550 8850 50  0001 C CNN
	1    3550 8850
	0    1    1    0   
$EndComp
Connection ~ 2950 8850
$Comp
L Device:R_Small R?
U 1 1 61959900
P 1800 9000
AR Path="/61833839/61959900" Ref="R?"  Part="1" 
AR Path="/622F77ED/61959900" Ref="R?"  Part="1" 
AR Path="/61959900" Ref="R103"  Part="1" 
F 0 "R103" V 1904 9000 50  0000 C CNN
F 1 "220k" V 1995 9000 50  0000 C CNN
F 2 "Resistor_SMD:R_0805_2012Metric" H 1800 9000 50  0001 C CNN
F 3 "~" H 1800 9000 50  0001 C CNN
	1    1800 9000
	0    1    1    0   
$EndComp
$Comp
L Device:C_Small C110
U 1 1 61959906
P 1350 9000
AR Path="/61959906" Ref="C110"  Part="1" 
AR Path="/61833839/61959906" Ref="C?"  Part="1" 
AR Path="/622F77ED/61959906" Ref="C?"  Part="1" 
F 0 "C110" V 1487 9000 50  0000 C CNN
F 1 "100p" V 1578 9000 50  0000 C CNN
F 2 "Capacitor_SMD:C_0805_2012Metric" H 1350 9000 50  0001 C CNN
F 3 "~" H 1350 9000 50  0001 C CNN
	1    1350 9000
	0    1    1    0   
$EndComp
Wire Wire Line
	1450 9000 1700 9000
Wire Wire Line
	2000 8600 1950 8600
Wire Wire Line
	1900 9000 1950 9000
Wire Wire Line
	1950 9000 1950 8600
Connection ~ 1950 8600
Wire Wire Line
	1950 8600 1900 8600
Wire Wire Line
	3550 8850 3450 8850
Connection ~ 3450 8850
$Comp
L Device:R_Small R106
U 1 1 61959929
P 3450 9150
AR Path="/61959929" Ref="R106"  Part="1" 
AR Path="/622F77ED/61959929" Ref="R?"  Part="1" 
F 0 "R106" H 3509 9196 50  0000 L CNN
F 1 "820R" H 3509 9105 50  0000 L CNN
F 2 "Resistor_SMD:R_0805_2012Metric" H 3450 9150 50  0001 C CNN
F 3 "~" H 3450 9150 50  0001 C CNN
	1    3450 9150
	1    0    0    -1  
$EndComp
$Comp
L Device:LED_Small D101
U 1 1 6195992F
P 3450 8950
AR Path="/6195992F" Ref="D101"  Part="1" 
AR Path="/622F77ED/6195992F" Ref="D?"  Part="1" 
F 0 "D101" V 3496 8880 50  0000 R CNN
F 1 "597-5111-407F" V 3405 8880 50  0000 R CNN
F 2 "LED_SMD:LED_0805_2012Metric" V 3450 8950 50  0001 C CNN
F 3 "https://www.farnell.com/datasheets/25817.pdf" V 3450 8950 50  0001 C CNN
	1    3450 8950
	0    -1   -1   0   
$EndComp
$Comp
L Device:R_Small R?
U 1 1 6197D0AE
P 2100 8850
AR Path="/61833839/6197D0AE" Ref="R?"  Part="1" 
AR Path="/622F77ED/6197D0AE" Ref="R?"  Part="1" 
AR Path="/6197D0AE" Ref="R105"  Part="1" 
F 0 "R105" V 1904 8850 50  0000 C CNN
F 1 "47k 0.1%" V 2000 8800 50  0000 C CNN
F 2 "Resistor_SMD:R_0805_2012Metric" H 2100 8850 50  0001 C CNN
F 3 "http://industrial.panasonic.com/cdbs/www-data/pdf/RDM0000/AOA0000C307.pdf" H 2100 8850 50  0001 C CNN
F 4 "ERA6ARW473V" V 2100 8850 50  0001 C CNN "PN"
	1    2100 8850
	0    -1   -1   0   
$EndComp
$Comp
L Transistor_BJT:BC817 Q?
U 1 1 619598C3
P 2400 8600
AR Path="/622F77ED/619598C3" Ref="Q?"  Part="1" 
AR Path="/619598C3" Ref="Q101"  Part="1" 
F 0 "Q101" H 2591 8646 50  0000 L CNN
F 1 "BC817" H 2591 8555 50  0000 L CNN
F 2 "Package_TO_SOT_SMD:SOT-23" H 2600 8525 50  0001 L CIN
F 3 "https://www.onsemi.com/pub/Collateral/BC818-D.pdf" H 2400 8600 50  0001 L CNN
	1    2400 8600
	1    0    0    -1  
$EndComp
Wire Wire Line
	2950 8850 3250 8850
Connection ~ 3250 8850
Wire Wire Line
	3250 8850 3450 8850
$Comp
L power:+5V #PWR0126
U 1 1 6197EF7D
P 2500 8400
F 0 "#PWR0126" H 2500 8250 50  0001 C CNN
F 1 "+5V" H 2500 8550 50  0000 C CNN
F 2 "" H 2500 8400 50  0001 C CNN
F 3 "" H 2500 8400 50  0001 C CNN
	1    2500 8400
	1    0    0    -1  
$EndComp
Wire Wire Line
	1050 8850 1200 8850
Wire Wire Line
	1250 9000 1200 9000
Wire Wire Line
	1200 9000 1200 8850
Wire Wire Line
	1200 8700 1300 8700
Connection ~ 1200 8850
Wire Wire Line
	1200 8850 2000 8850
Wire Wire Line
	1200 8850 1200 8700
Wire Wire Line
	1700 8000 1700 8150
Connection ~ 1700 8150
Wire Wire Line
	1700 8150 1700 8300
$Comp
L power:GND #PWR?
U 1 1 61AA6D86
P 1700 8300
AR Path="/619C8940/61AA6D86" Ref="#PWR?"  Part="1" 
AR Path="/619BF925/61AA6D86" Ref="#PWR?"  Part="1" 
AR Path="/617B514C/61AA6D86" Ref="#PWR?"  Part="1" 
AR Path="/619BE637/61AA6D86" Ref="#PWR?"  Part="1" 
AR Path="/619D45F6/61AA6D86" Ref="#PWR?"  Part="1" 
AR Path="/619EA585/61AA6D86" Ref="#PWR?"  Part="1" 
AR Path="/61AA6D86" Ref="#PWR0125"  Part="1" 
F 0 "#PWR0125" H 1700 8050 50  0001 C CNN
F 1 "GND" H 1705 8127 50  0000 C CNN
F 2 "" H 1700 8300 50  0001 C CNN
F 3 "" H 1700 8300 50  0001 C CNN
	1    1700 8300
	1    0    0    -1  
$EndComp
Connection ~ 1700 8300
$Comp
L power:GND #PWR?
U 1 1 61B0AEE6
P 800 9150
AR Path="/619C8940/61B0AEE6" Ref="#PWR?"  Part="1" 
AR Path="/619BF925/61B0AEE6" Ref="#PWR?"  Part="1" 
AR Path="/617B514C/61B0AEE6" Ref="#PWR?"  Part="1" 
AR Path="/619BE637/61B0AEE6" Ref="#PWR?"  Part="1" 
AR Path="/619D45F6/61B0AEE6" Ref="#PWR?"  Part="1" 
AR Path="/619EA585/61B0AEE6" Ref="#PWR?"  Part="1" 
AR Path="/61B0AEE6" Ref="#PWR0110"  Part="1" 
F 0 "#PWR0110" H 800 8900 50  0001 C CNN
F 1 "GND" H 805 8977 50  0000 C CNN
F 2 "" H 800 9150 50  0001 C CNN
F 3 "" H 800 9150 50  0001 C CNN
	1    800  9150
	1    0    0    -1  
$EndComp
$Comp
L power:GND #PWR?
U 1 1 61B2F097
P 2800 9250
AR Path="/619C8940/61B2F097" Ref="#PWR?"  Part="1" 
AR Path="/619BF925/61B2F097" Ref="#PWR?"  Part="1" 
AR Path="/617B514C/61B2F097" Ref="#PWR?"  Part="1" 
AR Path="/619BE637/61B2F097" Ref="#PWR?"  Part="1" 
AR Path="/619D45F6/61B2F097" Ref="#PWR?"  Part="1" 
AR Path="/619EA585/61B2F097" Ref="#PWR?"  Part="1" 
AR Path="/61B2F097" Ref="#PWR0127"  Part="1" 
F 0 "#PWR0127" H 2800 9000 50  0001 C CNN
F 1 "GND" H 2805 9077 50  0000 C CNN
F 2 "" H 2800 9250 50  0001 C CNN
F 3 "" H 2800 9250 50  0001 C CNN
	1    2800 9250
	1    0    0    -1  
$EndComp
$Comp
L power:GND #PWR?
U 1 1 61B2F310
P 2950 9250
AR Path="/619C8940/61B2F310" Ref="#PWR?"  Part="1" 
AR Path="/619BF925/61B2F310" Ref="#PWR?"  Part="1" 
AR Path="/617B514C/61B2F310" Ref="#PWR?"  Part="1" 
AR Path="/619BE637/61B2F310" Ref="#PWR?"  Part="1" 
AR Path="/619D45F6/61B2F310" Ref="#PWR?"  Part="1" 
AR Path="/619EA585/61B2F310" Ref="#PWR?"  Part="1" 
AR Path="/61B2F310" Ref="#PWR0128"  Part="1" 
F 0 "#PWR0128" H 2950 9000 50  0001 C CNN
F 1 "GND" H 2955 9077 50  0000 C CNN
F 2 "" H 2950 9250 50  0001 C CNN
F 3 "" H 2950 9250 50  0001 C CNN
	1    2950 9250
	1    0    0    -1  
$EndComp
$Comp
L power:GND #PWR?
U 1 1 61B2F3FB
P 3450 9250
AR Path="/619C8940/61B2F3FB" Ref="#PWR?"  Part="1" 
AR Path="/619BF925/61B2F3FB" Ref="#PWR?"  Part="1" 
AR Path="/617B514C/61B2F3FB" Ref="#PWR?"  Part="1" 
AR Path="/619BE637/61B2F3FB" Ref="#PWR?"  Part="1" 
AR Path="/619D45F6/61B2F3FB" Ref="#PWR?"  Part="1" 
AR Path="/619EA585/61B2F3FB" Ref="#PWR?"  Part="1" 
AR Path="/61B2F3FB" Ref="#PWR0129"  Part="1" 
F 0 "#PWR0129" H 3450 9000 50  0001 C CNN
F 1 "GND" H 3455 9077 50  0000 C CNN
F 2 "" H 3450 9250 50  0001 C CNN
F 3 "" H 3450 9250 50  0001 C CNN
	1    3450 9250
	1    0    0    -1  
$EndComp
Text Label 9850 7750 0    50   ~ 0
HCKO0
Wire Wire Line
	10400 7750 10200 7750
Text Label 9850 7650 0    50   ~ 0
HTDO_33
Wire Wire Line
	10400 7650 9850 7650
Text Label 9850 7550 0    50   ~ 0
HTCK_33
Wire Wire Line
	10400 7550 9850 7550
Text Label 9850 7450 0    50   ~ 0
HSDA_33
Wire Wire Line
	10400 7450 9850 7450
Text Label 13300 7750 2    50   ~ 0
HCKI0
Wire Wire Line
	12700 7750 12950 7750
Text Label 13300 7650 2    50   ~ 0
HTDI_33
Wire Wire Line
	12700 7650 13300 7650
Text Label 13300 7550 2    50   ~ 0
HTMS_33
Wire Wire Line
	12700 7550 13300 7550
Text Label 13300 7450 2    50   ~ 0
HSCL_33
Wire Wire Line
	12700 7450 13300 7450
$Comp
L Device:R_Small R?
U 1 1 61926AE2
P 10500 7450
AR Path="/61833839/61926AE2" Ref="R?"  Part="1" 
AR Path="/622F77ED/61926AE2" Ref="R?"  Part="1" 
AR Path="/61926AE2" Ref="R107"  Part="1" 
F 0 "R107" V 10450 7650 50  0000 C CNN
F 1 "100R" V 10450 7250 50  0000 C CNN
F 2 "Resistor_SMD:R_0805_2012Metric" H 10500 7450 50  0001 C CNN
F 3 "~" H 10500 7450 50  0001 C CNN
	1    10500 7450
	0    1    1    0   
$EndComp
$Comp
L Device:R_Small R?
U 1 1 61927CA6
P 10500 7550
AR Path="/61833839/61927CA6" Ref="R?"  Part="1" 
AR Path="/622F77ED/61927CA6" Ref="R?"  Part="1" 
AR Path="/61927CA6" Ref="R108"  Part="1" 
F 0 "R108" V 10450 7750 50  0000 C CNN
F 1 "100R" V 10450 7350 50  0000 C CNN
F 2 "Resistor_SMD:R_0805_2012Metric" H 10500 7550 50  0001 C CNN
F 3 "~" H 10500 7550 50  0001 C CNN
	1    10500 7550
	0    1    1    0   
$EndComp
$Comp
L Device:R_Small R?
U 1 1 61927FC7
P 10500 7650
AR Path="/61833839/61927FC7" Ref="R?"  Part="1" 
AR Path="/622F77ED/61927FC7" Ref="R?"  Part="1" 
AR Path="/61927FC7" Ref="R109"  Part="1" 
F 0 "R109" V 10450 7850 50  0000 C CNN
F 1 "100R" V 10450 7450 50  0000 C CNN
F 2 "Resistor_SMD:R_0805_2012Metric" H 10500 7650 50  0001 C CNN
F 3 "~" H 10500 7650 50  0001 C CNN
	1    10500 7650
	0    1    1    0   
$EndComp
$Comp
L Device:R_Small R?
U 1 1 61928289
P 10500 7750
AR Path="/61833839/61928289" Ref="R?"  Part="1" 
AR Path="/622F77ED/61928289" Ref="R?"  Part="1" 
AR Path="/61928289" Ref="R110"  Part="1" 
F 0 "R110" V 10450 7950 50  0000 C CNN
F 1 "2k2" V 10450 7550 50  0000 C CNN
F 2 "Resistor_SMD:R_0805_2012Metric" H 10500 7750 50  0001 C CNN
F 3 "~" H 10500 7750 50  0001 C CNN
	1    10500 7750
	0    1    1    0   
$EndComp
$Comp
L Device:R_Small R?
U 1 1 61999D54
P 12600 7450
AR Path="/61833839/61999D54" Ref="R?"  Part="1" 
AR Path="/622F77ED/61999D54" Ref="R?"  Part="1" 
AR Path="/61999D54" Ref="R115"  Part="1" 
F 0 "R115" V 12550 7650 50  0000 C CNN
F 1 "100R" V 12550 7250 50  0000 C CNN
F 2 "Resistor_SMD:R_0805_2012Metric" H 12600 7450 50  0001 C CNN
F 3 "~" H 12600 7450 50  0001 C CNN
	1    12600 7450
	0    1    1    0   
$EndComp
$Comp
L Device:R_Small R?
U 1 1 6199A4AE
P 12600 7550
AR Path="/61833839/6199A4AE" Ref="R?"  Part="1" 
AR Path="/622F77ED/6199A4AE" Ref="R?"  Part="1" 
AR Path="/6199A4AE" Ref="R116"  Part="1" 
F 0 "R116" V 12550 7750 50  0000 C CNN
F 1 "100R" V 12550 7350 50  0000 C CNN
F 2 "Resistor_SMD:R_0805_2012Metric" H 12600 7550 50  0001 C CNN
F 3 "~" H 12600 7550 50  0001 C CNN
	1    12600 7550
	0    1    1    0   
$EndComp
$Comp
L Device:R_Small R?
U 1 1 6199A4B8
P 12600 7650
AR Path="/61833839/6199A4B8" Ref="R?"  Part="1" 
AR Path="/622F77ED/6199A4B8" Ref="R?"  Part="1" 
AR Path="/6199A4B8" Ref="R117"  Part="1" 
F 0 "R117" V 12550 7850 50  0000 C CNN
F 1 "100R" V 12550 7450 50  0000 C CNN
F 2 "Resistor_SMD:R_0805_2012Metric" H 12600 7650 50  0001 C CNN
F 3 "~" H 12600 7650 50  0001 C CNN
	1    12600 7650
	0    1    1    0   
$EndComp
$Comp
L Device:R_Small R?
U 1 1 6199A4C2
P 12600 7750
AR Path="/61833839/6199A4C2" Ref="R?"  Part="1" 
AR Path="/622F77ED/6199A4C2" Ref="R?"  Part="1" 
AR Path="/6199A4C2" Ref="R118"  Part="1" 
F 0 "R118" V 12550 7950 50  0000 C CNN
F 1 "2k2" V 12550 7550 50  0000 C CNN
F 2 "Resistor_SMD:R_0805_2012Metric" H 12600 7750 50  0001 C CNN
F 3 "~" H 12600 7750 50  0001 C CNN
	1    12600 7750
	0    1    1    0   
$EndComp
$Comp
L Device:R_Small R?
U 1 1 61B450AB
P 12600 7850
AR Path="/61833839/61B450AB" Ref="R?"  Part="1" 
AR Path="/622F77ED/61B450AB" Ref="R?"  Part="1" 
AR Path="/61B450AB" Ref="R119"  Part="1" 
F 0 "R119" V 12550 8050 50  0000 C CNN
F 1 "6k8" V 12550 7650 50  0000 C CNN
F 2 "Resistor_SMD:R_0805_2012Metric" H 12600 7850 50  0001 C CNN
F 3 "~" H 12600 7850 50  0001 C CNN
	1    12600 7850
	0    1    1    0   
$EndComp
Wire Wire Line
	10400 9150 9850 9150
Text Label 9850 9050 0    50   ~ 0
HTX6P
Wire Wire Line
	10400 9050 9850 9050
Text Label 9850 8950 0    50   ~ 0
HTX7N
Wire Wire Line
	10400 8950 9850 8950
Text Label 9850 8850 0    50   ~ 0
HTX7P
Wire Wire Line
	10400 8850 9850 8850
Text Label 9850 9150 0    50   ~ 0
HTX6N
Text Label 13300 9150 2    50   ~ 0
HRX6N
Wire Wire Line
	12700 9150 13300 9150
Text Label 13300 9050 2    50   ~ 0
HRX6P
Wire Wire Line
	12700 9050 13300 9050
Text Label 13300 8950 2    50   ~ 0
HRX7N
Wire Wire Line
	12700 8950 13300 8950
Text Label 13300 8850 2    50   ~ 0
HRX7P
Wire Wire Line
	12700 8850 13300 8850
$Comp
L Device:R_Small R?
U 1 1 61EC6942
P 12600 8850
AR Path="/61833839/61EC6942" Ref="R?"  Part="1" 
AR Path="/622F77ED/61EC6942" Ref="R?"  Part="1" 
AR Path="/61EC6942" Ref="R120"  Part="1" 
F 0 "R120" V 12550 9050 50  0000 C CNN
F 1 "100R" V 12550 8650 50  0000 C CNN
F 2 "Resistor_SMD:R_0805_2012Metric" H 12600 8850 50  0001 C CNN
F 3 "~" H 12600 8850 50  0001 C CNN
	1    12600 8850
	0    1    1    0   
$EndComp
$Comp
L Device:R_Small R?
U 1 1 61EC7180
P 12600 8950
AR Path="/61833839/61EC7180" Ref="R?"  Part="1" 
AR Path="/622F77ED/61EC7180" Ref="R?"  Part="1" 
AR Path="/61EC7180" Ref="R121"  Part="1" 
F 0 "R121" V 12550 9150 50  0000 C CNN
F 1 "100R" V 12550 8750 50  0000 C CNN
F 2 "Resistor_SMD:R_0805_2012Metric" H 12600 8950 50  0001 C CNN
F 3 "~" H 12600 8950 50  0001 C CNN
	1    12600 8950
	0    1    1    0   
$EndComp
$Comp
L Device:R_Small R?
U 1 1 61EF5CBF
P 12600 9050
AR Path="/61833839/61EF5CBF" Ref="R?"  Part="1" 
AR Path="/622F77ED/61EF5CBF" Ref="R?"  Part="1" 
AR Path="/61EF5CBF" Ref="R122"  Part="1" 
F 0 "R122" V 12550 9250 50  0000 C CNN
F 1 "100R" V 12550 8850 50  0000 C CNN
F 2 "Resistor_SMD:R_0805_2012Metric" H 12600 9050 50  0001 C CNN
F 3 "~" H 12600 9050 50  0001 C CNN
	1    12600 9050
	0    1    1    0   
$EndComp
$Comp
L Device:R_Small R?
U 1 1 61EF5CC5
P 12600 9150
AR Path="/61833839/61EF5CC5" Ref="R?"  Part="1" 
AR Path="/622F77ED/61EF5CC5" Ref="R?"  Part="1" 
AR Path="/61EF5CC5" Ref="R123"  Part="1" 
F 0 "R123" V 12550 9350 50  0000 C CNN
F 1 "100R" V 12550 8950 50  0000 C CNN
F 2 "Resistor_SMD:R_0805_2012Metric" H 12600 9150 50  0001 C CNN
F 3 "~" H 12600 9150 50  0001 C CNN
	1    12600 9150
	0    1    1    0   
$EndComp
$Comp
L Device:R_Small R?
U 1 1 61F2321C
P 10500 8850
AR Path="/61833839/61F2321C" Ref="R?"  Part="1" 
AR Path="/622F77ED/61F2321C" Ref="R?"  Part="1" 
AR Path="/61F2321C" Ref="R111"  Part="1" 
F 0 "R111" V 10450 9050 50  0000 C CNN
F 1 "100R" V 10450 8650 50  0000 C CNN
F 2 "Resistor_SMD:R_0805_2012Metric" H 10500 8850 50  0001 C CNN
F 3 "~" H 10500 8850 50  0001 C CNN
	1    10500 8850
	0    1    1    0   
$EndComp
$Comp
L Device:R_Small R?
U 1 1 61F23A9A
P 10500 8950
AR Path="/61833839/61F23A9A" Ref="R?"  Part="1" 
AR Path="/622F77ED/61F23A9A" Ref="R?"  Part="1" 
AR Path="/61F23A9A" Ref="R112"  Part="1" 
F 0 "R112" V 10450 9150 50  0000 C CNN
F 1 "100R" V 10450 8750 50  0000 C CNN
F 2 "Resistor_SMD:R_0805_2012Metric" H 10500 8950 50  0001 C CNN
F 3 "~" H 10500 8950 50  0001 C CNN
	1    10500 8950
	0    1    1    0   
$EndComp
$Comp
L Device:R_Small R?
U 1 1 61F23AA4
P 10500 9050
AR Path="/61833839/61F23AA4" Ref="R?"  Part="1" 
AR Path="/622F77ED/61F23AA4" Ref="R?"  Part="1" 
AR Path="/61F23AA4" Ref="R113"  Part="1" 
F 0 "R113" V 10450 9250 50  0000 C CNN
F 1 "100R" V 10450 8850 50  0000 C CNN
F 2 "Resistor_SMD:R_0805_2012Metric" H 10500 9050 50  0001 C CNN
F 3 "~" H 10500 9050 50  0001 C CNN
	1    10500 9050
	0    1    1    0   
$EndComp
$Comp
L Device:R_Small R?
U 1 1 61F23AAE
P 10500 9150
AR Path="/61833839/61F23AAE" Ref="R?"  Part="1" 
AR Path="/622F77ED/61F23AAE" Ref="R?"  Part="1" 
AR Path="/61F23AAE" Ref="R114"  Part="1" 
F 0 "R114" V 10450 9350 50  0000 C CNN
F 1 "100R" V 10450 8950 50  0000 C CNN
F 2 "Resistor_SMD:R_0805_2012Metric" H 10500 9150 50  0001 C CNN
F 3 "~" H 10500 9150 50  0001 C CNN
	1    10500 9150
	0    1    1    0   
$EndComp
$Comp
L Connector_Generic:Conn_02x07_Top_Bottom J103
U 1 1 6188A894
P 11400 9150
F 0 "J103" H 11450 9667 50  0000 C CNN
F 1 "pmod_ext_2x07" H 11450 9576 50  0000 C CNN
F 2 "pmod:pmod_ext_2x07" H 11400 9150 50  0001 C CNN
F 3 "~" H 11400 9150 50  0001 C CNN
	1    11400 9150
	1    0    0    -1  
$EndComp
Text Label 10800 8850 0    50   ~ 0
PM207
Text Label 10800 8950 0    50   ~ 0
PM208
Text Label 10800 9050 0    50   ~ 0
PM209
Text Label 10800 9150 0    50   ~ 0
PM210
Text Label 12300 8850 2    50   ~ 0
PM201
Text Label 12300 8950 2    50   ~ 0
PM202
Text Label 12300 9050 2    50   ~ 0
PM203
Text Label 12300 9150 2    50   ~ 0
PM204
Wire Wire Line
	11700 8850 12500 8850
Wire Wire Line
	11700 8950 12500 8950
Wire Wire Line
	11700 9050 12500 9050
Wire Wire Line
	11700 9150 12500 9150
Wire Wire Line
	10600 8850 11200 8850
Wire Wire Line
	10600 8950 11200 8950
Wire Wire Line
	10600 9050 11200 9050
Wire Wire Line
	10600 9150 11200 9150
$Comp
L Connector_Generic:Conn_02x07_Top_Bottom J102
U 1 1 619B53E4
P 11400 7750
F 0 "J102" H 11450 8267 50  0000 C CNN
F 1 "pmod_ext_2x07" H 11450 8176 50  0000 C CNN
F 2 "pmod:pmod_ext_2x07" H 11400 7750 50  0001 C CNN
F 3 "~" H 11400 7750 50  0001 C CNN
	1    11400 7750
	1    0    0    -1  
$EndComp
Text Label 10800 7450 0    50   ~ 0
PM107
Text Label 10800 7550 0    50   ~ 0
PM108
Text Label 10800 7650 0    50   ~ 0
PM109
Text Label 10800 7750 0    50   ~ 0
PM110
Text Label 12300 7450 2    50   ~ 0
PM101
Text Label 12300 7550 2    50   ~ 0
PM102
Text Label 12300 7650 2    50   ~ 0
PM103
Text Label 12300 7750 2    50   ~ 0
PM104
Wire Wire Line
	11700 7450 12500 7450
Wire Wire Line
	11700 7550 12500 7550
Wire Wire Line
	11700 7650 12500 7650
Wire Wire Line
	10600 7450 11200 7450
Wire Wire Line
	10600 7550 11200 7550
Wire Wire Line
	10600 7650 11200 7650
Wire Wire Line
	10600 7750 11200 7750
$Comp
L power:+5V #PWR0139
U 1 1 61BC145E
P 12000 8650
F 0 "#PWR0139" H 12000 8500 50  0001 C CNN
F 1 "+5V" H 12000 8800 50  0000 C CNN
F 2 "" H 12000 8650 50  0001 C CNN
F 3 "" H 12000 8650 50  0001 C CNN
	1    12000 8650
	1    0    0    -1  
$EndComp
$Comp
L power:GND #PWR0136
U 1 1 61BC2EE9
P 11900 8100
F 0 "#PWR0136" H 11900 7850 50  0001 C CNN
F 1 "GND" H 11905 7927 50  0000 C CNN
F 2 "" H 11900 8100 50  0001 C CNN
F 3 "" H 11900 8100 50  0001 C CNN
	1    11900 8100
	1    0    0    -1  
$EndComp
Wire Wire Line
	11700 7850 11900 7850
Wire Wire Line
	11900 7850 11900 8100
Wire Wire Line
	11200 7950 11100 7950
Wire Wire Line
	11700 7950 11800 7950
Wire Wire Line
	11700 8050 12000 8050
$Comp
L power:+2V5 #PWR0133
U 1 1 61E97E96
P 11100 8650
F 0 "#PWR0133" H 11100 8500 50  0001 C CNN
F 1 "+2V5" H 11100 8800 50  0000 C CNN
F 2 "" H 11100 8650 50  0001 C CNN
F 3 "" H 11100 8650 50  0001 C CNN
	1    11100 8650
	1    0    0    -1  
$EndComp
$Comp
L power:+2V5 #PWR0135
U 1 1 61E98E57
P 11800 8650
F 0 "#PWR0135" H 11800 8500 50  0001 C CNN
F 1 "+2V5" H 11800 8800 50  0000 C CNN
F 2 "" H 11800 8650 50  0001 C CNN
F 3 "" H 11800 8650 50  0001 C CNN
	1    11800 8650
	1    0    0    -1  
$EndComp
$Comp
L power:+5V #PWR0138
U 1 1 61F399F8
P 12000 7250
F 0 "#PWR0138" H 12000 7100 50  0001 C CNN
F 1 "+5V" H 12000 7400 50  0000 C CNN
F 2 "" H 12000 7250 50  0001 C CNN
F 3 "" H 12000 7250 50  0001 C CNN
	1    12000 7250
	1    0    0    -1  
$EndComp
Wire Wire Line
	11100 7950 11100 7250
Wire Wire Line
	11800 7950 11800 7250
Wire Wire Line
	12000 7950 12000 7250
$Comp
L power:+3.3V #PWR0132
U 1 1 61F705FD
P 11100 7250
F 0 "#PWR0132" H 11100 7100 50  0001 C CNN
F 1 "+3.3V" H 11100 7400 50  0000 C CNN
F 2 "" H 11100 7250 50  0001 C CNN
F 3 "" H 11100 7250 50  0001 C CNN
	1    11100 7250
	-1   0    0    -1  
$EndComp
$Comp
L power:+3.3V #PWR0134
U 1 1 61F71026
P 11800 7250
F 0 "#PWR0134" H 11800 7100 50  0001 C CNN
F 1 "+3.3V" H 11800 7400 50  0000 C CNN
F 2 "" H 11800 7250 50  0001 C CNN
F 3 "" H 11800 7250 50  0001 C CNN
	1    11800 7250
	-1   0    0    -1  
$EndComp
Wire Wire Line
	11200 7850 11000 7850
Wire Wire Line
	11000 7850 11000 8100
$Comp
L power:GND #PWR0121
U 1 1 61B4A183
P 11000 8100
F 0 "#PWR0121" H 11000 7850 50  0001 C CNN
F 1 "GND" H 11005 7927 50  0000 C CNN
F 2 "" H 11000 8100 50  0001 C CNN
F 3 "" H 11000 8100 50  0001 C CNN
	1    11000 8100
	1    0    0    -1  
$EndComp
NoConn ~ 11200 8050
$Comp
L power:GND #PWR0122
U 1 1 61BFFC13
P 11900 9500
F 0 "#PWR0122" H 11900 9250 50  0001 C CNN
F 1 "GND" H 11905 9327 50  0000 C CNN
F 2 "" H 11900 9500 50  0001 C CNN
F 3 "" H 11900 9500 50  0001 C CNN
	1    11900 9500
	1    0    0    -1  
$EndComp
Wire Wire Line
	11700 9250 11900 9250
Wire Wire Line
	11900 9250 11900 9500
Wire Wire Line
	11700 9350 11800 9350
Wire Wire Line
	11700 9450 12000 9450
Wire Wire Line
	11800 9350 11800 8650
Wire Wire Line
	12000 9350 12000 8650
Wire Wire Line
	11200 9350 11100 9350
Wire Wire Line
	11100 9350 11100 8650
Wire Wire Line
	11200 9250 11000 9250
Wire Wire Line
	11000 9250 11000 9500
$Comp
L power:GND #PWR0130
U 1 1 61C2EC61
P 11000 9500
F 0 "#PWR0130" H 11000 9250 50  0001 C CNN
F 1 "GND" H 11005 9327 50  0000 C CNN
F 2 "" H 11000 9500 50  0001 C CNN
F 3 "" H 11000 9500 50  0001 C CNN
	1    11000 9500
	1    0    0    -1  
$EndComp
NoConn ~ 11200 9450
$Comp
L Connector_Generic:Conn_01x04 J104
U 1 1 618B7A39
P 11400 10200
F 0 "J104" H 11480 10192 50  0000 L CNN
F 1 "Conn_01x04" H 11200 9850 50  0000 L CNN
F 2 "pinhead:61900411021" H 11400 10200 50  0001 C CNN
F 3 "https://www.we-online.com/catalog/datasheet/61900411021.pdf" H 11400 10200 50  0001 C CNN
	1    11400 10200
	1    0    0    -1  
$EndComp
Wire Wire Line
	11200 10100 10700 10100
Wire Wire Line
	10700 10100 10700 10500
$Comp
L power:GND #PWR0131
U 1 1 618BA22C
P 10700 10500
F 0 "#PWR0131" H 10700 10250 50  0001 C CNN
F 1 "GND" H 10705 10327 50  0000 C CNN
F 2 "" H 10700 10500 50  0001 C CNN
F 3 "" H 10700 10500 50  0001 C CNN
	1    10700 10500
	1    0    0    -1  
$EndComp
$Comp
L power:+3.3V #PWR0137
U 1 1 619171F2
P 11100 10050
F 0 "#PWR0137" H 11100 9900 50  0001 C CNN
F 1 "+3.3V" H 11100 10200 50  0000 C CNN
F 2 "" H 11100 10050 50  0001 C CNN
F 3 "" H 11100 10050 50  0001 C CNN
	1    11100 10050
	-1   0    0    -1  
$EndComp
Wire Wire Line
	11100 10050 11100 10300
Wire Wire Line
	11100 10300 11200 10300
Wire Wire Line
	10400 10200 9850 10200
$Comp
L Device:R_Small R?
U 1 1 61947C17
P 10500 10200
AR Path="/61833839/61947C17" Ref="R?"  Part="1" 
AR Path="/622F77ED/61947C17" Ref="R?"  Part="1" 
AR Path="/61947C17" Ref="R124"  Part="1" 
F 0 "R124" V 10400 10000 50  0000 C CNN
F 1 "100R" V 10395 10200 50  0000 C CNN
F 2 "Resistor_SMD:R_0805_2012Metric" H 10500 10200 50  0001 C CNN
F 3 "~" H 10500 10200 50  0001 C CNN
	1    10500 10200
	0    1    1    0   
$EndComp
Wire Wire Line
	11200 10200 10600 10200
Text Label 9850 10200 0    50   ~ 0
HTX2P
Text Label 9850 10400 0    50   ~ 0
HRX2P
$Comp
L Device:R_Small R?
U 1 1 619D996E
P 10500 10400
AR Path="/61833839/619D996E" Ref="R?"  Part="1" 
AR Path="/622F77ED/619D996E" Ref="R?"  Part="1" 
AR Path="/619D996E" Ref="R125"  Part="1" 
F 0 "R125" V 10400 10200 50  0000 C CNN
F 1 "2k2" V 10400 10400 50  0000 C CNN
F 2 "Resistor_SMD:R_0805_2012Metric" H 10500 10400 50  0001 C CNN
F 3 "~" H 10500 10400 50  0001 C CNN
	1    10500 10400
	0    1    1    0   
$EndComp
$Comp
L Device:R_Small R?
U 1 1 61A39E5F
P 10500 10500
AR Path="/61833839/61A39E5F" Ref="R?"  Part="1" 
AR Path="/622F77ED/61A39E5F" Ref="R?"  Part="1" 
AR Path="/61A39E5F" Ref="R126"  Part="1" 
F 0 "R126" V 10600 10300 50  0000 C CNN
F 1 "6k8" V 10600 10500 50  0000 C CNN
F 2 "Resistor_SMD:R_0805_2012Metric" H 10500 10500 50  0001 C CNN
F 3 "~" H 10500 10500 50  0001 C CNN
	1    10500 10500
	0    1    1    0   
$EndComp
Wire Wire Line
	10600 10500 10700 10500
Connection ~ 10700 10500
Wire Wire Line
	10400 10500 10350 10500
Wire Wire Line
	10350 10500 10350 10400
Connection ~ 10350 10400
Wire Wire Line
	10350 10400 10400 10400
Wire Wire Line
	10600 10400 11200 10400
Wire Wire Line
	9850 10400 10350 10400
Text Label 10850 10400 0    50   ~ 0
RX
Text Label 10850 10200 0    50   ~ 0
TX
Text Label 10400 5900 0    50   ~ 0
HD35N
Text Label 10400 5800 0    50   ~ 0
HD33P
Text Label 10400 5700 0    50   ~ 0
HD35P
Text Label 10400 5600 0    50   ~ 0
HD33N
Text Label 10400 5450 0    50   ~ 0
HD36P
Text Label 10400 5350 0    50   ~ 0
HD37P
Text Label 10400 5250 0    50   ~ 0
HD36N
Text Label 10400 5150 0    50   ~ 0
HD37N
Text Label 10400 6350 0    50   ~ 0
HD31N
Text Label 10400 6150 0    50   ~ 0
HD31P
Text Label 10400 6050 0    50   ~ 0
HD29N
NoConn ~ 8100 5500
NoConn ~ 8100 5600
NoConn ~ 8100 5900
Wire Wire Line
	8100 2400 8550 2400
NoConn ~ 7100 2500
NoConn ~ 8100 4900
NoConn ~ 8100 5000
NoConn ~ 8100 5200
NoConn ~ 8100 5300
NoConn ~ 8100 4300
NoConn ~ 7100 4000
NoConn ~ 7100 4100
NoConn ~ 7100 4300
NoConn ~ 7100 4400
NoConn ~ 7100 4700
NoConn ~ 8100 3700
NoConn ~ 8100 3800
NoConn ~ 7100 3800
NoConn ~ 8100 4100
NoConn ~ 8100 4700
NoConn ~ 8100 4400
$Comp
L Connector:Conn_01x02_Male J?
U 1 1 62474226
P 12200 9350
AR Path="/622F77ED/62474226" Ref="J?"  Part="1" 
AR Path="/62474226" Ref="J106"  Part="1" 
F 0 "J106" H 12172 9324 50  0000 R CNN
F 1 "Conn_01x02_Male" H 12172 9233 50  0000 R CNN
F 2 "Connector_PinHeader_2.54mm:PinHeader_1x02_P2.54mm_Vertical" H 12200 9350 50  0001 C CNN
F 3 "~" H 12200 9350 50  0001 C CNN
	1    12200 9350
	-1   0    0    -1  
$EndComp
$Comp
L Connector:Conn_01x02_Male J?
U 1 1 62506F3F
P 12200 7950
AR Path="/622F77ED/62506F3F" Ref="J?"  Part="1" 
AR Path="/62506F3F" Ref="J105"  Part="1" 
F 0 "J105" H 12172 7924 50  0000 R CNN
F 1 "Conn_01x02_Male" H 12172 7833 50  0000 R CNN
F 2 "Connector_PinHeader_2.54mm:PinHeader_1x02_P2.54mm_Vertical" H 12200 7950 50  0001 C CNN
F 3 "~" H 12200 7950 50  0001 C CNN
	1    12200 7950
	-1   0    0    -1  
$EndComp
Wire Wire Line
	11700 7750 12500 7750
Wire Wire Line
	12700 7850 12950 7850
Wire Wire Line
	12950 7850 12950 7750
Connection ~ 12950 7750
Wire Wire Line
	12950 7750 13300 7750
Wire Wire Line
	12500 7850 11900 7850
Connection ~ 11900 7850
$Comp
L Device:R_Small R?
U 1 1 62778626
P 10500 7850
AR Path="/61833839/62778626" Ref="R?"  Part="1" 
AR Path="/622F77ED/62778626" Ref="R?"  Part="1" 
AR Path="/62778626" Ref="R127"  Part="1" 
F 0 "R127" V 10450 8050 50  0000 C CNN
F 1 "6k8" V 10450 7650 50  0000 C CNN
F 2 "Resistor_SMD:R_0805_2012Metric" H 10500 7850 50  0001 C CNN
F 3 "~" H 10500 7850 50  0001 C CNN
	1    10500 7850
	0    1    1    0   
$EndComp
Wire Wire Line
	10200 7750 10200 7850
Wire Wire Line
	10200 7850 10400 7850
Connection ~ 10200 7750
Wire Wire Line
	10200 7750 9850 7750
Wire Wire Line
	10600 7850 11000 7850
Connection ~ 11000 7850
NoConn ~ 8100 9900
$Comp
L project_power:+VREF_A #PWR0142
U 1 1 618FA155
P 2250 6300
F 0 "#PWR0142" H 2250 6150 50  0001 C CNN
F 1 "+VREF_A" H 2265 6473 50  0000 C CNN
F 2 "" H 2250 6300 50  0001 C CNN
F 3 "" H 2250 6300 50  0001 C CNN
	1    2250 6300
	1    0    0    -1  
$EndComp
$Comp
L project_power:+VREF_A #PWR0143
U 1 1 618FB243
P 3550 2250
F 0 "#PWR0143" H 3550 2100 50  0001 C CNN
F 1 "+VREF_A" H 3565 2423 50  0000 C CNN
F 2 "" H 3550 2250 50  0001 C CNN
F 3 "" H 3550 2250 50  0001 C CNN
	1    3550 2250
	1    0    0    -1  
$EndComp
$Comp
L project_power:+VREF_A #PWR0144
U 1 1 618FC109
P 800 8500
F 0 "#PWR0144" H 800 8350 50  0001 C CNN
F 1 "+VREF_A" H 815 8673 50  0000 C CNN
F 2 "" H 800 8500 50  0001 C CNN
F 3 "" H 800 8500 50  0001 C CNN
	1    800  8500
	1    0    0    -1  
$EndComp
Text Label 5550 4950 2    50   ~ 0
HRX3P
Text Label 5550 5750 2    50   ~ 0
HRX4P
Text Label 5550 6550 2    50   ~ 0
HRX5P
Text Label 5550 7850 2    50   ~ 0
HD18P
Text Label 5550 7200 2    50   ~ 0
HD16P
Text Label 10400 3350 0    50   ~ 0
HD25N
Text Label 10400 3150 0    50   ~ 0
HD25P
Text Label 10400 3250 0    50   ~ 0
HD27N
Text Label 10400 3050 0    50   ~ 0
HD27P
Text Label 5550 4150 2    50   ~ 0
HD15P
$Comp
L Device:R_Small R?
U 1 1 61AE94A3
P 6350 6850
AR Path="/61833839/61AE94A3" Ref="R?"  Part="1" 
AR Path="/622F77ED/61AE94A3" Ref="R?"  Part="1" 
AR Path="/61AE94A3" Ref="R128"  Part="1" 
F 0 "R128" H 6409 6804 50  0000 L CNN
F 1 "1k" H 6409 6895 50  0000 L CNN
F 2 "Resistor_SMD:R_0805_2012Metric" H 6350 6850 50  0001 C CNN
F 3 "~" H 6350 6850 50  0001 C CNN
	1    6350 6850
	-1   0    0    1   
$EndComp
$Comp
L Device:R_Small R?
U 1 1 61AEA144
P 6350 7550
AR Path="/61833839/61AEA144" Ref="R?"  Part="1" 
AR Path="/622F77ED/61AEA144" Ref="R?"  Part="1" 
AR Path="/61AEA144" Ref="R129"  Part="1" 
F 0 "R129" H 6409 7504 50  0000 L CNN
F 1 "1k" H 6409 7595 50  0000 L CNN
F 2 "Resistor_SMD:R_0805_2012Metric" H 6350 7550 50  0001 C CNN
F 3 "~" H 6350 7550 50  0001 C CNN
	1    6350 7550
	-1   0    0    1   
$EndComp
$Comp
L power:GND #PWR?
U 1 1 61AEAAB0
P 6350 7700
AR Path="/61833839/61AEAAB0" Ref="#PWR?"  Part="1" 
AR Path="/622F77ED/61AEAAB0" Ref="#PWR?"  Part="1" 
AR Path="/61AEAAB0" Ref="#PWR0153"  Part="1" 
F 0 "#PWR0153" H 6350 7450 50  0001 C CNN
F 1 "GND" H 6355 7527 50  0000 C CNN
F 2 "" H 6350 7700 50  0001 C CNN
F 3 "" H 6350 7700 50  0001 C CNN
	1    6350 7700
	-1   0    0    -1  
$EndComp
Wire Wire Line
	6350 6950 6350 7100
Wire Wire Line
	6350 7100 7100 7100
Connection ~ 6350 7100
Wire Wire Line
	6350 7100 6350 7400
Wire Wire Line
	6350 7400 7100 7400
Connection ~ 6350 7400
Wire Wire Line
	6350 7400 6350 7450
Text Notes 6300 7000 3    50   Italic 0
HR: 1.25V
$Comp
L Device:R_Small R?
U 1 1 61BD600B
P 6050 6050
AR Path="/61833839/61BD600B" Ref="R?"  Part="1" 
AR Path="/622F77ED/61BD600B" Ref="R?"  Part="1" 
AR Path="/61BD600B" Ref="R130"  Part="1" 
F 0 "R130" H 5991 6004 50  0000 R CNN
F 1 "1k3" H 5991 6095 50  0000 R CNN
F 2 "Resistor_SMD:R_0805_2012Metric" H 6050 6050 50  0001 C CNN
F 3 "~" H 6050 6050 50  0001 C CNN
	1    6050 6050
	-1   0    0    1   
$EndComp
$Comp
L Device:R_Small R?
U 1 1 61BD65C8
P 6050 6650
AR Path="/61833839/61BD65C8" Ref="R?"  Part="1" 
AR Path="/622F77ED/61BD65C8" Ref="R?"  Part="1" 
AR Path="/61BD65C8" Ref="R131"  Part="1" 
F 0 "R131" H 5991 6604 50  0000 R CNN
F 1 "620R" H 5991 6695 50  0000 R CNN
F 2 "Resistor_SMD:R_0805_2012Metric" H 6050 6650 50  0001 C CNN
F 3 "~" H 6050 6650 50  0001 C CNN
	1    6050 6650
	-1   0    0    1   
$EndComp
$Comp
L power:GND #PWR?
U 1 1 61BD6FA4
P 6050 6800
AR Path="/61833839/61BD6FA4" Ref="#PWR?"  Part="1" 
AR Path="/622F77ED/61BD6FA4" Ref="#PWR?"  Part="1" 
AR Path="/61BD6FA4" Ref="#PWR0141"  Part="1" 
F 0 "#PWR0141" H 6050 6550 50  0001 C CNN
F 1 "GND" H 6055 6627 50  0000 C CNN
F 2 "" H 6050 6800 50  0001 C CNN
F 3 "" H 6050 6800 50  0001 C CNN
	1    6050 6800
	-1   0    0    -1  
$EndComp
Wire Wire Line
	7100 6500 6050 6500
Wire Wire Line
	6050 6500 6050 6550
Wire Wire Line
	7100 6200 6050 6200
Wire Wire Line
	6050 6200 6050 6150
Wire Wire Line
	6050 6500 6050 6200
Connection ~ 6050 6500
Connection ~ 6050 6200
Text Notes 6000 6550 1    50   Italic 0
SIM: 807mV
$Comp
L Device:R_Small R?
U 1 1 61E08599
P 8850 1750
AR Path="/61833839/61E08599" Ref="R?"  Part="1" 
AR Path="/622F77ED/61E08599" Ref="R?"  Part="1" 
AR Path="/61E08599" Ref="R132"  Part="1" 
F 0 "R132" H 8900 1700 50  0000 L CNN
F 1 "1k3" H 8909 1795 50  0000 L CNN
F 2 "Resistor_SMD:R_0805_2012Metric" H 8850 1750 50  0001 C CNN
F 3 "~" H 8850 1750 50  0001 C CNN
	1    8850 1750
	1    0    0    1   
$EndComp
$Comp
L Device:R_Small R?
U 1 1 61E085A3
P 8850 2650
AR Path="/61833839/61E085A3" Ref="R?"  Part="1" 
AR Path="/622F77ED/61E085A3" Ref="R?"  Part="1" 
AR Path="/61E085A3" Ref="R133"  Part="1" 
F 0 "R133" H 9100 2600 50  0000 R CNN
F 1 "620R" H 9100 2700 50  0000 R CNN
F 2 "Resistor_SMD:R_0805_2012Metric" H 8850 2650 50  0001 C CNN
F 3 "~" H 8850 2650 50  0001 C CNN
	1    8850 2650
	1    0    0    1   
$EndComp
$Comp
L power:GND #PWR?
U 1 1 61E085AD
P 8850 2800
AR Path="/61833839/61E085AD" Ref="#PWR?"  Part="1" 
AR Path="/622F77ED/61E085AD" Ref="#PWR?"  Part="1" 
AR Path="/61E085AD" Ref="#PWR0155"  Part="1" 
F 0 "#PWR0155" H 8850 2550 50  0001 C CNN
F 1 "GND" H 8855 2627 50  0000 C CNN
F 2 "" H 8850 2800 50  0001 C CNN
F 3 "" H 8850 2800 50  0001 C CNN
	1    8850 2800
	1    0    0    -1  
$EndComp
Text Notes 8950 2400 1    50   Italic 0
ADV: 807mV
Wire Wire Line
	8850 1850 8850 1900
Wire Wire Line
	8100 2500 8850 2500
Connection ~ 8850 2500
Wire Wire Line
	8850 2500 8850 2550
Wire Wire Line
	8100 2300 8850 2300
Connection ~ 8850 2300
Wire Wire Line
	8850 2300 8850 2500
Wire Wire Line
	8100 2100 8850 2100
Connection ~ 8850 2100
Wire Wire Line
	8850 2100 8850 2300
Wire Wire Line
	8100 1900 8850 1900
Connection ~ 8850 1900
Wire Wire Line
	8850 1900 8850 2100
$Comp
L power:+2V5 #PWR0145
U 1 1 61AC7A6E
P 6350 6750
F 0 "#PWR0145" H 6350 6600 50  0001 C CNN
F 1 "+2V5" H 6400 6900 50  0000 C CNN
F 2 "" H 6350 6750 50  0001 C CNN
F 3 "" H 6350 6750 50  0001 C CNN
	1    6350 6750
	1    0    0    -1  
$EndComp
$Comp
L power:+2V5 #PWR0140
U 1 1 61ACB952
P 6050 5950
F 0 "#PWR0140" H 6050 5800 50  0001 C CNN
F 1 "+2V5" H 6065 6123 50  0000 C CNN
F 2 "" H 6050 5950 50  0001 C CNN
F 3 "" H 6050 5950 50  0001 C CNN
	1    6050 5950
	1    0    0    -1  
$EndComp
$Comp
L power:+2V5 #PWR0146
U 1 1 61ACBE34
P 8850 1650
F 0 "#PWR0146" H 8850 1500 50  0001 C CNN
F 1 "+2V5" H 8865 1823 50  0000 C CNN
F 2 "" H 8850 1650 50  0001 C CNN
F 3 "" H 8850 1650 50  0001 C CNN
	1    8850 1650
	1    0    0    -1  
$EndComp
$Comp
L Device:C_Small C118
U 1 1 61ACC3D2
P 9150 2650
AR Path="/61ACC3D2" Ref="C118"  Part="1" 
AR Path="/61833839/61ACC3D2" Ref="C?"  Part="1" 
AR Path="/622F77ED/61ACC3D2" Ref="C?"  Part="1" 
F 0 "C118" H 9058 2604 50  0000 R CNN
F 1 "10n" H 9058 2695 50  0000 R CNN
F 2 "Capacitor_SMD:C_0805_2012Metric" H 9150 2650 50  0001 C CNN
F 3 "~" H 9150 2650 50  0001 C CNN
	1    9150 2650
	-1   0    0    1   
$EndComp
Wire Wire Line
	8850 2800 9150 2800
Wire Wire Line
	9150 2550 9150 2500
Wire Wire Line
	9150 2500 8850 2500
Wire Wire Line
	9150 2750 9150 2800
Wire Wire Line
	8850 2750 8850 2800
Connection ~ 8850 2800
$Comp
L Device:C_Small C117
U 1 1 61BCF372
P 6050 7550
AR Path="/61BCF372" Ref="C117"  Part="1" 
AR Path="/61833839/61BCF372" Ref="C?"  Part="1" 
AR Path="/622F77ED/61BCF372" Ref="C?"  Part="1" 
F 0 "C117" H 6142 7504 50  0000 L CNN
F 1 "10n" H 6142 7595 50  0000 L CNN
F 2 "Capacitor_SMD:C_0805_2012Metric" H 6050 7550 50  0001 C CNN
F 3 "~" H 6050 7550 50  0001 C CNN
	1    6050 7550
	-1   0    0    1   
$EndComp
Wire Wire Line
	6350 7700 6050 7700
Wire Wire Line
	6050 7700 6050 7650
Wire Wire Line
	6050 7450 6050 7400
Wire Wire Line
	6050 7400 6350 7400
Wire Wire Line
	6350 7650 6350 7700
Connection ~ 6350 7700
$Comp
L Device:C_Small C116
U 1 1 61CA450D
P 5750 6650
AR Path="/61CA450D" Ref="C116"  Part="1" 
AR Path="/61833839/61CA450D" Ref="C?"  Part="1" 
AR Path="/622F77ED/61CA450D" Ref="C?"  Part="1" 
F 0 "C116" H 5700 6600 50  0000 R CNN
F 1 "10n" H 5658 6695 50  0000 R CNN
F 2 "Capacitor_SMD:C_0805_2012Metric" H 5750 6650 50  0001 C CNN
F 3 "~" H 5750 6650 50  0001 C CNN
	1    5750 6650
	-1   0    0    1   
$EndComp
Wire Wire Line
	6050 6500 5750 6500
Wire Wire Line
	5750 6500 5750 6550
Wire Wire Line
	5750 6750 5750 6800
Wire Wire Line
	5750 6800 6050 6800
Wire Wire Line
	6050 6800 6050 6750
Connection ~ 6050 6800
$Comp
L Connector:TestPoint TP101
U 1 1 6192A12E
P 2100 4750
F 0 "TP101" V 2054 4938 50  0000 L CNN
F 1 "TestPoint" V 2145 4938 50  0000 L CNN
F 2 "TestPoint:TestPoint_Loop_D1.80mm_Drill1.0mm_Beaded" H 2300 4750 50  0001 C CNN
F 3 "https://cz.mouser.com/datasheet/2/215/000-5004-741320.pdf" H 2300 4750 50  0001 C CNN
	1    2100 4750
	0    1    1    0   
$EndComp
$Comp
L Connector:TestPoint TP108
U 1 1 61955173
P 3450 8850
F 0 "TP108" H 3450 9175 50  0000 C CNN
F 1 "TestPoint" H 3450 9084 50  0000 C CNN
F 2 "TestPoint:TestPoint_Loop_D1.80mm_Drill1.0mm_Beaded" H 3650 8850 50  0001 C CNN
F 3 "https://cz.mouser.com/datasheet/2/215/000-5004-741320.pdf" H 3650 8850 50  0001 C CNN
	1    3450 8850
	1    0    0    -1  
$EndComp
$Comp
L Connector:TestPoint TP105
U 1 1 619574A9
P 2250 6300
F 0 "TP105" V 2204 6488 50  0000 L CNN
F 1 "TestPoint" V 2295 6488 50  0000 L CNN
F 2 "TestPoint:TestPoint_Loop_D1.80mm_Drill1.0mm_Beaded" H 2450 6300 50  0001 C CNN
F 3 "https://cz.mouser.com/datasheet/2/215/000-5004-741320.pdf" H 2450 6300 50  0001 C CNN
	1    2250 6300
	0    1    1    0   
$EndComp
$Comp
L Connector:TestPoint TP102
U 1 1 61958D3A
P 1350 10250
F 0 "TP102" H 1350 10575 50  0000 C CNN
F 1 "TestPoint" H 1350 10484 50  0000 C CNN
F 2 "TestPoint:TestPoint_Loop_D1.80mm_Drill1.0mm_Beaded" H 1550 10250 50  0001 C CNN
F 3 "https://cz.mouser.com/datasheet/2/215/000-5004-741320.pdf" H 1550 10250 50  0001 C CNN
	1    1350 10250
	1    0    0    -1  
$EndComp
$Comp
L power:GND #PWR?
U 1 1 6195BAFC
P 1350 10250
AR Path="/619C8940/6195BAFC" Ref="#PWR?"  Part="1" 
AR Path="/619BF925/6195BAFC" Ref="#PWR?"  Part="1" 
AR Path="/617B514C/6195BAFC" Ref="#PWR?"  Part="1" 
AR Path="/619BE637/6195BAFC" Ref="#PWR?"  Part="1" 
AR Path="/619D45F6/6195BAFC" Ref="#PWR?"  Part="1" 
AR Path="/619EA585/6195BAFC" Ref="#PWR?"  Part="1" 
AR Path="/6195BAFC" Ref="#PWR0147"  Part="1" 
F 0 "#PWR0147" H 1350 10000 50  0001 C CNN
F 1 "GND" H 1355 10077 50  0000 C CNN
F 2 "" H 1350 10250 50  0001 C CNN
F 3 "" H 1350 10250 50  0001 C CNN
	1    1350 10250
	1    0    0    -1  
$EndComp
Connection ~ 1350 10250
$Comp
L Connector:TestPoint TP103
U 1 1 61992F19
P 1700 10250
F 0 "TP103" H 1700 10575 50  0000 C CNN
F 1 "TestPoint" H 1700 10484 50  0000 C CNN
F 2 "TestPoint:TestPoint_Loop_D1.80mm_Drill1.0mm_Beaded" H 1900 10250 50  0001 C CNN
F 3 "https://cz.mouser.com/datasheet/2/215/000-5004-741320.pdf" H 1900 10250 50  0001 C CNN
	1    1700 10250
	1    0    0    -1  
$EndComp
Connection ~ 1700 10250
Wire Wire Line
	1700 10250 2050 10250
Wire Wire Line
	1350 10250 1700 10250
$Comp
L Connector:TestPoint TP104
U 1 1 619939A1
P 2050 10250
F 0 "TP104" H 2050 10575 50  0000 C CNN
F 1 "TestPoint" H 2050 10484 50  0000 C CNN
F 2 "TestPoint:TestPoint_Loop_D1.80mm_Drill1.0mm_Beaded" H 2250 10250 50  0001 C CNN
F 3 "https://cz.mouser.com/datasheet/2/215/000-5004-741320.pdf" H 2250 10250 50  0001 C CNN
	1    2050 10250
	1    0    0    -1  
$EndComp
Wire Wire Line
	2050 10250 2400 10250
$Comp
L Connector:TestPoint TP106
U 1 1 61994B2D
P 2400 10250
F 0 "TP106" H 2400 10575 50  0000 C CNN
F 1 "TestPoint" H 2400 10484 50  0000 C CNN
F 2 "TestPoint:TestPoint_Loop_D1.80mm_Drill1.0mm_Beaded" H 2600 10250 50  0001 C CNN
F 3 "https://cz.mouser.com/datasheet/2/215/000-5004-741320.pdf" H 2600 10250 50  0001 C CNN
	1    2400 10250
	1    0    0    -1  
$EndComp
Connection ~ 2050 10250
Wire Wire Line
	2400 10250 2750 10250
$Comp
L Connector:TestPoint TP107
U 1 1 619CCBDE
P 2750 10250
F 0 "TP107" H 2750 10575 50  0000 C CNN
F 1 "TestPoint" H 2750 10484 50  0000 C CNN
F 2 "TestPoint:TestPoint_Loop_D1.80mm_Drill1.0mm_Beaded" H 2950 10250 50  0001 C CNN
F 3 "https://cz.mouser.com/datasheet/2/215/000-5004-741320.pdf" H 2950 10250 50  0001 C CNN
	1    2750 10250
	1    0    0    -1  
$EndComp
Connection ~ 2400 10250
Text Notes 11100 10700 0    50   ~ 0
Serial Console
Text Notes 11350 8250 0    50   ~ 0
PMOD1
Text Notes 11350 9650 0    50   ~ 0
PMOD2
Text Notes 12200 8250 0    50   ~ 0
Optional 5V Power Enable
Text Notes 12200 9650 0    50   ~ 0
Optional 5V Power Enable
$EndSCHEMATC
