EESchema Schematic File Version 4
EELAYER 30 0
EELAYER END
$Descr A4 11693 8268
encoding utf-8
Sheet 16 16
Title "SumIntADC NX breadboard"
Date "2021-11-12"
Rev "1.0"
Comp "PiKRON"
Comment1 "Pavel Píša, Petr Porazil, Jakub Ladman"
Comment2 "Middle Resolution SumInt ADC with External Comparator"
Comment3 ""
Comment4 ""
$EndDescr
$Comp
L Amplifier_Operational:MCP6001-OT U?
U 1 1 617C0EA8
P 5400 4000
AR Path="/617C0EA8" Ref="U?"  Part="1" 
AR Path="/617B514C/617C0EA8" Ref="U201"  Part="1" 
AR Path="/619065BF/617C0EA8" Ref="U?"  Part="1" 
AR Path="/61908BA4/617C0EA8" Ref="U?"  Part="1" 
AR Path="/6192AB24/617C0EA8" Ref="U?"  Part="1" 
AR Path="/619332FF/617C0EA8" Ref="U?"  Part="1" 
AR Path="/619B691C/617C0EA8" Ref="U?"  Part="1" 
AR Path="/619BF925/617C0EA8" Ref="U?"  Part="1" 
AR Path="/619C8940/617C0EA8" Ref="U?"  Part="1" 
AR Path="/619BE637/617C0EA8" Ref="U1201"  Part="1" 
AR Path="/619D45F6/617C0EA8" Ref="U1301"  Part="1" 
AR Path="/619EA585/617C0EA8" Ref="U1401"  Part="1" 
F 0 "U1401" H 4950 4000 50  0000 L CNN
F 1 "ADA4084-1ARJZ-R2" H 5000 3050 50  0000 L CNN
F 2 "Package_TO_SOT_SMD:SOT-23-5" H 5300 3800 50  0001 L CNN
F 3 "https://www.analog.com/media/en/technical-documentation/data-sheets/ADA4084-1_4084-2_4084-4.pdf" H 5400 4200 50  0001 C CNN
	1    5400 4000
	1    0    0    -1  
$EndComp
$Comp
L Device:R_Small R?
U 1 1 617C0EAE
P 4750 3700
AR Path="/617C0EAE" Ref="R?"  Part="1" 
AR Path="/617B514C/617C0EAE" Ref="R205"  Part="1" 
AR Path="/619065BF/617C0EAE" Ref="R?"  Part="1" 
AR Path="/61908BA4/617C0EAE" Ref="R?"  Part="1" 
AR Path="/6192AB24/617C0EAE" Ref="R?"  Part="1" 
AR Path="/619332FF/617C0EAE" Ref="R?"  Part="1" 
AR Path="/619B691C/617C0EAE" Ref="R?"  Part="1" 
AR Path="/619BF925/617C0EAE" Ref="R?"  Part="1" 
AR Path="/619C8940/617C0EAE" Ref="R?"  Part="1" 
AR Path="/619BE637/617C0EAE" Ref="R1205"  Part="1" 
AR Path="/619D45F6/617C0EAE" Ref="R1305"  Part="1" 
AR Path="/619EA585/617C0EAE" Ref="R1405"  Part="1" 
F 0 "R1405" H 4750 3850 50  0000 L CNN
F 1 "100k" V 4850 3600 50  0000 L CNN
F 2 "Resistor_SMD:R_0805_2012Metric" H 4750 3700 50  0001 C CNN
F 3 "~" H 4750 3700 50  0001 C CNN
	1    4750 3700
	1    0    0    -1  
$EndComp
$Comp
L Device:R_Small R?
U 1 1 617C0EB4
P 4550 3700
AR Path="/617C0EB4" Ref="R?"  Part="1" 
AR Path="/617B514C/617C0EB4" Ref="R204"  Part="1" 
AR Path="/619065BF/617C0EB4" Ref="R?"  Part="1" 
AR Path="/61908BA4/617C0EB4" Ref="R?"  Part="1" 
AR Path="/6192AB24/617C0EB4" Ref="R?"  Part="1" 
AR Path="/619332FF/617C0EB4" Ref="R?"  Part="1" 
AR Path="/619B691C/617C0EB4" Ref="R?"  Part="1" 
AR Path="/619BF925/617C0EB4" Ref="R?"  Part="1" 
AR Path="/619C8940/617C0EB4" Ref="R?"  Part="1" 
AR Path="/619BE637/617C0EB4" Ref="R1204"  Part="1" 
AR Path="/619D45F6/617C0EB4" Ref="R1304"  Part="1" 
AR Path="/619EA585/617C0EB4" Ref="R1404"  Part="1" 
F 0 "R1404" H 4550 3850 50  0000 L CNN
F 1 "22k" V 4650 3600 50  0000 L CNN
F 2 "Resistor_SMD:R_0805_2012Metric" H 4550 3700 50  0001 C CNN
F 3 "~" H 4550 3700 50  0001 C CNN
	1    4550 3700
	1    0    0    -1  
$EndComp
$Comp
L Device:R_Small R?
U 1 1 617C0EBA
P 4350 4100
AR Path="/617C0EBA" Ref="R?"  Part="1" 
AR Path="/617B514C/617C0EBA" Ref="R202"  Part="1" 
AR Path="/619065BF/617C0EBA" Ref="R?"  Part="1" 
AR Path="/61908BA4/617C0EBA" Ref="R?"  Part="1" 
AR Path="/6192AB24/617C0EBA" Ref="R?"  Part="1" 
AR Path="/619332FF/617C0EBA" Ref="R?"  Part="1" 
AR Path="/619B691C/617C0EBA" Ref="R?"  Part="1" 
AR Path="/619BF925/617C0EBA" Ref="R?"  Part="1" 
AR Path="/619C8940/617C0EBA" Ref="R?"  Part="1" 
AR Path="/619BE637/617C0EBA" Ref="R1202"  Part="1" 
AR Path="/619D45F6/617C0EBA" Ref="R1302"  Part="1" 
AR Path="/619EA585/617C0EBA" Ref="R1402"  Part="1" 
F 0 "R1402" V 4154 4100 50  0000 C CNN
F 1 "33k" V 4245 4100 50  0000 C CNN
F 2 "Resistor_SMD:R_0805_2012Metric" H 4350 4100 50  0001 C CNN
F 3 "~" H 4350 4100 50  0001 C CNN
	1    4350 4100
	0    1    1    0   
$EndComp
$Comp
L Device:R_Small R?
U 1 1 617C0EC0
P 4350 4500
AR Path="/617C0EC0" Ref="R?"  Part="1" 
AR Path="/617B514C/617C0EC0" Ref="R203"  Part="1" 
AR Path="/619065BF/617C0EC0" Ref="R?"  Part="1" 
AR Path="/61908BA4/617C0EC0" Ref="R?"  Part="1" 
AR Path="/6192AB24/617C0EC0" Ref="R?"  Part="1" 
AR Path="/619332FF/617C0EC0" Ref="R?"  Part="1" 
AR Path="/619B691C/617C0EC0" Ref="R?"  Part="1" 
AR Path="/619BF925/617C0EC0" Ref="R?"  Part="1" 
AR Path="/619C8940/617C0EC0" Ref="R?"  Part="1" 
AR Path="/619BE637/617C0EC0" Ref="R1203"  Part="1" 
AR Path="/619D45F6/617C0EC0" Ref="R1303"  Part="1" 
AR Path="/619EA585/617C0EC0" Ref="R1403"  Part="1" 
F 0 "R1403" V 4154 4500 50  0000 C CNN
F 1 "33k" V 4245 4500 50  0000 C CNN
F 2 "Resistor_SMD:R_0805_2012Metric" H 4350 4500 50  0001 C CNN
F 3 "~" H 4350 4500 50  0001 C CNN
	1    4350 4500
	0    1    1    0   
$EndComp
$Comp
L Device:R_Small R?
U 1 1 617C0EC6
P 6000 3750
AR Path="/617C0EC6" Ref="R?"  Part="1" 
AR Path="/617B514C/617C0EC6" Ref="R207"  Part="1" 
AR Path="/619065BF/617C0EC6" Ref="R?"  Part="1" 
AR Path="/61908BA4/617C0EC6" Ref="R?"  Part="1" 
AR Path="/6192AB24/617C0EC6" Ref="R?"  Part="1" 
AR Path="/619332FF/617C0EC6" Ref="R?"  Part="1" 
AR Path="/619B691C/617C0EC6" Ref="R?"  Part="1" 
AR Path="/619BF925/617C0EC6" Ref="R?"  Part="1" 
AR Path="/619C8940/617C0EC6" Ref="R?"  Part="1" 
AR Path="/619BE637/617C0EC6" Ref="R1207"  Part="1" 
AR Path="/619D45F6/617C0EC6" Ref="R1307"  Part="1" 
AR Path="/619EA585/617C0EC6" Ref="R1407"  Part="1" 
F 0 "R1407" H 6059 3796 50  0000 L CNN
F 1 "1k3" H 6059 3705 50  0000 L CNN
F 2 "Resistor_SMD:R_0805_2012Metric" H 6000 3750 50  0001 C CNN
F 3 "~" H 6000 3750 50  0001 C CNN
	1    6000 3750
	1    0    0    -1  
$EndComp
$Comp
L Device:R_Small R?
U 1 1 617C0ECC
P 6000 4550
AR Path="/617C0ECC" Ref="R?"  Part="1" 
AR Path="/617B514C/617C0ECC" Ref="R208"  Part="1" 
AR Path="/619065BF/617C0ECC" Ref="R?"  Part="1" 
AR Path="/61908BA4/617C0ECC" Ref="R?"  Part="1" 
AR Path="/6192AB24/617C0ECC" Ref="R?"  Part="1" 
AR Path="/619332FF/617C0ECC" Ref="R?"  Part="1" 
AR Path="/619B691C/617C0ECC" Ref="R?"  Part="1" 
AR Path="/619BF925/617C0ECC" Ref="R?"  Part="1" 
AR Path="/619C8940/617C0ECC" Ref="R?"  Part="1" 
AR Path="/619BE637/617C0ECC" Ref="R1208"  Part="1" 
AR Path="/619D45F6/617C0ECC" Ref="R1308"  Part="1" 
AR Path="/619EA585/617C0ECC" Ref="R1408"  Part="1" 
F 0 "R1408" H 6059 4596 50  0000 L CNN
F 1 "620R" H 6059 4505 50  0000 L CNN
F 2 "Resistor_SMD:R_0805_2012Metric" H 6000 4550 50  0001 C CNN
F 3 "~" H 6000 4550 50  0001 C CNN
	1    6000 4550
	1    0    0    -1  
$EndComp
$Comp
L Device:C_Small C?
U 1 1 617C0EDE
P 5500 4400
AR Path="/617C0EDE" Ref="C?"  Part="1" 
AR Path="/617B514C/617C0EDE" Ref="C205"  Part="1" 
AR Path="/619065BF/617C0EDE" Ref="C?"  Part="1" 
AR Path="/61908BA4/617C0EDE" Ref="C?"  Part="1" 
AR Path="/6192AB24/617C0EDE" Ref="C?"  Part="1" 
AR Path="/619332FF/617C0EDE" Ref="C?"  Part="1" 
AR Path="/619B691C/617C0EDE" Ref="C?"  Part="1" 
AR Path="/619BF925/617C0EDE" Ref="C?"  Part="1" 
AR Path="/619C8940/617C0EDE" Ref="C?"  Part="1" 
AR Path="/619BE637/617C0EDE" Ref="C1205"  Part="1" 
AR Path="/619D45F6/617C0EDE" Ref="C1305"  Part="1" 
AR Path="/619EA585/617C0EDE" Ref="C1405"  Part="1" 
F 0 "C1405" V 5271 4400 50  0000 C CNN
F 1 "100p" V 5362 4400 50  0000 C CNN
F 2 "Capacitor_SMD:C_0805_2012Metric" H 5500 4400 50  0001 C CNN
F 3 "~" H 5500 4400 50  0001 C CNN
	1    5500 4400
	0    1    1    0   
$EndComp
$Comp
L Device:C_Small C?
U 1 1 617C0EE4
P 5100 4500
AR Path="/617C0EE4" Ref="C?"  Part="1" 
AR Path="/617B514C/617C0EE4" Ref="C201"  Part="1" 
AR Path="/619065BF/617C0EE4" Ref="C?"  Part="1" 
AR Path="/61908BA4/617C0EE4" Ref="C?"  Part="1" 
AR Path="/6192AB24/617C0EE4" Ref="C?"  Part="1" 
AR Path="/619332FF/617C0EE4" Ref="C?"  Part="1" 
AR Path="/619B691C/617C0EE4" Ref="C?"  Part="1" 
AR Path="/619BF925/617C0EE4" Ref="C?"  Part="1" 
AR Path="/619C8940/617C0EE4" Ref="C?"  Part="1" 
AR Path="/619BE637/617C0EE4" Ref="C1201"  Part="1" 
AR Path="/619D45F6/617C0EE4" Ref="C1301"  Part="1" 
AR Path="/619EA585/617C0EE4" Ref="C1401"  Part="1" 
F 0 "C1401" V 4871 4500 50  0000 C CNN
F 1 "100p" V 4962 4500 50  0000 C CNN
F 2 "Capacitor_SMD:C_0805_2012Metric" H 5100 4500 50  0001 C CNN
F 3 "~" H 5100 4500 50  0001 C CNN
	1    5100 4500
	0    1    1    0   
$EndComp
$Comp
L Device:C_Small C?
U 1 1 617C0EEA
P 5400 3700
AR Path="/617C0EEA" Ref="C?"  Part="1" 
AR Path="/617B514C/617C0EEA" Ref="C204"  Part="1" 
AR Path="/619065BF/617C0EEA" Ref="C?"  Part="1" 
AR Path="/61908BA4/617C0EEA" Ref="C?"  Part="1" 
AR Path="/6192AB24/617C0EEA" Ref="C?"  Part="1" 
AR Path="/619332FF/617C0EEA" Ref="C?"  Part="1" 
AR Path="/619B691C/617C0EEA" Ref="C?"  Part="1" 
AR Path="/619BF925/617C0EEA" Ref="C?"  Part="1" 
AR Path="/619C8940/617C0EEA" Ref="C?"  Part="1" 
AR Path="/619BE637/617C0EEA" Ref="C1204"  Part="1" 
AR Path="/619D45F6/617C0EEA" Ref="C1304"  Part="1" 
AR Path="/619EA585/617C0EEA" Ref="C1404"  Part="1" 
F 0 "C1404" V 5400 3500 50  0000 C CNN
F 1 "100p" V 5400 4000 50  0000 C CNN
F 2 "Capacitor_SMD:C_0805_2012Metric" H 5400 3700 50  0001 C CNN
F 3 "~" H 5400 3700 50  0001 C CNN
	1    5400 3700
	0    1    1    0   
$EndComp
$Comp
L Device:C_Small C?
U 1 1 617C0EF0
P 5400 3400
AR Path="/617C0EF0" Ref="C?"  Part="1" 
AR Path="/617B514C/617C0EF0" Ref="C202"  Part="1" 
AR Path="/619065BF/617C0EF0" Ref="C?"  Part="1" 
AR Path="/61908BA4/617C0EF0" Ref="C?"  Part="1" 
AR Path="/6192AB24/617C0EF0" Ref="C?"  Part="1" 
AR Path="/619332FF/617C0EF0" Ref="C?"  Part="1" 
AR Path="/619B691C/617C0EF0" Ref="C?"  Part="1" 
AR Path="/619BF925/617C0EF0" Ref="C?"  Part="1" 
AR Path="/619C8940/617C0EF0" Ref="C?"  Part="1" 
AR Path="/619BE637/617C0EF0" Ref="C1202"  Part="1" 
AR Path="/619D45F6/617C0EF0" Ref="C1302"  Part="1" 
AR Path="/619EA585/617C0EF0" Ref="C1402"  Part="1" 
F 0 "C1402" V 5400 3200 50  0000 C CNN
F 1 "100n" V 5400 3700 50  0000 C CNN
F 2 "Capacitor_SMD:C_0805_2012Metric" H 5400 3400 50  0001 C CNN
F 3 "~" H 5400 3400 50  0001 C CNN
	1    5400 3400
	0    1    1    0   
$EndComp
$Comp
L Device:C_Small C?
U 1 1 617C0EF6
P 5400 3550
AR Path="/617C0EF6" Ref="C?"  Part="1" 
AR Path="/617B514C/617C0EF6" Ref="C203"  Part="1" 
AR Path="/619065BF/617C0EF6" Ref="C?"  Part="1" 
AR Path="/61908BA4/617C0EF6" Ref="C?"  Part="1" 
AR Path="/6192AB24/617C0EF6" Ref="C?"  Part="1" 
AR Path="/619332FF/617C0EF6" Ref="C?"  Part="1" 
AR Path="/619B691C/617C0EF6" Ref="C?"  Part="1" 
AR Path="/619BF925/617C0EF6" Ref="C?"  Part="1" 
AR Path="/619C8940/617C0EF6" Ref="C?"  Part="1" 
AR Path="/619BE637/617C0EF6" Ref="C1203"  Part="1" 
AR Path="/619D45F6/617C0EF6" Ref="C1303"  Part="1" 
AR Path="/619EA585/617C0EF6" Ref="C1403"  Part="1" 
F 0 "C1403" V 5400 3350 50  0000 C CNN
F 1 "10n" V 5400 3850 50  0000 C CNN
F 2 "Capacitor_SMD:C_0805_2012Metric" H 5400 3550 50  0001 C CNN
F 3 "~" H 5400 3550 50  0001 C CNN
	1    5400 3550
	0    1    1    0   
$EndComp
Wire Wire Line
	4950 3900 4950 3800
Wire Wire Line
	4950 3900 5100 3900
Wire Wire Line
	4950 3900 4950 4500
Wire Wire Line
	4950 4500 5000 4500
Connection ~ 4950 3900
Wire Wire Line
	4450 4500 4950 4500
Connection ~ 4950 4500
Wire Wire Line
	5100 4100 4750 4100
Wire Wire Line
	5400 4400 4750 4400
Wire Wire Line
	4750 4400 4750 4100
Connection ~ 4750 4100
Wire Wire Line
	4750 4100 4550 4100
Wire Wire Line
	4750 4100 4750 3800
Wire Wire Line
	4550 3800 4550 4100
Connection ~ 4550 4100
Wire Wire Line
	4550 4100 4450 4100
Wire Wire Line
	5700 4000 5750 4000
Wire Wire Line
	6250 4200 6250 4450
Connection ~ 6250 4200
Wire Wire Line
	6250 4200 6750 4200
Wire Wire Line
	5300 3700 5300 3550
Connection ~ 5300 3700
Connection ~ 5300 3550
Wire Wire Line
	5300 3550 5300 3400
Wire Wire Line
	5500 3400 5500 3550
Connection ~ 5500 3550
Wire Wire Line
	5500 3550 5500 3700
Wire Wire Line
	4550 3600 4550 2800
Wire Wire Line
	4750 3600 4750 3400
Wire Wire Line
	4950 3400 4950 3600
Wire Wire Line
	5600 4400 5750 4400
Wire Wire Line
	5750 4400 5750 4000
Connection ~ 5750 4000
$Comp
L Device:R_Small R?
U 1 1 617C0F4A
P 4950 3700
AR Path="/617C0F4A" Ref="R?"  Part="1" 
AR Path="/617B514C/617C0F4A" Ref="R206"  Part="1" 
AR Path="/619065BF/617C0F4A" Ref="R?"  Part="1" 
AR Path="/61908BA4/617C0F4A" Ref="R?"  Part="1" 
AR Path="/6192AB24/617C0F4A" Ref="R?"  Part="1" 
AR Path="/619332FF/617C0F4A" Ref="R?"  Part="1" 
AR Path="/619B691C/617C0F4A" Ref="R?"  Part="1" 
AR Path="/619BF925/617C0F4A" Ref="R?"  Part="1" 
AR Path="/619C8940/617C0F4A" Ref="R?"  Part="1" 
AR Path="/619BE637/617C0F4A" Ref="R1206"  Part="1" 
AR Path="/619D45F6/617C0F4A" Ref="R1306"  Part="1" 
AR Path="/619EA585/617C0F4A" Ref="R1406"  Part="1" 
F 0 "R1406" H 4950 3900 50  0000 L CNN
F 1 "100k" V 5050 3600 50  0000 L CNN
F 2 "Resistor_SMD:R_0805_2012Metric" H 4950 3700 50  0001 C CNN
F 3 "~" H 4950 3700 50  0001 C CNN
	1    4950 3700
	1    0    0    -1  
$EndComp
$Comp
L Connector:Conn_Coaxial J?
U 1 1 617C0F50
P 3850 3900
AR Path="/617C0F50" Ref="J?"  Part="1" 
AR Path="/617B514C/617C0F50" Ref="J203"  Part="1" 
AR Path="/619065BF/617C0F50" Ref="J?"  Part="1" 
AR Path="/61908BA4/617C0F50" Ref="J?"  Part="1" 
AR Path="/6192AB24/617C0F50" Ref="J?"  Part="1" 
AR Path="/619332FF/617C0F50" Ref="J?"  Part="1" 
AR Path="/619B691C/617C0F50" Ref="J?"  Part="1" 
AR Path="/619BF925/617C0F50" Ref="J?"  Part="1" 
AR Path="/619C8940/617C0F50" Ref="J?"  Part="1" 
AR Path="/619BE637/617C0F50" Ref="J1203"  Part="1" 
AR Path="/619D45F6/617C0F50" Ref="J1303"  Part="1" 
AR Path="/619EA585/617C0F50" Ref="J1403"  Part="1" 
F 0 "J1403" V 4150 3850 50  0000 L CNN
F 1 "5-1814832-2" V 4050 3650 50  0000 L CNN
F 2 "Connector_Coaxial:SMA_Amphenol_132291_Vertical" H 3850 3900 50  0001 C CNN
F 3 "https://www.te.com/commerce/DocumentDelivery/DDEController?Action=showdoc&DocId=Customer+Drawing%7F1814832%7FC%7Fpdf%7FEnglish%7FENG_CD_1814832_C.pdf%7F5-1814832-2" H 3850 3900 50  0001 C CNN
	1    3850 3900
	0    1    -1   0   
$EndComp
Wire Wire Line
	5200 4500 5300 4500
Connection ~ 5300 4500
Wire Wire Line
	5300 4500 5300 4300
$Comp
L Device:C_Small C?
U 1 1 617C0F66
P 7050 3800
AR Path="/617C0F66" Ref="C?"  Part="1" 
AR Path="/617B514C/617C0F66" Ref="C209"  Part="1" 
AR Path="/619065BF/617C0F66" Ref="C?"  Part="1" 
AR Path="/61908BA4/617C0F66" Ref="C?"  Part="1" 
AR Path="/6192AB24/617C0F66" Ref="C?"  Part="1" 
AR Path="/619332FF/617C0F66" Ref="C?"  Part="1" 
AR Path="/619B691C/617C0F66" Ref="C?"  Part="1" 
AR Path="/619BF925/617C0F66" Ref="C?"  Part="1" 
AR Path="/619C8940/617C0F66" Ref="C?"  Part="1" 
AR Path="/619BE637/617C0F66" Ref="C1209"  Part="1" 
AR Path="/619D45F6/617C0F66" Ref="C1309"  Part="1" 
AR Path="/619EA585/617C0F66" Ref="C1409"  Part="1" 
F 0 "C1409" V 7050 3500 50  0000 C CNN
F 1 "100p" V 7050 4100 50  0000 C CNN
F 2 "Capacitor_SMD:C_0805_2012Metric" H 7050 3800 50  0001 C CNN
F 3 "~" H 7050 3800 50  0001 C CNN
	1    7050 3800
	0    1    1    0   
$EndComp
$Comp
L Device:C_Small C?
U 1 1 617C0F6C
P 7050 3500
AR Path="/617C0F6C" Ref="C?"  Part="1" 
AR Path="/617B514C/617C0F6C" Ref="C207"  Part="1" 
AR Path="/619065BF/617C0F6C" Ref="C?"  Part="1" 
AR Path="/61908BA4/617C0F6C" Ref="C?"  Part="1" 
AR Path="/6192AB24/617C0F6C" Ref="C?"  Part="1" 
AR Path="/619332FF/617C0F6C" Ref="C?"  Part="1" 
AR Path="/619B691C/617C0F6C" Ref="C?"  Part="1" 
AR Path="/619BF925/617C0F6C" Ref="C?"  Part="1" 
AR Path="/619C8940/617C0F6C" Ref="C?"  Part="1" 
AR Path="/619BE637/617C0F6C" Ref="C1207"  Part="1" 
AR Path="/619D45F6/617C0F6C" Ref="C1307"  Part="1" 
AR Path="/619EA585/617C0F6C" Ref="C1407"  Part="1" 
F 0 "C1407" V 7050 3200 50  0000 C CNN
F 1 "100n" V 7050 3800 50  0000 C CNN
F 2 "Capacitor_SMD:C_0805_2012Metric" H 7050 3500 50  0001 C CNN
F 3 "~" H 7050 3500 50  0001 C CNN
	1    7050 3500
	0    1    1    0   
$EndComp
$Comp
L Device:C_Small C?
U 1 1 617C0F72
P 7050 3650
AR Path="/617C0F72" Ref="C?"  Part="1" 
AR Path="/617B514C/617C0F72" Ref="C208"  Part="1" 
AR Path="/619065BF/617C0F72" Ref="C?"  Part="1" 
AR Path="/61908BA4/617C0F72" Ref="C?"  Part="1" 
AR Path="/6192AB24/617C0F72" Ref="C?"  Part="1" 
AR Path="/619332FF/617C0F72" Ref="C?"  Part="1" 
AR Path="/619B691C/617C0F72" Ref="C?"  Part="1" 
AR Path="/619BF925/617C0F72" Ref="C?"  Part="1" 
AR Path="/619C8940/617C0F72" Ref="C?"  Part="1" 
AR Path="/619BE637/617C0F72" Ref="C1208"  Part="1" 
AR Path="/619D45F6/617C0F72" Ref="C1308"  Part="1" 
AR Path="/619EA585/617C0F72" Ref="C1408"  Part="1" 
F 0 "C1408" V 7050 3350 50  0000 C CNN
F 1 "10n" V 7050 3950 50  0000 C CNN
F 2 "Capacitor_SMD:C_0805_2012Metric" H 7050 3650 50  0001 C CNN
F 3 "~" H 7050 3650 50  0001 C CNN
	1    7050 3650
	0    1    1    0   
$EndComp
Wire Wire Line
	6950 3800 6950 3650
Connection ~ 6950 3650
Wire Wire Line
	6950 3650 6950 3500
Wire Wire Line
	7150 3500 7150 3650
Connection ~ 7150 3650
Wire Wire Line
	7150 3650 7150 3800
$Comp
L Device:R_Small R?
U 1 1 617C0F95
P 3850 4250
AR Path="/617C0F95" Ref="R?"  Part="1" 
AR Path="/617B514C/617C0F95" Ref="R201"  Part="1" 
AR Path="/619065BF/617C0F95" Ref="R?"  Part="1" 
AR Path="/61908BA4/617C0F95" Ref="R?"  Part="1" 
AR Path="/6192AB24/617C0F95" Ref="R?"  Part="1" 
AR Path="/619332FF/617C0F95" Ref="R?"  Part="1" 
AR Path="/619B691C/617C0F95" Ref="R?"  Part="1" 
AR Path="/619BF925/617C0F95" Ref="R?"  Part="1" 
AR Path="/619C8940/617C0F95" Ref="R?"  Part="1" 
AR Path="/619BE637/617C0F95" Ref="R1201"  Part="1" 
AR Path="/619D45F6/617C0F95" Ref="R1301"  Part="1" 
AR Path="/619EA585/617C0F95" Ref="R1401"  Part="1" 
F 0 "R1401" H 3600 4200 50  0000 L CNN
F 1 "49R9" H 3600 4300 50  0000 L CNN
F 2 "Resistor_SMD:R_0805_2012Metric" H 3850 4250 50  0001 C CNN
F 3 "~" H 3850 4250 50  0001 C CNN
	1    3850 4250
	-1   0    0    1   
$EndComp
Connection ~ 3650 4500
Wire Wire Line
	3850 4150 3850 4100
$Comp
L Connector_Generic:Conn_01x02 J?
U 1 1 617C0FA4
P 3400 4100
AR Path="/617C0FA4" Ref="J?"  Part="1" 
AR Path="/617B514C/617C0FA4" Ref="J201"  Part="1" 
AR Path="/619065BF/617C0FA4" Ref="J?"  Part="1" 
AR Path="/61908BA4/617C0FA4" Ref="J?"  Part="1" 
AR Path="/6192AB24/617C0FA4" Ref="J?"  Part="1" 
AR Path="/619332FF/617C0FA4" Ref="J?"  Part="1" 
AR Path="/619B691C/617C0FA4" Ref="J?"  Part="1" 
AR Path="/619BF925/617C0FA4" Ref="J?"  Part="1" 
AR Path="/619C8940/617C0FA4" Ref="J?"  Part="1" 
AR Path="/619BE637/617C0FA4" Ref="J1201"  Part="1" 
AR Path="/619D45F6/617C0FA4" Ref="J1301"  Part="1" 
AR Path="/619EA585/617C0FA4" Ref="J1401"  Part="1" 
F 0 "J1401" H 3850 4000 50  0000 C CNN
F 1 "Conn_01x02" H 3700 4100 50  0000 C CNN
F 2 "Connector_PinHeader_2.54mm:PinHeader_1x02_P2.54mm_Vertical" H 3400 4100 50  0001 C CNN
F 3 "~" H 3400 4100 50  0001 C CNN
	1    3400 4100
	-1   0    0    -1  
$EndComp
Connection ~ 3650 4200
Wire Wire Line
	3600 4100 3850 4100
Wire Wire Line
	3600 4500 3650 4500
Wire Wire Line
	3850 4400 3850 4350
Wire Wire Line
	3600 4200 3650 4200
Wire Wire Line
	3650 3900 3650 4200
$Comp
L Connector_Generic:Conn_01x02 J?
U 1 1 617C0FB0
P 3400 4400
AR Path="/617C0FB0" Ref="J?"  Part="1" 
AR Path="/617B514C/617C0FB0" Ref="J202"  Part="1" 
AR Path="/619065BF/617C0FB0" Ref="J?"  Part="1" 
AR Path="/61908BA4/617C0FB0" Ref="J?"  Part="1" 
AR Path="/6192AB24/617C0FB0" Ref="J?"  Part="1" 
AR Path="/619332FF/617C0FB0" Ref="J?"  Part="1" 
AR Path="/619B691C/617C0FB0" Ref="J?"  Part="1" 
AR Path="/619BF925/617C0FB0" Ref="J?"  Part="1" 
AR Path="/619C8940/617C0FB0" Ref="J?"  Part="1" 
AR Path="/619BE637/617C0FB0" Ref="J1202"  Part="1" 
AR Path="/619D45F6/617C0FB0" Ref="J1302"  Part="1" 
AR Path="/619EA585/617C0FB0" Ref="J1402"  Part="1" 
F 0 "J1402" H 3850 4300 50  0000 C CNN
F 1 "Conn_01x02" H 3700 4400 50  0000 C CNN
F 2 "Connector_PinHeader_2.54mm:PinHeader_1x02_P2.54mm_Vertical" H 3400 4400 50  0001 C CNN
F 3 "~" H 3400 4400 50  0001 C CNN
	1    3400 4400
	-1   0    0    -1  
$EndComp
Wire Wire Line
	3850 4400 3600 4400
Wire Wire Line
	3850 4100 4250 4100
Connection ~ 3850 4100
Wire Wire Line
	3650 4200 3650 4500
Wire Wire Line
	3650 4500 4250 4500
Wire Wire Line
	4550 2800 8300 2800
$Comp
L Device:R_Small R?
U 1 1 617C0FBD
P 7800 4200
AR Path="/617C0FBD" Ref="R?"  Part="1" 
AR Path="/617B514C/617C0FBD" Ref="R209"  Part="1" 
AR Path="/619065BF/617C0FBD" Ref="R?"  Part="1" 
AR Path="/61908BA4/617C0FBD" Ref="R?"  Part="1" 
AR Path="/6192AB24/617C0FBD" Ref="R?"  Part="1" 
AR Path="/619332FF/617C0FBD" Ref="R?"  Part="1" 
AR Path="/619B691C/617C0FBD" Ref="R?"  Part="1" 
AR Path="/619BF925/617C0FBD" Ref="R?"  Part="1" 
AR Path="/619C8940/617C0FBD" Ref="R?"  Part="1" 
AR Path="/619BE637/617C0FBD" Ref="R1209"  Part="1" 
AR Path="/619D45F6/617C0FBD" Ref="R1309"  Part="1" 
AR Path="/619EA585/617C0FBD" Ref="R1409"  Part="1" 
F 0 "R1409" V 7696 4200 50  0000 C CNN
F 1 "330R" V 7605 4200 50  0000 C CNN
F 2 "Resistor_SMD:R_0805_2012Metric" H 7800 4200 50  0001 C CNN
F 3 "~" H 7800 4200 50  0001 C CNN
	1    7800 4200
	0    -1   -1   0   
$EndComp
Text HLabel 8300 2800 2    50   Input ~ 0
SW
Text HLabel 8300 4200 2    50   Output ~ 0
OUT
Wire Wire Line
	3650 4500 3650 4700
Wire Wire Line
	7000 4400 7000 4700
Wire Wire Line
	6250 4650 6250 4700
Wire Wire Line
	6000 4650 6000 4700
Wire Wire Line
	5300 4500 5300 4700
Wire Wire Line
	6000 3400 6000 3650
$Comp
L power:GND #PWR?
U 1 1 61896381
P 8000 4700
AR Path="/619C8940/61896381" Ref="#PWR?"  Part="1" 
AR Path="/619BF925/61896381" Ref="#PWR?"  Part="1" 
AR Path="/617B514C/61896381" Ref="#PWR0212"  Part="1" 
AR Path="/619BE637/61896381" Ref="#PWR01212"  Part="1" 
AR Path="/619D45F6/61896381" Ref="#PWR01312"  Part="1" 
AR Path="/619EA585/61896381" Ref="#PWR01412"  Part="1" 
F 0 "#PWR01412" H 8000 4450 50  0001 C CNN
F 1 "GND" H 8005 4527 50  0000 C CNN
F 2 "" H 8000 4700 50  0001 C CNN
F 3 "" H 8000 4700 50  0001 C CNN
	1    8000 4700
	1    0    0    -1  
$EndComp
$Comp
L power:GND #PWR?
U 1 1 618967D6
P 7000 4700
AR Path="/619C8940/618967D6" Ref="#PWR?"  Part="1" 
AR Path="/619BF925/618967D6" Ref="#PWR?"  Part="1" 
AR Path="/617B514C/618967D6" Ref="#PWR0210"  Part="1" 
AR Path="/619BE637/618967D6" Ref="#PWR01210"  Part="1" 
AR Path="/619D45F6/618967D6" Ref="#PWR01310"  Part="1" 
AR Path="/619EA585/618967D6" Ref="#PWR01410"  Part="1" 
F 0 "#PWR01410" H 7000 4450 50  0001 C CNN
F 1 "GND" H 7005 4527 50  0000 C CNN
F 2 "" H 7000 4700 50  0001 C CNN
F 3 "" H 7000 4700 50  0001 C CNN
	1    7000 4700
	1    0    0    -1  
$EndComp
$Comp
L power:GND #PWR?
U 1 1 61896AE3
P 6250 4700
AR Path="/619C8940/61896AE3" Ref="#PWR?"  Part="1" 
AR Path="/619BF925/61896AE3" Ref="#PWR?"  Part="1" 
AR Path="/617B514C/61896AE3" Ref="#PWR0208"  Part="1" 
AR Path="/619BE637/61896AE3" Ref="#PWR01208"  Part="1" 
AR Path="/619D45F6/61896AE3" Ref="#PWR01308"  Part="1" 
AR Path="/619EA585/61896AE3" Ref="#PWR01408"  Part="1" 
F 0 "#PWR01408" H 6250 4450 50  0001 C CNN
F 1 "GND" H 6255 4527 50  0000 C CNN
F 2 "" H 6250 4700 50  0001 C CNN
F 3 "" H 6250 4700 50  0001 C CNN
	1    6250 4700
	1    0    0    -1  
$EndComp
$Comp
L power:GND #PWR?
U 1 1 61896E90
P 6000 4700
AR Path="/619C8940/61896E90" Ref="#PWR?"  Part="1" 
AR Path="/619BF925/61896E90" Ref="#PWR?"  Part="1" 
AR Path="/617B514C/61896E90" Ref="#PWR0207"  Part="1" 
AR Path="/619BE637/61896E90" Ref="#PWR01207"  Part="1" 
AR Path="/619D45F6/61896E90" Ref="#PWR01307"  Part="1" 
AR Path="/619EA585/61896E90" Ref="#PWR01407"  Part="1" 
F 0 "#PWR01407" H 6000 4450 50  0001 C CNN
F 1 "GND" H 6005 4527 50  0000 C CNN
F 2 "" H 6000 4700 50  0001 C CNN
F 3 "" H 6000 4700 50  0001 C CNN
	1    6000 4700
	1    0    0    -1  
$EndComp
$Comp
L power:GND #PWR?
U 1 1 61897052
P 5300 4700
AR Path="/619C8940/61897052" Ref="#PWR?"  Part="1" 
AR Path="/619BF925/61897052" Ref="#PWR?"  Part="1" 
AR Path="/617B514C/61897052" Ref="#PWR0204"  Part="1" 
AR Path="/619BE637/61897052" Ref="#PWR01204"  Part="1" 
AR Path="/619D45F6/61897052" Ref="#PWR01304"  Part="1" 
AR Path="/619EA585/61897052" Ref="#PWR01404"  Part="1" 
F 0 "#PWR01404" H 5300 4450 50  0001 C CNN
F 1 "GND" H 5305 4527 50  0000 C CNN
F 2 "" H 5300 4700 50  0001 C CNN
F 3 "" H 5300 4700 50  0001 C CNN
	1    5300 4700
	1    0    0    -1  
$EndComp
$Comp
L power:GND #PWR?
U 1 1 618973C7
P 3650 4700
AR Path="/619C8940/618973C7" Ref="#PWR?"  Part="1" 
AR Path="/619BF925/618973C7" Ref="#PWR?"  Part="1" 
AR Path="/617B514C/618973C7" Ref="#PWR0201"  Part="1" 
AR Path="/619BE637/618973C7" Ref="#PWR01201"  Part="1" 
AR Path="/619D45F6/618973C7" Ref="#PWR01301"  Part="1" 
AR Path="/619EA585/618973C7" Ref="#PWR01401"  Part="1" 
F 0 "#PWR01401" H 3650 4450 50  0001 C CNN
F 1 "GND" H 3655 4527 50  0000 C CNN
F 2 "" H 3650 4700 50  0001 C CNN
F 3 "" H 3650 4700 50  0001 C CNN
	1    3650 4700
	1    0    0    -1  
$EndComp
$Comp
L Device:R_Small R?
U 1 1 617C0FC3
P 8000 4500
AR Path="/617C0FC3" Ref="R?"  Part="1" 
AR Path="/617B514C/617C0FC3" Ref="R210"  Part="1" 
AR Path="/619065BF/617C0FC3" Ref="R?"  Part="1" 
AR Path="/61908BA4/617C0FC3" Ref="R?"  Part="1" 
AR Path="/6192AB24/617C0FC3" Ref="R?"  Part="1" 
AR Path="/619332FF/617C0FC3" Ref="R?"  Part="1" 
AR Path="/619B691C/617C0FC3" Ref="R?"  Part="1" 
AR Path="/619BF925/617C0FC3" Ref="R?"  Part="1" 
AR Path="/619C8940/617C0FC3" Ref="R?"  Part="1" 
AR Path="/619BE637/617C0FC3" Ref="R1210"  Part="1" 
AR Path="/619D45F6/617C0FC3" Ref="R1310"  Part="1" 
AR Path="/619EA585/617C0FC3" Ref="R1410"  Part="1" 
F 0 "R1410" H 7941 4454 50  0000 R CNN
F 1 "620R" H 7941 4545 50  0000 R CNN
F 2 "Resistor_SMD:R_0805_2012Metric" H 8000 4500 50  0001 C CNN
F 3 "~" H 8000 4500 50  0001 C CNN
	1    8000 4500
	-1   0    0    1   
$EndComp
Wire Wire Line
	8000 4400 8000 4200
Connection ~ 8000 4200
Wire Wire Line
	8000 4200 7900 4200
$Comp
L power:GND #PWR?
U 1 1 618E25F9
P 7250 3700
AR Path="/619C8940/618E25F9" Ref="#PWR?"  Part="1" 
AR Path="/619BF925/618E25F9" Ref="#PWR?"  Part="1" 
AR Path="/617B514C/618E25F9" Ref="#PWR0211"  Part="1" 
AR Path="/619BE637/618E25F9" Ref="#PWR01211"  Part="1" 
AR Path="/619D45F6/618E25F9" Ref="#PWR01311"  Part="1" 
AR Path="/619EA585/618E25F9" Ref="#PWR01411"  Part="1" 
F 0 "#PWR01411" H 7250 3450 50  0001 C CNN
F 1 "GND" H 7255 3527 50  0000 C CNN
F 2 "" H 7250 3700 50  0001 C CNN
F 3 "" H 7250 3700 50  0001 C CNN
	1    7250 3700
	1    0    0    -1  
$EndComp
$Comp
L power:GND #PWR?
U 1 1 618E28E6
P 5500 3700
AR Path="/619C8940/618E28E6" Ref="#PWR?"  Part="1" 
AR Path="/619BF925/618E28E6" Ref="#PWR?"  Part="1" 
AR Path="/617B514C/618E28E6" Ref="#PWR0205"  Part="1" 
AR Path="/619BE637/618E28E6" Ref="#PWR01205"  Part="1" 
AR Path="/619D45F6/618E28E6" Ref="#PWR01305"  Part="1" 
AR Path="/619EA585/618E28E6" Ref="#PWR01405"  Part="1" 
F 0 "#PWR01405" H 5500 3450 50  0001 C CNN
F 1 "GND" H 5505 3527 50  0000 C CNN
F 2 "" H 5500 3700 50  0001 C CNN
F 3 "" H 5500 3700 50  0001 C CNN
	1    5500 3700
	1    0    0    -1  
$EndComp
Connection ~ 5500 3700
$Comp
L power:+5V #PWR?
U 1 1 618E2FEB
P 6950 3500
AR Path="/619C8940/618E2FEB" Ref="#PWR?"  Part="1" 
AR Path="/619BF925/618E2FEB" Ref="#PWR?"  Part="1" 
AR Path="/617B514C/618E2FEB" Ref="#PWR0209"  Part="1" 
AR Path="/619BE637/618E2FEB" Ref="#PWR01209"  Part="1" 
AR Path="/619D45F6/618E2FEB" Ref="#PWR01309"  Part="1" 
AR Path="/619EA585/618E2FEB" Ref="#PWR01409"  Part="1" 
F 0 "#PWR01409" H 6950 3350 50  0001 C CNN
F 1 "+5V" H 6965 3673 50  0000 C CNN
F 2 "" H 6950 3500 50  0001 C CNN
F 3 "" H 6950 3500 50  0001 C CNN
	1    6950 3500
	1    0    0    -1  
$EndComp
Connection ~ 6950 3500
$Comp
L power:+5V #PWR?
U 1 1 618E348E
P 5300 3400
AR Path="/619C8940/618E348E" Ref="#PWR?"  Part="1" 
AR Path="/619BF925/618E348E" Ref="#PWR?"  Part="1" 
AR Path="/617B514C/618E348E" Ref="#PWR0203"  Part="1" 
AR Path="/619BE637/618E348E" Ref="#PWR01203"  Part="1" 
AR Path="/619D45F6/618E348E" Ref="#PWR01303"  Part="1" 
AR Path="/619EA585/618E348E" Ref="#PWR01403"  Part="1" 
F 0 "#PWR01403" H 5300 3250 50  0001 C CNN
F 1 "+5V" H 5315 3573 50  0000 C CNN
F 2 "" H 5300 3400 50  0001 C CNN
F 3 "" H 5300 3400 50  0001 C CNN
	1    5300 3400
	1    0    0    -1  
$EndComp
Connection ~ 5300 3400
Wire Wire Line
	7350 4200 7700 4200
NoConn ~ 7350 4000
$Comp
L Device:R_Small R?
U 1 1 618CE332
P 6700 4500
AR Path="/61833839/618CE332" Ref="R?"  Part="1" 
AR Path="/622F77ED/618CE332" Ref="R?"  Part="1" 
AR Path="/622F77ED/61EFFE1E/618CE332" Ref="R?"  Part="1" 
AR Path="/622F77ED/61FD0F9D/618CE332" Ref="R?"  Part="1" 
AR Path="/617B514C/618CE332" Ref="R212"  Part="1" 
AR Path="/619BE637/618CE332" Ref="R1212"  Part="1" 
AR Path="/619D45F6/618CE332" Ref="R1312"  Part="1" 
AR Path="/619EA585/618CE332" Ref="R1412"  Part="1" 
F 0 "R1412" H 6641 4454 50  0000 R CNN
F 1 "DNP" H 6641 4545 50  0000 R CNN
F 2 "Resistor_SMD:R_0805_2012Metric" H 6700 4500 50  0001 C CNN
F 3 "~" H 6700 4500 50  0001 C CNN
	1    6700 4500
	-1   0    0    1   
$EndComp
Wire Wire Line
	6700 4400 6700 4000
Connection ~ 6700 4000
Wire Wire Line
	6700 4000 6750 4000
$Comp
L Comparator:AD8561 U?
U 1 1 618CE343
P 7050 4100
AR Path="/622F77ED/61FD0F9D/618CE343" Ref="U?"  Part="1" 
AR Path="/622F77ED/61EFFE1E/618CE343" Ref="U?"  Part="1" 
AR Path="/617B514C/618CE343" Ref="U202"  Part="1" 
AR Path="/619BE637/618CE343" Ref="U1202"  Part="1" 
AR Path="/619D45F6/618CE343" Ref="U1302"  Part="1" 
AR Path="/619EA585/618CE343" Ref="U1402"  Part="1" 
F 0 "U1402" H 7394 4146 50  0000 L CNN
F 1 "AD8561" H 7394 4055 50  0000 L CNN
F 2 "Package_SO:SOIC-8_3.9x4.9mm_P1.27mm" H 7050 4100 50  0001 C CNN
F 3 "https://www.analog.com/media/en/technical-documentation/data-sheets/ad8561.pdf" H 7050 4100 50  0001 C CNN
	1    7050 4100
	1    0    0    -1  
$EndComp
Wire Wire Line
	7250 3700 7250 3650
Wire Wire Line
	7250 3650 7150 3650
$Comp
L power:GND #PWR?
U 1 1 618D24A6
P 6700 4700
AR Path="/619C8940/618D24A6" Ref="#PWR?"  Part="1" 
AR Path="/619BF925/618D24A6" Ref="#PWR?"  Part="1" 
AR Path="/617B514C/618D24A6" Ref="#PWR0213"  Part="1" 
AR Path="/619BE637/618D24A6" Ref="#PWR01413"  Part="1" 
AR Path="/619D45F6/618D24A6" Ref="#PWR01501"  Part="1" 
AR Path="/619EA585/618D24A6" Ref="#PWR01601"  Part="1" 
F 0 "#PWR01601" H 6700 4450 50  0001 C CNN
F 1 "GND" H 6705 4527 50  0000 C CNN
F 2 "" H 6700 4700 50  0001 C CNN
F 3 "" H 6700 4700 50  0001 C CNN
	1    6700 4700
	1    0    0    -1  
$EndComp
Wire Wire Line
	6950 4400 7000 4400
Connection ~ 6950 3800
Connection ~ 7150 3800
Connection ~ 7000 4400
Wire Wire Line
	7000 4400 7050 4400
Wire Wire Line
	6700 4700 6700 4600
Wire Wire Line
	6600 4000 6700 4000
$Comp
L Device:R_Small R?
U 1 1 618CE32B
P 6500 4000
AR Path="/61833839/618CE32B" Ref="R?"  Part="1" 
AR Path="/622F77ED/618CE32B" Ref="R?"  Part="1" 
AR Path="/622F77ED/61EFFE1E/618CE32B" Ref="R?"  Part="1" 
AR Path="/622F77ED/61FD0F9D/618CE32B" Ref="R?"  Part="1" 
AR Path="/617B514C/618CE32B" Ref="R211"  Part="1" 
AR Path="/619BE637/618CE32B" Ref="R1211"  Part="1" 
AR Path="/619D45F6/618CE32B" Ref="R1311"  Part="1" 
AR Path="/619EA585/618CE32B" Ref="R1411"  Part="1" 
F 0 "R1411" V 6304 4000 50  0000 C CNN
F 1 "100R" V 6395 4000 50  0000 C CNN
F 2 "Resistor_SMD:R_0805_2012Metric" H 6500 4000 50  0001 C CNN
F 3 "~" H 6500 4000 50  0001 C CNN
	1    6500 4000
	0    1    1    0   
$EndComp
$Comp
L Device:C_Small C?
U 1 1 617C0ED8
P 6250 4550
AR Path="/617C0ED8" Ref="C?"  Part="1" 
AR Path="/617B514C/617C0ED8" Ref="C206"  Part="1" 
AR Path="/619065BF/617C0ED8" Ref="C?"  Part="1" 
AR Path="/61908BA4/617C0ED8" Ref="C?"  Part="1" 
AR Path="/6192AB24/617C0ED8" Ref="C?"  Part="1" 
AR Path="/619332FF/617C0ED8" Ref="C?"  Part="1" 
AR Path="/619B691C/617C0ED8" Ref="C?"  Part="1" 
AR Path="/619BF925/617C0ED8" Ref="C?"  Part="1" 
AR Path="/619C8940/617C0ED8" Ref="C?"  Part="1" 
AR Path="/619BE637/617C0ED8" Ref="C1206"  Part="1" 
AR Path="/619D45F6/617C0ED8" Ref="C1306"  Part="1" 
AR Path="/619EA585/617C0ED8" Ref="C1406"  Part="1" 
F 0 "C1406" H 6342 4596 50  0000 L CNN
F 1 "10n" H 6342 4505 50  0000 L CNN
F 2 "Capacitor_SMD:C_0805_2012Metric" H 6250 4550 50  0001 C CNN
F 3 "~" H 6250 4550 50  0001 C CNN
	1    6250 4550
	1    0    0    -1  
$EndComp
Wire Wire Line
	6250 4000 6400 4000
Connection ~ 6250 4000
Wire Wire Line
	5750 4000 6250 4000
Wire Wire Line
	6250 3250 6250 4000
Wire Wire Line
	8000 4200 8300 4200
Wire Wire Line
	8000 3250 8000 3800
$Comp
L Device:R_Small R?
U 1 1 618FAB1F
P 8000 3900
AR Path="/618FAB1F" Ref="R?"  Part="1" 
AR Path="/617B514C/618FAB1F" Ref="R213"  Part="1" 
AR Path="/619065BF/618FAB1F" Ref="R?"  Part="1" 
AR Path="/61908BA4/618FAB1F" Ref="R?"  Part="1" 
AR Path="/6192AB24/618FAB1F" Ref="R?"  Part="1" 
AR Path="/619332FF/618FAB1F" Ref="R?"  Part="1" 
AR Path="/619B691C/618FAB1F" Ref="R?"  Part="1" 
AR Path="/619BF925/618FAB1F" Ref="R?"  Part="1" 
AR Path="/619C8940/618FAB1F" Ref="R?"  Part="1" 
AR Path="/619BE637/618FAB1F" Ref="R1213"  Part="1" 
AR Path="/619D45F6/618FAB1F" Ref="R1313"  Part="1" 
AR Path="/619EA585/618FAB1F" Ref="R1413"  Part="1" 
F 0 "R1413" H 7941 3854 50  0000 R CNN
F 1 "DNP" H 7941 3945 50  0000 R CNN
F 2 "Resistor_SMD:R_0805_2012Metric" H 8000 3900 50  0001 C CNN
F 3 "~" H 8000 3900 50  0001 C CNN
	1    8000 3900
	-1   0    0    1   
$EndComp
Wire Wire Line
	8000 4600 8000 4700
Wire Wire Line
	8000 4000 8000 4200
Wire Wire Line
	6250 3250 8000 3250
Wire Wire Line
	6000 3850 6000 4200
Wire Wire Line
	6000 4200 6250 4200
Connection ~ 6000 4200
Wire Wire Line
	6000 4200 6000 4450
$Comp
L project_power:+VREF_A #PWR0154
U 1 1 618FE0B5
P 6000 3400
AR Path="/617B514C/618FE0B5" Ref="#PWR0154"  Part="1" 
AR Path="/619BE637/618FE0B5" Ref="#PWR0159"  Part="1" 
AR Path="/619D45F6/618FE0B5" Ref="#PWR0149"  Part="1" 
AR Path="/619EA585/618FE0B5" Ref="#PWR0151"  Part="1" 
F 0 "#PWR0151" H 6000 3250 50  0001 C CNN
F 1 "+VREF_A" H 6015 3573 50  0000 C CNN
F 2 "" H 6000 3400 50  0001 C CNN
F 3 "" H 6000 3400 50  0001 C CNN
	1    6000 3400
	1    0    0    -1  
$EndComp
Wire Wire Line
	4750 3400 4850 3400
$Comp
L project_power:+VREF_A #PWR0158
U 1 1 618FFE87
P 4850 3400
AR Path="/617B514C/618FFE87" Ref="#PWR0158"  Part="1" 
AR Path="/619BE637/618FFE87" Ref="#PWR0148"  Part="1" 
AR Path="/619D45F6/618FFE87" Ref="#PWR0150"  Part="1" 
AR Path="/619EA585/618FFE87" Ref="#PWR0152"  Part="1" 
F 0 "#PWR0152" H 4850 3250 50  0001 C CNN
F 1 "+VREF_A" H 4865 3573 50  0000 C CNN
F 2 "" H 4850 3400 50  0001 C CNN
F 3 "" H 4850 3400 50  0001 C CNN
	1    4850 3400
	1    0    0    -1  
$EndComp
Connection ~ 4850 3400
Wire Wire Line
	4850 3400 4950 3400
Text Notes 6600 4200 2    50   Italic 0
0.807V
$EndSCHEMATC
