(module IMM0112D05 (layer F.Cu) (tedit 617F0B67)
  (fp_text reference REF** (at -3.81 -3.556) (layer F.SilkS)
    (effects (font (size 1 1) (thickness 0.15)))
  )
  (fp_text value IMM0112D05 (at -1.27 18.796) (layer F.Fab)
    (effects (font (size 1 1) (thickness 0.15)))
  )
  (fp_line (start -6.35 17.78) (end 3.81 17.78) (layer F.CrtYd) (width 0.12))
  (fp_line (start -6.35 -2.54) (end -6.35 17.78) (layer F.CrtYd) (width 0.12))
  (fp_line (start 3.81 -2.54) (end -6.35 -2.54) (layer F.CrtYd) (width 0.12))
  (fp_line (start 3.81 17.78) (end 3.81 -2.54) (layer F.CrtYd) (width 0.12))
  (fp_line (start 3.302 17.272) (end 3.302 -2.032) (layer F.SilkS) (width 0.12))
  (fp_line (start -5.842 17.272) (end 3.302 17.272) (layer F.SilkS) (width 0.12))
  (fp_line (start -5.842 -2.032) (end -5.842 17.272) (layer F.SilkS) (width 0.12))
  (fp_line (start 3.302 -2.032) (end -5.842 -2.032) (layer F.SilkS) (width 0.12))
  (pad 1 thru_hole circle (at 0 0) (size 1.524 1.524) (drill 0.762) (layers *.Cu *.Mask))
  (pad 2 thru_hole circle (at 0 2.54) (size 1.524 1.524) (drill 0.762) (layers *.Cu *.Mask))
  (pad 3 thru_hole circle (at 0 5.08) (size 1.524 1.524) (drill 0.762) (layers *.Cu *.Mask))
  (pad 5 thru_hole circle (at 0 10.16) (size 1.524 1.524) (drill 0.762) (layers *.Cu *.Mask))
  (pad 6 thru_hole circle (at 0 12.7) (size 1.524 1.524) (drill 0.762) (layers *.Cu *.Mask))
  (pad 7 thru_hole circle (at 0 15.24) (size 1.524 1.524) (drill 0.762) (layers *.Cu *.Mask))
  (model "${KIPRJMOD}/modules/dcdc.3dshapes/IMM01(D).STEP"
    (offset (xyz 3.3 -7.6 7))
    (scale (xyz 1 1 1))
    (rotate (xyz 180 0 90))
  )
)
