vhdl work "util_pkg.vhd"
vhdl work "lx_dad_pkg.vhd"
vhdl work "xilinx_dualport_bram.vhd"
vhdl work "dff3.vhd"
vhdl work "dff2.vhd"
vhdl work "cnt_div.vhd"
vhdl work "measurement_register.vhd"
vhdl work "lx_crosdom_ser_fifo.vhd"
vhdl work "bus_measurement.vhd"
vhdl work "bus_example.vhd"
vhdl work "lx_example_mem.vhd"
vhdl work "lx_adc_if.vhd"
vhdl work "bus_sensor.vhd"
vhdl work "sensor_mem.vhd
vhdl work "clockgen.vhd"
vhdl work "lx_dad_top.vhd"
