{
  "databases": [
    {
      "description": "some database",
      "hostname": "127.3.3.7",
      "port": "1337",
      "username": "someuser",
      "password": "somepassword",
      "database": "somedb",
      "type": "Mysql 5.5"
    },
    {
      "description": "some other database",
      "hostname": "127.4.4.8",
      "port": "1448",
      "username": "someotheruser",
      "password": "someotherpassword",
      "database": "someotherdb",
      "type": "Mysql 5.5"
    }
  ]
}
