@startuml

frame "Situated System" {
    [Locator]
    () "LowLevelData" as RP
    [Observed Item]
}

[Localization Service]

() "RegisterAngle" as RA
() "GetLocations" as GL

[Locator] --> RP
[Observed Item] ..> RP

[Localization Service] -down-> RA
[Locator] .right.> RA

[Localization Service] -up-> GL
Actor user
user ..> GL
@enduml
