\relax 
\providecommand\hyper@newdestlabel[2]{}
\citation{book-aima}
\citation{book-aima}
\@writefile{toc}{\contentsline {chapter}{\numberline {2}Background}{6}{chapter.2}\protected@file@percent }
\@writefile{lof}{\addvspace {10\p@ }}
\@writefile{lot}{\addvspace {10\p@ }}
\newlabel{cap2}{{2}{6}{Background}{chapter.2}{}}
\@writefile{toc}{\contentsline {section}{\numberline {2.1}Programmazione logica}{6}{section.2.1}\protected@file@percent }
\citation{book-aima}
\citation{tuprolog-article}
\citation{gnu-lgpl-page}
\@writefile{toc}{\contentsline {section}{\numberline {2.2}tuProlog}{7}{section.2.2}\protected@file@percent }
\citation{tuprolog-manual}
\@writefile{lof}{\contentsline {figure}{\numberline {2.1}{\ignorespaces Logo del software tuProlog}}{8}{figure.2.1}\protected@file@percent }
\newlabel{tuprolog-logo}{{2.1}{8}{Logo del software tuProlog}{figure.2.1}{}}
\citation{thesis-context}
\citation{thesis-context}
\@writefile{toc}{\contentsline {section}{\numberline {2.3}Context-Awareness nelle tecniche di Reasoning}{9}{section.2.3}\protected@file@percent }
\citation{book-aima}
\citation{lpaas-article}
\citation{lpaas-article}
\@writefile{toc}{\contentsline {section}{\numberline {2.4}Logic Programming as a Service}{10}{section.2.4}\protected@file@percent }
\@writefile{lof}{\contentsline {figure}{\numberline {2.2}{\ignorespaces Interfacce utente dell'architettura LPaaS}}{11}{figure.2.2}\protected@file@percent }
\newlabel{lpaas-interface}{{2.2}{11}{Interfacce utente dell'architettura LPaaS}{figure.2.2}{}}
\citation{book-lfdata}
\citation{book-lfdata}
\@writefile{toc}{\contentsline {section}{\numberline {2.5}Machine Learning}{12}{section.2.5}\protected@file@percent }
\citation{book-lfdata}
\citation{book-aima}
\citation{book-aima}
\@writefile{toc}{\contentsline {section}{\numberline {2.6}Alberi decisionali}{14}{section.2.6}\protected@file@percent }
\@writefile{lof}{\contentsline {figure}{\numberline {2.3}{\ignorespaces Esempio grafico di albero decisionale}}{14}{figure.2.3}\protected@file@percent }
\newlabel{decision-tree-example}{{2.3}{14}{Esempio grafico di albero decisionale}{figure.2.3}{}}
\citation{book-aima}
\citation{book-aima}
\@setckpt{Background}{
\setcounter{page}{17}
\setcounter{equation}{0}
\setcounter{enumi}{0}
\setcounter{enumii}{0}
\setcounter{enumiii}{0}
\setcounter{enumiv}{0}
\setcounter{footnote}{0}
\setcounter{mpfootnote}{0}
\setcounter{part}{0}
\setcounter{chapter}{2}
\setcounter{section}{6}
\setcounter{subsection}{0}
\setcounter{subsubsection}{0}
\setcounter{paragraph}{0}
\setcounter{subparagraph}{0}
\setcounter{figure}{3}
\setcounter{table}{0}
\setcounter{Item}{0}
\setcounter{Hfootnote}{0}
\setcounter{bookmark@seq@number}{8}
\setcounter{lstnumber}{1}
\setcounter{section@level}{1}
\setcounter{lstlisting}{0}
}
