\relax 
\providecommand\hyper@newdestlabel[2]{}
\@writefile{toc}{\contentsline {chapter}{\numberline {4}Explainable AI}{27}{chapter.4}\protected@file@percent }
\@writefile{lof}{\addvspace {10\p@ }}
\@writefile{lot}{\addvspace {10\p@ }}
\@writefile{toc}{\contentsline {section}{\numberline {4.1}Formalizzazione delle strutture}{28}{section.4.1}\protected@file@percent }
\@writefile{toc}{\contentsline {section}{\numberline {4.2}Modellazione di un'architettura}{30}{section.4.2}\protected@file@percent }
\@writefile{toc}{\contentsline {subsection}{\numberline {4.2.1}Struttura concettuale}{30}{subsection.4.2.1}\protected@file@percent }
\@writefile{lof}{\contentsline {figure}{\numberline {4.1}{\ignorespaces Modello ad entit\IeC {\`a} della proposta progettuale}}{30}{figure.4.1}\protected@file@percent }
\newlabel{entity-model-1}{{4.1}{30}{Modello ad entità della proposta progettuale}{figure.4.1}{}}
\newlabel{req-fun1}{{1}{30}{Struttura concettuale}{Item.1}{}}
\newlabel{req-fun2}{{2}{31}{Struttura concettuale}{Item.2}{}}
\newlabel{req-fun3}{{3}{31}{Struttura concettuale}{Item.3}{}}
\newlabel{req-fun4}{{4}{31}{Struttura concettuale}{Item.4}{}}
\newlabel{req-fun5}{{5}{31}{Struttura concettuale}{Item.5}{}}
\newlabel{req-fun6}{{6}{31}{Struttura concettuale}{Item.6}{}}
\@writefile{toc}{\contentsline {subsection}{\numberline {4.2.2}Machine Learning Interface}{31}{subsection.4.2.2}\protected@file@percent }
\@writefile{lof}{\contentsline {figure}{\numberline {4.2}{\ignorespaces Flussi di lavoro previsti nel blocco Machine Learning Interface}}{32}{figure.4.2}\protected@file@percent }
\newlabel{entity-model-2}{{4.2}{32}{Flussi di lavoro previsti nel blocco Machine Learning Interface}{figure.4.2}{}}
\@writefile{toc}{\contentsline {subsection}{\numberline {4.2.3}Knowledge Base}{32}{subsection.4.2.3}\protected@file@percent }
\citation{book-aima}
\citation{book-aima}
\@writefile{lof}{\contentsline {figure}{\numberline {4.3}{\ignorespaces Modello concettuale del blocco Knowledge Base}}{33}{figure.4.3}\protected@file@percent }
\newlabel{entity-model-3}{{4.3}{33}{Modello concettuale del blocco Knowledge Base}{figure.4.3}{}}
\@writefile{toc}{\contentsline {subsection}{\numberline {4.2.4}Machine Learning to Prolog}{33}{subsection.4.2.4}\protected@file@percent }
\@writefile{toc}{\contentsline {subsection}{\numberline {4.2.5}Prolog to Machine Learning}{35}{subsection.4.2.5}\protected@file@percent }
\citation{book-aima}
\@writefile{toc}{\contentsline {subsection}{\numberline {4.2.6}Demonstration}{36}{subsection.4.2.6}\protected@file@percent }
\@writefile{lof}{\contentsline {figure}{\numberline {4.4}{\ignorespaces Flussi di lavoro d'esempio per il blocco Demonstration}}{36}{figure.4.4}\protected@file@percent }
\newlabel{entity-model-4}{{4.4}{36}{Flussi di lavoro d'esempio per il blocco Demonstration}{figure.4.4}{}}
\@writefile{toc}{\contentsline {section}{\numberline {4.3}Considerazioni finali}{37}{section.4.3}\protected@file@percent }
\@setckpt{Progetto}{
\setcounter{page}{40}
\setcounter{equation}{0}
\setcounter{enumi}{6}
\setcounter{enumii}{0}
\setcounter{enumiii}{0}
\setcounter{enumiv}{0}
\setcounter{footnote}{0}
\setcounter{mpfootnote}{0}
\setcounter{part}{0}
\setcounter{chapter}{4}
\setcounter{section}{3}
\setcounter{subsection}{0}
\setcounter{subsubsection}{0}
\setcounter{paragraph}{0}
\setcounter{subparagraph}{0}
\setcounter{figure}{4}
\setcounter{table}{0}
\setcounter{Item}{6}
\setcounter{Hfootnote}{0}
\setcounter{bookmark@seq@number}{23}
\setcounter{lstnumber}{1}
\setcounter{section@level}{1}
\setcounter{lstlisting}{0}
}
