\relax 
\providecommand\hyper@newdestlabel[2]{}
\@writefile{toc}{\contentsline {chapter}{\numberline {6}Considerazioni e sviluppi futuri}{78}{chapter.6}\protected@file@percent }
\@writefile{lof}{\addvspace {10\p@ }}
\@writefile{lot}{\addvspace {10\p@ }}
\@writefile{toc}{\contentsline {section}{\numberline {6.1}Considerazioni sulla proposta architetturale}{79}{section.6.1}\protected@file@percent }
\@writefile{lof}{\contentsline {figure}{\numberline {6.1}{\ignorespaces Architettura concettuale rivista in un'ottica distribuita}}{80}{figure.6.1}\protected@file@percent }
\newlabel{futuredev-1}{{6.1}{80}{Architettura concettuale rivista in un'ottica distribuita}{figure.6.1}{}}
\@writefile{lof}{\contentsline {figure}{\numberline {6.2}{\ignorespaces Esempio di interfaccia di comunicazione unificata nel servizio}}{81}{figure.6.2}\protected@file@percent }
\newlabel{futuredev-2}{{6.2}{81}{Esempio di interfaccia di comunicazione unificata nel servizio}{figure.6.2}{}}
\@writefile{toc}{\contentsline {section}{\numberline {6.2}Considerazioni sul prototipo}{81}{section.6.2}\protected@file@percent }
\@setckpt{Conclusioni}{
\setcounter{page}{85}
\setcounter{equation}{0}
\setcounter{enumi}{14}
\setcounter{enumii}{0}
\setcounter{enumiii}{0}
\setcounter{enumiv}{0}
\setcounter{footnote}{0}
\setcounter{mpfootnote}{0}
\setcounter{part}{0}
\setcounter{chapter}{6}
\setcounter{section}{2}
\setcounter{subsection}{0}
\setcounter{subsubsection}{0}
\setcounter{paragraph}{0}
\setcounter{subparagraph}{0}
\setcounter{figure}{2}
\setcounter{table}{0}
\setcounter{Item}{31}
\setcounter{Hfootnote}{0}
\setcounter{bookmark@seq@number}{42}
\setcounter{lstnumber}{9}
\setcounter{section@level}{1}
\setcounter{lstlisting}{0}
}
