\relax 
\providecommand\hyper@newdestlabel[2]{}
\providecommand\HyperFirstAtBeginDocument{\AtBeginDocument}
\HyperFirstAtBeginDocument{\ifx\hyper@anchor\@undefined
\global\let\oldcontentsline\contentsline
\gdef\contentsline#1#2#3#4{\oldcontentsline{#1}{#2}{#3}}
\global\let\oldnewlabel\newlabel
\gdef\newlabel#1#2{\newlabelxx{#1}#2}
\gdef\newlabelxx#1#2#3#4#5#6{\oldnewlabel{#1}{{#2}{#3}}}
\AtEndDocument{\ifx\hyper@anchor\@undefined
\let\contentsline\oldcontentsline
\let\newlabel\oldnewlabel
\fi}
\fi}
\global\let\hyper@last\relax 
\gdef\HyperFirstAtBeginDocument#1{#1}
\providecommand\HyField@AuxAddToFields[1]{}
\providecommand\HyField@AuxAddToCoFields[2]{}
\babel@aux{italian}{}
\babel@aux{italian}{}
\@input{Introduzione.aux}
\@input{Background.aux}
\@input{Valutazione.aux}
\@input{Progetto.aux}
\@input{Implementazione.aux}
\@input{Conclusioni.aux}
\@input{Finale.aux}
\bibdata{Bibliografia}
\bibcite{anaconda-page}{1}
\bibcite{google-soc-page}{2}
\bibcite{apache2-page}{3}
\bibcite{gnu-lgpl-page}{4}
\bibcite{bsd-page}{5}
\bibcite{theano-page}{6}
\bibcite{gnu-gpl-page}{7}
\bibcite{weka-javadoc}{8}
\bibcite{mit-page}{9}
\bibcite{keras-page}{10}
\bibcite{cntk-page}{11}
\bibcite{python-page}{12}
\bibcite{tf-page}{13}
\bibcite{weka-page}{14}
\bibcite{book-lfdata}{15}
\bibcite{tuprolog-manual}{16}
\bibcite{thesis-context}{17}
\bibcite{Breiman2001-article}{18}
\bibcite{lpaas-article}{19}
\bibcite{Cze03-article}{20}
\bibcite{tuprolog-article}{21}
\bibcite{uci-page}{22}
\bibcite{dot-manual}{23}
\bibcite{sklearn-article}{24}
\bibcite{book-Quinlan1993}{25}
\bibcite{book-aima}{26}
\bibcite{weka-manual}{27}
\bibstyle{plain}
