\BOOKMARK [0][-]{chapter.1}{Introduzione}{}% 1
\BOOKMARK [0][-]{chapter.2}{Background}{}% 2
\BOOKMARK [1][-]{section.2.1}{Programmazione logica}{chapter.2}% 3
\BOOKMARK [1][-]{section.2.2}{tuProlog}{chapter.2}% 4
\BOOKMARK [1][-]{section.2.3}{Context-Awareness nelle tecniche di Reasoning}{chapter.2}% 5
\BOOKMARK [1][-]{section.2.4}{Logic Programming as a Service}{chapter.2}% 6
\BOOKMARK [1][-]{section.2.5}{Machine Learning}{chapter.2}% 7
\BOOKMARK [1][-]{section.2.6}{Alberi decisionali}{chapter.2}% 8
\BOOKMARK [0][-]{chapter.3}{Valutazione di alcuni framework di Machine Learning}{}% 9
\BOOKMARK [1][-]{section.3.1}{Anaconda}{chapter.3}% 10
\BOOKMARK [1][-]{section.3.2}{Keras e TensorFlow}{chapter.3}% 11
\BOOKMARK [1][-]{section.3.3}{Weka}{chapter.3}% 12
\BOOKMARK [1][-]{section.3.4}{Analisi conclusiva}{chapter.3}% 13
\BOOKMARK [0][-]{chapter.4}{Explainable AI}{}% 14
\BOOKMARK [1][-]{section.4.1}{Formalizzazione delle strutture}{chapter.4}% 15
\BOOKMARK [1][-]{section.4.2}{Modellazione di un'architettura}{chapter.4}% 16
\BOOKMARK [2][-]{subsection.4.2.1}{Struttura concettuale}{section.4.2}% 17
\BOOKMARK [2][-]{subsection.4.2.2}{Machine Learning Interface}{section.4.2}% 18
\BOOKMARK [2][-]{subsection.4.2.3}{Knowledge Base}{section.4.2}% 19
\BOOKMARK [2][-]{subsection.4.2.4}{Machine Learning to Prolog}{section.4.2}% 20
\BOOKMARK [2][-]{subsection.4.2.5}{Prolog to Machine Learning}{section.4.2}% 21
\BOOKMARK [2][-]{subsection.4.2.6}{Demonstration}{section.4.2}% 22
\BOOKMARK [1][-]{section.4.3}{Considerazioni finali}{chapter.4}% 23
\BOOKMARK [0][-]{chapter.5}{Realizzazione di un prototipo}{}% 24
\BOOKMARK [1][-]{section.5.1}{Scelte architetturali}{chapter.5}% 25
\BOOKMARK [1][-]{section.5.2}{Struttura logica dell'applicativo}{chapter.5}% 26
\BOOKMARK [1][-]{section.5.3}{Implementazione dei modelli spiegabili}{chapter.5}% 27
\BOOKMARK [2][-]{subsection.5.3.1}{Soluzione con interfaccia Drawable}{section.5.3}% 28
\BOOKMARK [2][-]{subsection.5.3.2}{Integrazione algoritmo J48}{section.5.3}% 29
\BOOKMARK [2][-]{subsection.5.3.3}{Integrazione algoritmo REPTree}{section.5.3}% 30
\BOOKMARK [2][-]{subsection.5.3.4}{Integrazione algoritmo RandomTree}{section.5.3}% 31
\BOOKMARK [1][-]{section.5.4}{Implementazione dei modelli di dimostrazione}{chapter.5}% 32
\BOOKMARK [2][-]{subsection.5.4.1}{Integrazione dimostratori in linguaggio naturale}{section.5.4}% 33
\BOOKMARK [1][-]{section.5.5}{Implementazione dei modelli di persistenza}{chapter.5}% 34
\BOOKMARK [1][-]{section.5.6}{Collaudo}{chapter.5}% 35
\BOOKMARK [2][-]{subsection.5.6.1}{Spiegazione con un problema classificativo}{section.5.6}% 36
\BOOKMARK [2][-]{subsection.5.6.2}{Spiegazione con un problema regressivo}{section.5.6}% 37
\BOOKMARK [2][-]{subsection.5.6.3}{Dimostrazione con una Knowledge Base generica}{section.5.6}% 38
\BOOKMARK [2][-]{subsection.5.6.4}{Dimostrazione con un modello spiegato}{section.5.6}% 39
\BOOKMARK [0][-]{chapter.6}{Considerazioni e sviluppi futuri}{}% 40
\BOOKMARK [1][-]{section.6.1}{Considerazioni sulla proposta architetturale}{chapter.6}% 41
\BOOKMARK [1][-]{section.6.2}{Considerazioni sul prototipo}{chapter.6}% 42
\BOOKMARK [0][-]{chapter.7}{Conclusioni}{}% 43
