\relax 
\providecommand\hyper@newdestlabel[2]{}
\@writefile{toc}{\contentsline {chapter}{\numberline {5}Realizzazione di un prototipo}{40}{chapter.5}\protected@file@percent }
\@writefile{lof}{\addvspace {10\p@ }}
\@writefile{lot}{\addvspace {10\p@ }}
\@writefile{toc}{\contentsline {section}{\numberline {5.1}Scelte architetturali}{40}{section.5.1}\protected@file@percent }
\@writefile{toc}{\contentsline {section}{\numberline {5.2}Struttura logica dell'applicativo}{42}{section.5.2}\protected@file@percent }
\@writefile{lof}{\contentsline {figure}{\numberline {5.1}{\ignorespaces Diagramma UML delle classi principali del prototipo}}{42}{figure.5.1}\protected@file@percent }
\newlabel{uml-model-1}{{5.1}{42}{Diagramma UML delle classi principali del prototipo}{figure.5.1}{}}
\@writefile{lof}{\contentsline {figure}{\numberline {5.2}{\ignorespaces Diagramma UML dei modelli spiegabili implementati}}{45}{figure.5.2}\protected@file@percent }
\newlabel{uml-model-2}{{5.2}{45}{Diagramma UML dei modelli spiegabili implementati}{figure.5.2}{}}
\citation{book-Quinlan1993}
\citation{book-Quinlan1993}
\citation{weka-javadoc}
\citation{Breiman2001-article}
\@writefile{lof}{\contentsline {figure}{\numberline {5.3}{\ignorespaces Diagramma UML dei dimostratori implementati}}{47}{figure.5.3}\protected@file@percent }
\newlabel{uml-model-3}{{5.3}{47}{Diagramma UML dei dimostratori implementati}{figure.5.3}{}}
\@writefile{lof}{\contentsline {figure}{\numberline {5.4}{\ignorespaces Diagramma UML dei modelli di persistenza implementati}}{49}{figure.5.4}\protected@file@percent }
\newlabel{uml-model-4}{{5.4}{49}{Diagramma UML dei modelli di persistenza implementati}{figure.5.4}{}}
\@writefile{toc}{\contentsline {section}{\numberline {5.3}Implementazione dei modelli spiegabili}{50}{section.5.3}\protected@file@percent }
\@writefile{lof}{\contentsline {figure}{\numberline {5.5}{\ignorespaces Esempio di Albero Decisionale Weka}}{51}{figure.5.5}\protected@file@percent }
\newlabel{weka-j48-ex}{{5.5}{51}{Esempio di Albero Decisionale Weka}{figure.5.5}{}}
\citation{dot-manual}
\@writefile{toc}{\contentsline {subsection}{\numberline {5.3.1}Soluzione con interfaccia Drawable}{53}{subsection.5.3.1}\protected@file@percent }
\@writefile{toc}{\contentsline {subsection}{\numberline {5.3.2}Integrazione algoritmo J48}{55}{subsection.5.3.2}\protected@file@percent }
\@writefile{toc}{\contentsline {subsection}{\numberline {5.3.3}Integrazione algoritmo REPTree}{56}{subsection.5.3.3}\protected@file@percent }
\@writefile{toc}{\contentsline {subsection}{\numberline {5.3.4}Integrazione algoritmo RandomTree}{58}{subsection.5.3.4}\protected@file@percent }
\@writefile{toc}{\contentsline {section}{\numberline {5.4}Implementazione dei modelli di dimostrazione}{58}{section.5.4}\protected@file@percent }
\@writefile{toc}{\contentsline {subsection}{\numberline {5.4.1}Integrazione dimostratori in linguaggio naturale}{61}{subsection.5.4.1}\protected@file@percent }
\@writefile{toc}{\contentsline {section}{\numberline {5.5}Implementazione dei modelli di persistenza}{63}{section.5.5}\protected@file@percent }
\citation{Cze03-article}
\citation{uci-page}
\@writefile{toc}{\contentsline {section}{\numberline {5.6}Collaudo}{65}{section.5.6}\protected@file@percent }
\@writefile{toc}{\contentsline {subsection}{\numberline {5.6.1}Spiegazione con un problema classificativo}{65}{subsection.5.6.1}\protected@file@percent }
\@writefile{lof}{\contentsline {figure}{\numberline {5.6}{\ignorespaces Albero Decisionale prodotto dall'allenamento}}{68}{figure.5.6}\protected@file@percent }
\newlabel{exper-1}{{5.6}{68}{Albero Decisionale prodotto dall'allenamento}{figure.5.6}{}}
\@writefile{lof}{\contentsline {figure}{\numberline {5.7}{\ignorespaces Misure di errore dell'algoritmo J48 allenato}}{68}{figure.5.7}\protected@file@percent }
\newlabel{exper-2}{{5.7}{68}{Misure di errore dell'algoritmo J48 allenato}{figure.5.7}{}}
\citation{uci-page}
\@writefile{toc}{\contentsline {subsection}{\numberline {5.6.2}Spiegazione con un problema regressivo}{69}{subsection.5.6.2}\protected@file@percent }
\@writefile{lof}{\contentsline {figure}{\numberline {5.8}{\ignorespaces Rappresentazione testuale dell'Albero Decisionale addestrato}}{71}{figure.5.8}\protected@file@percent }
\newlabel{exper-3}{{5.8}{71}{Rappresentazione testuale dell'Albero Decisionale addestrato}{figure.5.8}{}}
\@writefile{lof}{\contentsline {figure}{\numberline {5.9}{\ignorespaces Misure di errore dell'algoritmo REPTree allenato}}{72}{figure.5.9}\protected@file@percent }
\newlabel{exper-4}{{5.9}{72}{Misure di errore dell'algoritmo REPTree allenato}{figure.5.9}{}}
\@writefile{toc}{\contentsline {subsection}{\numberline {5.6.3}Dimostrazione con una Knowledge Base generica}{72}{subsection.5.6.3}\protected@file@percent }
\@writefile{toc}{\contentsline {subsection}{\numberline {5.6.4}Dimostrazione con un modello spiegato}{75}{subsection.5.6.4}\protected@file@percent }
\@setckpt{Implementazione}{
\setcounter{page}{78}
\setcounter{equation}{0}
\setcounter{enumi}{14}
\setcounter{enumii}{0}
\setcounter{enumiii}{0}
\setcounter{enumiv}{0}
\setcounter{footnote}{0}
\setcounter{mpfootnote}{0}
\setcounter{part}{0}
\setcounter{chapter}{5}
\setcounter{section}{6}
\setcounter{subsection}{4}
\setcounter{subsubsection}{0}
\setcounter{paragraph}{0}
\setcounter{subparagraph}{0}
\setcounter{figure}{9}
\setcounter{table}{0}
\setcounter{Item}{31}
\setcounter{Hfootnote}{0}
\setcounter{bookmark@seq@number}{39}
\setcounter{lstnumber}{9}
\setcounter{section@level}{2}
\setcounter{lstlisting}{0}
}
