\relax 
\providecommand\hyper@newdestlabel[2]{}
\citation{anaconda-page}
\citation{bsd-page}
\citation{python-page}
\citation{sklearn-article}
\citation{google-soc-page}
\@writefile{toc}{\contentsline {chapter}{\numberline {3}Valutazione di alcuni framework di Machine Learning}{17}{chapter.3}\protected@file@percent }
\@writefile{lof}{\addvspace {10\p@ }}
\@writefile{lot}{\addvspace {10\p@ }}
\newlabel{cap3}{{3}{17}{Valutazione di alcuni framework di Machine Learning}{chapter.3}{}}
\@writefile{toc}{\contentsline {section}{\numberline {3.1}Anaconda}{17}{section.3.1}\protected@file@percent }
\citation{book-lfdata}
\citation{book-aima}
\@writefile{lof}{\contentsline {figure}{\numberline {3.1}{\ignorespaces Logo della distribuzione Anaconda}}{18}{figure.3.1}\protected@file@percent }
\citation{book-aima}
\citation{book-aima}
\citation{book-aima}
\citation{keras-page}
\citation{mit-page}
\citation{theano-page}
\citation{cntk-page}
\@writefile{toc}{\contentsline {section}{\numberline {3.2}Keras e TensorFlow}{20}{section.3.2}\protected@file@percent }
\citation{tf-page}
\citation{apache2-page}
\@writefile{lof}{\contentsline {figure}{\numberline {3.2}{\ignorespaces Logo di Keras (a sinistra) e di TensorFlow (a destra)}}{21}{figure.3.2}\protected@file@percent }
\citation{weka-page}
\citation{gnu-gpl-page}
\citation{weka-manual}
\@writefile{toc}{\contentsline {section}{\numberline {3.3}Weka}{22}{section.3.3}\protected@file@percent }
\@writefile{lof}{\contentsline {figure}{\numberline {3.3}{\ignorespaces Logo del framework Weka}}{22}{figure.3.3}\protected@file@percent }
\citation{weka-manual}
\citation{weka-javadoc}
\citation{book-lfdata}
\citation{book-lfdata}
\citation{book-lfdata}
\citation{weka-manual}
\@writefile{toc}{\contentsline {section}{\numberline {3.4}Analisi conclusiva}{25}{section.3.4}\protected@file@percent }
\@setckpt{Valutazione}{
\setcounter{page}{27}
\setcounter{equation}{0}
\setcounter{enumi}{0}
\setcounter{enumii}{0}
\setcounter{enumiii}{0}
\setcounter{enumiv}{0}
\setcounter{footnote}{0}
\setcounter{mpfootnote}{0}
\setcounter{part}{0}
\setcounter{chapter}{3}
\setcounter{section}{4}
\setcounter{subsection}{0}
\setcounter{subsubsection}{0}
\setcounter{paragraph}{0}
\setcounter{subparagraph}{0}
\setcounter{figure}{3}
\setcounter{table}{0}
\setcounter{Item}{0}
\setcounter{Hfootnote}{0}
\setcounter{bookmark@seq@number}{13}
\setcounter{lstnumber}{1}
\setcounter{section@level}{1}
\setcounter{lstlisting}{0}
}
