[
  {
    "id": "peer0",
    "endpoint": { "host": "localhost", "port": 27000 }
  },
  {
    "id": "peer1",
    "endpoint": { "host": "localhost", "port": 27001 }
  },
  {
    "id": "peer2",
    "endpoint": { "host": "localhost", "port": 27002 }
  },
  {
    "id": "peer3",
    "endpoint": { "host": "localhost", "port": 27003 }
  },
  {
    "id": "peer4",
    "endpoint": { "host": "localhost", "port": 27004 }
  }
]