{
  "commands": [
    {
      "id": "ca6b62c7-c2d7-40aa-a71e-557fa534a7f1",
      "command": "open",
      "target": "/"
    },
    {
      "id": "01498bce-94ae-4e45-b7fb-de8f75f8afd1",
      "command": "setWindowSize",
      "target": "1680x960"
    }
  ]
}
