<?xml version="1.0" encoding="utf-8"?>
<!DOCTYPE eagle SYSTEM "eagle.dtd">
<eagle version="6.5.0">
<drawing>
<settings>
<setting alwaysvectorfont="no"/>
<setting verticaltext="up"/>
</settings>
<grid distance="0.1" unitdist="inch" unit="inch" style="lines" multiple="1" display="no" altdistance="0.01" altunitdist="inch" altunit="inch"/>
<layers>
<layer number="1" name="Top" color="4" fill="1" visible="no" active="no"/>
<layer number="2" name="Route2" color="1" fill="3" visible="no" active="no"/>
<layer number="3" name="Route3" color="4" fill="3" visible="no" active="no"/>
<layer number="4" name="Route4" color="1" fill="4" visible="no" active="no"/>
<layer number="5" name="Route5" color="4" fill="4" visible="no" active="no"/>
<layer number="6" name="Route6" color="1" fill="8" visible="no" active="no"/>
<layer number="7" name="Route7" color="4" fill="8" visible="no" active="no"/>
<layer number="8" name="Route8" color="1" fill="2" visible="no" active="no"/>
<layer number="9" name="Route9" color="4" fill="2" visible="no" active="no"/>
<layer number="10" name="Route10" color="1" fill="7" visible="no" active="no"/>
<layer number="11" name="Route11" color="4" fill="7" visible="no" active="no"/>
<layer number="12" name="Route12" color="1" fill="5" visible="no" active="no"/>
<layer number="13" name="Route13" color="4" fill="5" visible="no" active="no"/>
<layer number="14" name="Route14" color="1" fill="6" visible="no" active="no"/>
<layer number="15" name="Route15" color="4" fill="6" visible="no" active="no"/>
<layer number="16" name="Bottom" color="1" fill="1" visible="no" active="no"/>
<layer number="17" name="Pads" color="2" fill="1" visible="no" active="no"/>
<layer number="18" name="Vias" color="2" fill="1" visible="no" active="no"/>
<layer number="19" name="Unrouted" color="6" fill="1" visible="no" active="no"/>
<layer number="20" name="Dimension" color="15" fill="1" visible="no" active="no"/>
<layer number="21" name="tPlace" color="13" fill="1" visible="no" active="no"/>
<layer number="22" name="bPlace" color="7" fill="1" visible="no" active="no"/>
<layer number="23" name="tOrigins" color="15" fill="1" visible="no" active="no"/>
<layer number="24" name="bOrigins" color="15" fill="1" visible="no" active="no"/>
<layer number="25" name="tNames" color="2" fill="1" visible="no" active="no"/>
<layer number="26" name="bNames" color="7" fill="1" visible="no" active="no"/>
<layer number="27" name="tValues" color="11" fill="1" visible="no" active="no"/>
<layer number="28" name="bValues" color="7" fill="1" visible="no" active="no"/>
<layer number="29" name="tStop" color="7" fill="3" visible="no" active="no"/>
<layer number="30" name="bStop" color="7" fill="6" visible="no" active="no"/>
<layer number="31" name="tCream" color="7" fill="4" visible="no" active="no"/>
<layer number="32" name="bCream" color="7" fill="5" visible="no" active="no"/>
<layer number="33" name="tFinish" color="6" fill="3" visible="no" active="no"/>
<layer number="34" name="bFinish" color="6" fill="6" visible="no" active="no"/>
<layer number="35" name="tGlue" color="7" fill="4" visible="no" active="no"/>
<layer number="36" name="bGlue" color="7" fill="5" visible="no" active="no"/>
<layer number="37" name="tTest" color="7" fill="1" visible="no" active="no"/>
<layer number="38" name="bTest" color="7" fill="1" visible="no" active="no"/>
<layer number="39" name="tKeepout" color="4" fill="11" visible="no" active="no"/>
<layer number="40" name="bKeepout" color="1" fill="11" visible="no" active="no"/>
<layer number="41" name="tRestrict" color="4" fill="10" visible="no" active="no"/>
<layer number="42" name="bRestrict" color="1" fill="10" visible="no" active="no"/>
<layer number="43" name="vRestrict" color="2" fill="10" visible="no" active="no"/>
<layer number="44" name="Drills" color="7" fill="1" visible="no" active="no"/>
<layer number="45" name="Holes" color="7" fill="1" visible="no" active="no"/>
<layer number="46" name="Milling" color="3" fill="1" visible="no" active="no"/>
<layer number="47" name="Measures" color="7" fill="1" visible="no" active="no"/>
<layer number="48" name="Document" color="7" fill="1" visible="no" active="no"/>
<layer number="49" name="Reference" color="7" fill="1" visible="no" active="no"/>
<layer number="50" name="dxf" color="7" fill="1" visible="no" active="no"/>
<layer number="51" name="tDocu" color="14" fill="1" visible="no" active="no"/>
<layer number="52" name="bDocu" color="7" fill="1" visible="no" active="no"/>
<layer number="53" name="tGND_GNDA" color="7" fill="9" visible="no" active="no"/>
<layer number="54" name="bGND_GNDA" color="1" fill="9" visible="no" active="no"/>
<layer number="56" name="wert" color="7" fill="1" visible="no" active="no"/>
<layer number="90" name="Modules" color="5" fill="1" visible="yes" active="yes"/>
<layer number="91" name="Nets" color="2" fill="1" visible="yes" active="yes"/>
<layer number="92" name="Busses" color="1" fill="1" visible="yes" active="yes"/>
<layer number="93" name="Pins" color="2" fill="1" visible="no" active="yes"/>
<layer number="94" name="Symbols" color="4" fill="1" visible="yes" active="yes"/>
<layer number="95" name="Names" color="7" fill="1" visible="yes" active="yes"/>
<layer number="96" name="Values" color="7" fill="1" visible="yes" active="yes"/>
<layer number="97" name="Info" color="7" fill="1" visible="yes" active="yes"/>
<layer number="98" name="Guide" color="6" fill="1" visible="yes" active="yes"/>
<layer number="100" name="Muster" color="7" fill="1" visible="no" active="no"/>
<layer number="101" name="Patch_Top" color="12" fill="4" visible="yes" active="yes"/>
<layer number="102" name="Vscore" color="7" fill="1" visible="yes" active="yes"/>
<layer number="103" name="tMap" color="7" fill="1" visible="yes" active="yes"/>
<layer number="104" name="Name" color="16" fill="1" visible="yes" active="yes"/>
<layer number="105" name="tPlate" color="7" fill="1" visible="yes" active="yes"/>
<layer number="106" name="bPlate" color="7" fill="1" visible="yes" active="yes"/>
<layer number="107" name="Crop" color="7" fill="1" visible="yes" active="yes"/>
<layer number="108" name="tplace-old" color="10" fill="1" visible="yes" active="yes"/>
<layer number="109" name="ref-old" color="11" fill="1" visible="yes" active="yes"/>
<layer number="110" name="fp0" color="7" fill="1" visible="yes" active="yes"/>
<layer number="111" name="LPC17xx" color="7" fill="1" visible="yes" active="yes"/>
<layer number="112" name="tSilk" color="7" fill="1" visible="yes" active="yes"/>
<layer number="113" name="IDFDebug" color="4" fill="1" visible="yes" active="yes"/>
<layer number="116" name="Patch_BOT" color="9" fill="4" visible="yes" active="yes"/>
<layer number="121" name="_tsilk" color="7" fill="1" visible="yes" active="yes"/>
<layer number="122" name="_bsilk" color="7" fill="1" visible="yes" active="yes"/>
<layer number="123" name="tTestmark" color="7" fill="1" visible="yes" active="yes"/>
<layer number="124" name="bTestmark" color="7" fill="1" visible="yes" active="yes"/>
<layer number="125" name="_tNames" color="7" fill="1" visible="yes" active="yes"/>
<layer number="126" name="_bNames" color="7" fill="1" visible="yes" active="yes"/>
<layer number="127" name="_tValues" color="7" fill="1" visible="yes" active="yes"/>
<layer number="128" name="_bValues" color="7" fill="1" visible="yes" active="yes"/>
<layer number="131" name="tAdjust" color="7" fill="1" visible="yes" active="yes"/>
<layer number="132" name="bAdjust" color="7" fill="1" visible="yes" active="yes"/>
<layer number="144" name="Drill_legend" color="7" fill="1" visible="yes" active="yes"/>
<layer number="151" name="HeatSink" color="7" fill="1" visible="yes" active="yes"/>
<layer number="152" name="_bDocu" color="7" fill="1" visible="yes" active="yes"/>
<layer number="199" name="Contour" color="7" fill="1" visible="yes" active="yes"/>
<layer number="200" name="200bmp" color="1" fill="10" visible="yes" active="yes"/>
<layer number="201" name="201bmp" color="2" fill="10" visible="yes" active="yes"/>
<layer number="202" name="202bmp" color="3" fill="10" visible="yes" active="yes"/>
<layer number="203" name="203bmp" color="4" fill="10" visible="yes" active="yes"/>
<layer number="204" name="204bmp" color="5" fill="10" visible="yes" active="yes"/>
<layer number="205" name="205bmp" color="6" fill="10" visible="yes" active="yes"/>
<layer number="206" name="206bmp" color="7" fill="10" visible="yes" active="yes"/>
<layer number="207" name="207bmp" color="8" fill="10" visible="yes" active="yes"/>
<layer number="208" name="208bmp" color="9" fill="10" visible="yes" active="yes"/>
<layer number="209" name="209bmp" color="7" fill="1" visible="yes" active="yes"/>
<layer number="210" name="210bmp" color="7" fill="1" visible="yes" active="yes"/>
<layer number="211" name="211bmp" color="7" fill="1" visible="yes" active="yes"/>
<layer number="212" name="212bmp" color="7" fill="1" visible="yes" active="yes"/>
<layer number="213" name="213bmp" color="7" fill="1" visible="yes" active="yes"/>
<layer number="214" name="214bmp" color="7" fill="1" visible="yes" active="yes"/>
<layer number="215" name="215bmp" color="7" fill="1" visible="yes" active="yes"/>
<layer number="216" name="216bmp" color="7" fill="1" visible="yes" active="yes"/>
<layer number="217" name="217bmp" color="18" fill="1" visible="no" active="no"/>
<layer number="218" name="218bmp" color="19" fill="1" visible="no" active="no"/>
<layer number="219" name="219bmp" color="20" fill="1" visible="no" active="no"/>
<layer number="220" name="220bmp" color="21" fill="1" visible="no" active="no"/>
<layer number="221" name="221bmp" color="22" fill="1" visible="no" active="no"/>
<layer number="222" name="222bmp" color="23" fill="1" visible="no" active="no"/>
<layer number="223" name="223bmp" color="24" fill="1" visible="no" active="no"/>
<layer number="224" name="224bmp" color="25" fill="1" visible="no" active="no"/>
<layer number="248" name="Housing" color="7" fill="1" visible="yes" active="yes"/>
<layer number="249" name="Edge" color="7" fill="1" visible="yes" active="yes"/>
<layer number="250" name="Descript" color="7" fill="1" visible="yes" active="yes"/>
<layer number="251" name="SMDround" color="7" fill="1" visible="yes" active="yes"/>
<layer number="254" name="cooling" color="7" fill="1" visible="yes" active="yes"/>
</layers>
<schematic xreflabel="%F%N/%S.%C%R" xrefpart="/%S.%C%R">
<libraries>
<library name="frames">
<description>&lt;b&gt;Frames for Sheet and Layout&lt;/b&gt;</description>
<packages>
</packages>
<symbols>
<symbol name="A3L-LOC">
<wire x1="288.29" y1="3.81" x2="342.265" y2="3.81" width="0.1016" layer="94"/>
<wire x1="342.265" y1="3.81" x2="373.38" y2="3.81" width="0.1016" layer="94"/>
<wire x1="373.38" y1="3.81" x2="383.54" y2="3.81" width="0.1016" layer="94"/>
<wire x1="383.54" y1="3.81" x2="383.54" y2="8.89" width="0.1016" layer="94"/>
<wire x1="383.54" y1="8.89" x2="383.54" y2="13.97" width="0.1016" layer="94"/>
<wire x1="383.54" y1="13.97" x2="383.54" y2="19.05" width="0.1016" layer="94"/>
<wire x1="383.54" y1="19.05" x2="383.54" y2="24.13" width="0.1016" layer="94"/>
<wire x1="288.29" y1="3.81" x2="288.29" y2="24.13" width="0.1016" layer="94"/>
<wire x1="288.29" y1="24.13" x2="342.265" y2="24.13" width="0.1016" layer="94"/>
<wire x1="342.265" y1="24.13" x2="383.54" y2="24.13" width="0.1016" layer="94"/>
<wire x1="373.38" y1="3.81" x2="373.38" y2="8.89" width="0.1016" layer="94"/>
<wire x1="373.38" y1="8.89" x2="383.54" y2="8.89" width="0.1016" layer="94"/>
<wire x1="373.38" y1="8.89" x2="342.265" y2="8.89" width="0.1016" layer="94"/>
<wire x1="342.265" y1="8.89" x2="342.265" y2="3.81" width="0.1016" layer="94"/>
<wire x1="342.265" y1="8.89" x2="342.265" y2="13.97" width="0.1016" layer="94"/>
<wire x1="342.265" y1="13.97" x2="383.54" y2="13.97" width="0.1016" layer="94"/>
<wire x1="342.265" y1="13.97" x2="342.265" y2="19.05" width="0.1016" layer="94"/>
<wire x1="342.265" y1="19.05" x2="383.54" y2="19.05" width="0.1016" layer="94"/>
<wire x1="342.265" y1="19.05" x2="342.265" y2="24.13" width="0.1016" layer="94"/>
<text x="344.17" y="15.24" size="2.54" layer="94" font="vector">&gt;DRAWING_NAME</text>
<text x="344.17" y="10.16" size="2.286" layer="94" font="vector">&gt;LAST_DATE_TIME</text>
<text x="357.505" y="5.08" size="2.54" layer="94" font="vector">&gt;SHEET</text>
<text x="343.916" y="4.953" size="2.54" layer="94" font="vector">Sheet:</text>
<frame x1="0" y1="0" x2="387.35" y2="260.35" columns="8" rows="5" layer="94"/>
</symbol>
</symbols>
<devicesets>
<deviceset name="A3L-LOC" prefix="FRAME" uservalue="yes">
<description>&lt;b&gt;FRAME&lt;/b&gt;&lt;p&gt;
DIN A3, landscape with location and doc. field</description>
<gates>
<gate name="G$1" symbol="A3L-LOC" x="0" y="0"/>
</gates>
<devices>
<device name="">
<technologies>
<technology name=""/>
</technologies>
</device>
</devices>
</deviceset>
</devicesets>
</library>
<library name="isenproject">
<description>ISENproject : bibliothèque de composants utilisable pour les projets des CSI3, CIR3, M1 et M2


created by severine.corvez@isen.fr</description>
<packages>
<package name="C-POL2.54MM">
<description>&lt;b&gt;ELECTROLYTIC CAPACITOR&lt;/b&gt;&lt;p&gt;
diameter 7 mm, grid 2.54 mm</description>
<wire x1="-1.016" y1="0" x2="-0.508" y2="0" width="0.1524" layer="51"/>
<wire x1="-0.508" y1="0" x2="-0.508" y2="-0.889" width="0.1524" layer="51"/>
<wire x1="-0.508" y1="-0.889" x2="-0.1778" y2="-0.889" width="0.1524" layer="51"/>
<wire x1="-0.1778" y1="-0.889" x2="-0.1778" y2="0.889" width="0.1524" layer="51"/>
<wire x1="-0.1778" y1="0.889" x2="-0.508" y2="0.889" width="0.1524" layer="51"/>
<wire x1="-0.508" y1="0.889" x2="-0.508" y2="0" width="0.1524" layer="51"/>
<wire x1="0.508" y1="0" x2="1.016" y2="0" width="0.1524" layer="51"/>
<wire x1="-2.286" y1="0" x2="-3.048" y2="0" width="0.1524" layer="21"/>
<wire x1="-2.667" y1="-0.381" x2="-2.667" y2="0.381" width="0.1524" layer="21"/>
<circle x="0" y="0" radius="3.556" width="0.1524" layer="21"/>
<pad name="-" x="1.27" y="0" drill="0.9" diameter="1.9304" shape="octagon"/>
<pad name="+" x="-1.27" y="0" drill="0.9" diameter="1.9304"/>
<text x="3.302" y="1.905" size="1.27" layer="25" ratio="10">&gt;NAME</text>
<text x="3.302" y="-3.048" size="1.27" layer="27" ratio="10">&gt;VALUE</text>
<text x="0.127" y="-2.667" size="1.27" layer="21" ratio="10">TT</text>
<rectangle x1="0.127" y1="-0.9398" x2="0.5588" y2="0.9398" layer="51"/>
</package>
<package name="C-POL5MM">
<description>&lt;b&gt;ELECTROLYTIC CAPACITOR&lt;/b&gt;&lt;p&gt;
diameter 7 mm, grid 5.08 mm</description>
<wire x1="-1.524" y1="0" x2="-0.635" y2="0" width="0.1524" layer="21"/>
<wire x1="-0.635" y1="0" x2="-0.635" y2="-1.27" width="0.1524" layer="21"/>
<wire x1="-0.635" y1="-1.27" x2="-0.127" y2="-1.27" width="0.1524" layer="21"/>
<wire x1="-0.127" y1="-1.27" x2="-0.127" y2="1.27" width="0.1524" layer="21"/>
<wire x1="-0.127" y1="1.27" x2="-0.635" y2="1.27" width="0.1524" layer="21"/>
<wire x1="-0.635" y1="1.27" x2="-0.635" y2="0" width="0.1524" layer="21"/>
<wire x1="0.635" y1="0" x2="1.524" y2="0" width="0.1524" layer="21"/>
<wire x1="-2.286" y1="1.524" x2="-1.27" y2="1.524" width="0.1524" layer="21"/>
<wire x1="-1.778" y1="1.016" x2="-1.778" y2="2.032" width="0.1524" layer="21"/>
<circle x="0" y="0" radius="3.556" width="0.1524" layer="21"/>
<pad name="-" x="2.54" y="0" drill="0.9" diameter="2.1844" shape="octagon"/>
<pad name="+" x="-2.54" y="0" drill="0.9" diameter="2.1844"/>
<text x="3.302" y="2.032" size="1.27" layer="25" ratio="10">&gt;NAME</text>
<text x="3.175" y="-3.175" size="1.27" layer="27" ratio="10">&gt;VALUE</text>
<text x="0.635" y="-2.667" size="0.9906" layer="21" ratio="12">TT</text>
<rectangle x1="0.254" y1="-1.27" x2="0.762" y2="1.27" layer="21"/>
</package>
<package name="R">
<description>&lt;b&gt;RESISTOR&lt;/b&gt;&lt;p&gt;
type 0207, grid 10 mm</description>
<wire x1="5.08" y1="0" x2="4.064" y2="0" width="0.6096" layer="51"/>
<wire x1="-5.08" y1="0" x2="-4.064" y2="0" width="0.6096" layer="51"/>
<wire x1="-3.175" y1="0.889" x2="-2.921" y2="1.143" width="0.1524" layer="21" curve="-90"/>
<wire x1="-3.175" y1="-0.889" x2="-2.921" y2="-1.143" width="0.1524" layer="21" curve="90"/>
<wire x1="2.921" y1="-1.143" x2="3.175" y2="-0.889" width="0.1524" layer="21" curve="90"/>
<wire x1="2.921" y1="1.143" x2="3.175" y2="0.889" width="0.1524" layer="21" curve="-90"/>
<wire x1="-3.175" y1="-0.889" x2="-3.175" y2="0.889" width="0.1524" layer="21"/>
<wire x1="-2.921" y1="1.143" x2="-2.54" y2="1.143" width="0.1524" layer="21"/>
<wire x1="-2.413" y1="1.016" x2="-2.54" y2="1.143" width="0.1524" layer="21"/>
<wire x1="-2.921" y1="-1.143" x2="-2.54" y2="-1.143" width="0.1524" layer="21"/>
<wire x1="-2.413" y1="-1.016" x2="-2.54" y2="-1.143" width="0.1524" layer="21"/>
<wire x1="2.413" y1="1.016" x2="2.54" y2="1.143" width="0.1524" layer="21"/>
<wire x1="2.413" y1="1.016" x2="-2.413" y2="1.016" width="0.1524" layer="21"/>
<wire x1="2.413" y1="-1.016" x2="2.54" y2="-1.143" width="0.1524" layer="21"/>
<wire x1="2.413" y1="-1.016" x2="-2.413" y2="-1.016" width="0.1524" layer="21"/>
<wire x1="2.921" y1="1.143" x2="2.54" y2="1.143" width="0.1524" layer="21"/>
<wire x1="2.921" y1="-1.143" x2="2.54" y2="-1.143" width="0.1524" layer="21"/>
<wire x1="3.175" y1="-0.889" x2="3.175" y2="0.889" width="0.1524" layer="21"/>
<pad name="1" x="-5.08" y="0" drill="0.9" diameter="2.1844" shape="octagon"/>
<pad name="2" x="5.08" y="0" drill="0.9" diameter="2.1844" shape="octagon"/>
<text x="-3.048" y="1.524" size="1.27" layer="25" ratio="10">&gt;NAME</text>
<text x="-2.2606" y="-0.635" size="1.27" layer="27" ratio="10">&gt;VALUE</text>
<rectangle x1="3.175" y1="-0.3048" x2="4.0386" y2="0.3048" layer="21"/>
<rectangle x1="-4.0386" y1="-0.3048" x2="-3.175" y2="0.3048" layer="21"/>
</package>
<package name="LED5MM">
<description>&lt;B&gt;LED&lt;/B&gt;&lt;p&gt;
5 mm, round</description>
<wire x1="2.54" y1="-1.905" x2="2.54" y2="1.905" width="0.2032" layer="21"/>
<wire x1="2.54" y1="-1.905" x2="2.54" y2="1.905" width="0.254" layer="21" curve="-286.260205"/>
<wire x1="-1.143" y1="0" x2="0" y2="1.143" width="0.1524" layer="51" curve="-90"/>
<wire x1="0" y1="-1.143" x2="1.143" y2="0" width="0.1524" layer="51" curve="90"/>
<wire x1="-1.651" y1="0" x2="0" y2="1.651" width="0.1524" layer="51" curve="-90"/>
<wire x1="0" y1="-1.651" x2="1.651" y2="0" width="0.1524" layer="51" curve="90"/>
<wire x1="-2.159" y1="0" x2="0" y2="2.159" width="0.1524" layer="51" curve="-90"/>
<wire x1="0" y1="-2.159" x2="2.159" y2="0" width="0.1524" layer="51" curve="90"/>
<circle x="0" y="0" radius="2.54" width="0.1524" layer="21"/>
<pad name="A" x="-1.27" y="0" drill="0.9" diameter="1.9304" shape="octagon"/>
<pad name="K" x="1.27" y="0" drill="0.9" diameter="1.9304" shape="octagon"/>
<text x="3.175" y="0.5334" size="1.27" layer="25" ratio="10">&gt;NAME</text>
<text x="3.2004" y="-1.8034" size="1.27" layer="27" ratio="10">&gt;VALUE</text>
</package>
</packages>
<symbols>
<symbol name="C-POL">
<wire x1="-1.524" y1="-0.889" x2="1.524" y2="-0.889" width="0.254" layer="94"/>
<wire x1="1.524" y1="-0.889" x2="1.524" y2="0" width="0.254" layer="94"/>
<wire x1="-1.524" y1="0" x2="-1.524" y2="-0.889" width="0.254" layer="94"/>
<wire x1="-1.524" y1="0" x2="1.524" y2="0" width="0.254" layer="94"/>
<text x="1.143" y="0.4826" size="1.778" layer="95">&gt;NAME</text>
<text x="-0.5842" y="0.4064" size="1.27" layer="94" rot="R90">+</text>
<text x="1.143" y="-4.5974" size="1.778" layer="96">&gt;VALUE</text>
<rectangle x1="-1.651" y1="-2.54" x2="1.651" y2="-1.651" layer="94"/>
<pin name="-" x="0" y="-5.08" visible="off" length="short" direction="pas" rot="R90"/>
<pin name="+" x="0" y="2.54" visible="off" length="short" direction="pas" rot="R270"/>
</symbol>
<symbol name="R">
<wire x1="-2.54" y1="-0.889" x2="2.54" y2="-0.889" width="0.254" layer="94"/>
<wire x1="2.54" y1="0.889" x2="-2.54" y2="0.889" width="0.254" layer="94"/>
<wire x1="2.54" y1="-0.889" x2="2.54" y2="0.889" width="0.254" layer="94"/>
<wire x1="-2.54" y1="-0.889" x2="-2.54" y2="0.889" width="0.254" layer="94"/>
<text x="-3.81" y="1.4986" size="1.778" layer="95">&gt;NAME</text>
<text x="-3.81" y="-3.302" size="1.778" layer="96">&gt;VALUE</text>
<pin name="2" x="5.08" y="0" visible="off" length="short" direction="pas" swaplevel="1" rot="R180"/>
<pin name="1" x="-5.08" y="0" visible="off" length="short" direction="pas" swaplevel="1"/>
</symbol>
<symbol name="LED">
<wire x1="1.27" y1="0" x2="0" y2="-2.54" width="0.254" layer="94"/>
<wire x1="0" y1="-2.54" x2="-1.27" y2="0" width="0.254" layer="94"/>
<wire x1="1.27" y1="-2.54" x2="0" y2="-2.54" width="0.254" layer="94"/>
<wire x1="0" y1="-2.54" x2="-1.27" y2="-2.54" width="0.254" layer="94"/>
<wire x1="1.27" y1="0" x2="0" y2="0" width="0.254" layer="94"/>
<wire x1="0" y1="0" x2="-1.27" y2="0" width="0.254" layer="94"/>
<wire x1="0" y1="0" x2="0" y2="-2.54" width="0.1524" layer="94"/>
<wire x1="-2.032" y1="-0.762" x2="-3.429" y2="-2.159" width="0.1524" layer="94"/>
<wire x1="-1.905" y1="-1.905" x2="-3.302" y2="-3.302" width="0.1524" layer="94"/>
<text x="3.556" y="-4.572" size="1.778" layer="95" rot="R90">&gt;NAME</text>
<text x="5.715" y="-4.572" size="1.778" layer="96" rot="R90">&gt;VALUE</text>
<pin name="C" x="0" y="-5.08" visible="off" length="short" direction="pas" rot="R90"/>
<pin name="A" x="0" y="2.54" visible="off" length="short" direction="pas" rot="R270"/>
<polygon width="0.1524" layer="94">
<vertex x="-3.429" y="-2.159"/>
<vertex x="-3.048" y="-1.27"/>
<vertex x="-2.54" y="-1.778"/>
</polygon>
<polygon width="0.1524" layer="94">
<vertex x="-3.302" y="-3.302"/>
<vertex x="-2.921" y="-2.413"/>
<vertex x="-2.413" y="-2.921"/>
</polygon>
</symbol>
<symbol name="GND">
<wire x1="-1.27" y1="0" x2="1.27" y2="0" width="0.254" layer="94"/>
<wire x1="1.27" y1="0" x2="0" y2="-1.27" width="0.254" layer="94"/>
<wire x1="0" y1="-1.27" x2="-1.27" y2="0" width="0.254" layer="94"/>
<text x="-1.905" y="-3.175" size="1.778" layer="96">&gt;VALUE</text>
<pin name="GND" x="0" y="2.54" visible="off" length="short" direction="sup" rot="R270"/>
</symbol>
<symbol name="+5V">
<wire x1="-0.635" y1="1.27" x2="0.635" y2="1.27" width="0.1524" layer="94"/>
<wire x1="0" y1="0.635" x2="0" y2="1.905" width="0.1524" layer="94"/>
<circle x="0" y="1.27" radius="1.27" width="0.254" layer="94"/>
<text x="-1.905" y="3.175" size="1.778" layer="96">&gt;VALUE</text>
<pin name="+5V" x="0" y="-2.54" visible="off" length="short" direction="sup" rot="R90"/>
</symbol>
</symbols>
<devicesets>
<deviceset name="C-POL" prefix="C" uservalue="yes">
<description>&lt;B&gt;POLARIZED CAPACITOR&lt;/B&gt;, European symbol</description>
<gates>
<gate name="G$1" symbol="C-POL" x="0" y="0"/>
</gates>
<devices>
<device name="TT2D7" package="C-POL2.54MM">
<connects>
<connect gate="G$1" pin="+" pad="+"/>
<connect gate="G$1" pin="-" pad="-"/>
</connects>
<technologies>
<technology name=""/>
</technologies>
</device>
<device name="TT5D7" package="C-POL5MM">
<connects>
<connect gate="G$1" pin="+" pad="+"/>
<connect gate="G$1" pin="-" pad="-"/>
</connects>
<technologies>
<technology name=""/>
</technologies>
</device>
</devices>
</deviceset>
<deviceset name="R" prefix="R" uservalue="yes">
<description>&lt;B&gt;RESISTOR&lt;/B&gt;, European symbol</description>
<gates>
<gate name="G$1" symbol="R" x="0" y="0"/>
</gates>
<devices>
<device name="1/4W" package="R">
<connects>
<connect gate="G$1" pin="1" pad="1"/>
<connect gate="G$1" pin="2" pad="2"/>
</connects>
<technologies>
<technology name=""/>
</technologies>
</device>
</devices>
</deviceset>
<deviceset name="LED" prefix="LED" uservalue="yes">
<description>&lt;b&gt;LED&lt;/b&gt;&lt;p&gt;
&lt;u&gt;OSRAM&lt;/u&gt;:&lt;br&gt;

- &lt;u&gt;CHIPLED&lt;/u&gt;&lt;br&gt;
LG R971, LG N971, LY N971, LG Q971, LY Q971, LO R971, LY R971
LH N974, LH R974&lt;br&gt;
LS Q976, LO Q976, LY Q976&lt;br&gt;
LO Q996&lt;br&gt;

- &lt;u&gt;Hyper CHIPLED&lt;/u&gt;&lt;br&gt;
LW Q18S&lt;br&gt;
LB Q993, LB Q99A, LB R99A&lt;br&gt;

- &lt;u&gt;SideLED&lt;/u&gt;&lt;br&gt;
LS A670, LO A670, LY A670, LG A670, LP A670&lt;br&gt;
LB A673, LV A673, LT A673, LW A673&lt;br&gt;
LH A674&lt;br&gt;
LY A675&lt;br&gt;
LS A676, LA A676, LO A676, LY A676, LW A676&lt;br&gt;
LS A679, LY A679, LG A679&lt;br&gt;

-  &lt;u&gt;Hyper Micro SIDELED®&lt;/u&gt;&lt;br&gt;
LS Y876, LA Y876, LO Y876, LY Y876&lt;br&gt;
LT Y87S&lt;br&gt;

- &lt;u&gt;SmartLED&lt;/u&gt;&lt;br&gt;
LW L88C, LW L88S&lt;br&gt;
LB L89C, LB L89S, LG L890&lt;br&gt;
LS L89K, LO L89K, LY L89K&lt;br&gt;
LS L896, LA L896, LO L896, LY L896&lt;br&gt;

- &lt;u&gt;TOPLED&lt;/u&gt;&lt;br&gt;
LS T670, LO T670, LY T670, LG T670, LP T670&lt;br&gt;
LSG T670, LSP T670, LSY T670, LOP T670, LYG T670&lt;br&gt;
LG T671, LOG T671, LSG T671&lt;br&gt;
LB T673, LV T673, LT T673, LW T673&lt;br&gt;
LH T674&lt;br&gt;
LS T676, LA T676, LO T676, LY T676, LB T676, LH T676, LSB T676, LW T676&lt;br&gt;
LB T67C, LV T67C, LT T67C, LS T67K, LO T67K, LY T67K, LW E67C&lt;br&gt;
LS E67B, LA E67B, LO E67B, LY E67B, LB E67C, LV E67C, LT E67C&lt;br&gt;
LW T67C&lt;br&gt;
LS T679, LY T679, LG T679&lt;br&gt;
LS T770, LO T770, LY T770, LG T770, LP T770&lt;br&gt;
LB T773, LV T773, LT T773, LW T773&lt;br&gt;
LH T774&lt;br&gt;
LS E675, LA E675, LY E675, LS T675&lt;br&gt;
LS T776, LA T776, LO T776, LY T776, LB T776&lt;br&gt;
LHGB T686&lt;br&gt;
LT T68C, LB T68C&lt;br&gt;

- &lt;u&gt;Hyper Mini TOPLED®&lt;/u&gt;&lt;br&gt;
LB M676&lt;br&gt;

- &lt;u&gt;Mini TOPLED Santana®&lt;/u&gt;&lt;br&gt;
LG M470&lt;br&gt;
LS M47K, LO M47K, LY M47K
&lt;p&gt;
Source: http://www.osram.convergy.de&lt;p&gt;

&lt;u&gt;LUXEON:&lt;/u&gt;&lt;br&gt;
- &lt;u&gt;LUMILED®&lt;/u&gt;&lt;br&gt;
LXK2-PW12-R00, LXK2-PW12-S00, LXK2-PW14-U00, LXK2-PW14-V00&lt;br&gt;
LXK2-PM12-R00, LXK2-PM12-S00, LXK2-PM14-U00&lt;br&gt;
LXK2-PE12-Q00, LXK2-PE12-R00, LXK2-PE12-S00, LXK2-PE14-T00, LXK2-PE14-U00&lt;br&gt;
LXK2-PB12-K00, LXK2-PB12-L00, LXK2-PB12-M00, LXK2-PB14-N00, LXK2-PB14-P00, LXK2-PB14-Q00&lt;br&gt;
LXK2-PR12-L00, LXK2-PR12-M00, LXK2-PR14-Q00, LXK2-PR14-R00&lt;br&gt;
LXK2-PD12-Q00, LXK2-PD12-R00, LXK2-PD12-S00&lt;br&gt;
LXK2-PH12-R00, LXK2-PH12-S00&lt;br&gt;
LXK2-PL12-P00, LXK2-PL12-Q00, LXK2-PL12-R00
&lt;p&gt;
Source: www.luxeon.com&lt;p&gt;

&lt;u&gt;KINGBRIGHT:&lt;/U&gt;&lt;p&gt;
KA-3528ASYC&lt;br&gt;
Source: www.kingbright.com</description>
<gates>
<gate name="G$1" symbol="LED" x="0" y="0"/>
</gates>
<devices>
<device name="5MM" package="LED5MM">
<connects>
<connect gate="G$1" pin="A" pad="A"/>
<connect gate="G$1" pin="C" pad="K"/>
</connects>
<technologies>
<technology name=""/>
</technologies>
</device>
</devices>
</deviceset>
<deviceset name="GND" prefix="SUPPLY">
<description>&lt;b&gt;SUPPLY SYMBOL&lt;/b&gt;</description>
<gates>
<gate name="GND" symbol="GND" x="0" y="0"/>
</gates>
<devices>
<device name="">
<technologies>
<technology name=""/>
</technologies>
</device>
</devices>
</deviceset>
<deviceset name="+5V" prefix="SUPPLY">
<description>&lt;b&gt;SUPPLY SYMBOL&lt;/b&gt;</description>
<gates>
<gate name="+5V" symbol="+5V" x="0" y="0"/>
</gates>
<devices>
<device name="">
<technologies>
<technology name=""/>
</technologies>
</device>
</devices>
</deviceset>
</devicesets>
</library>
<library name="con-molex">
<description>&lt;b&gt;Molex Connectors&lt;/b&gt;&lt;p&gt;
&lt;author&gt;Created by librarian@cadsoft.de&lt;/author&gt;</description>
<packages>
<package name="22-23-2071">
<description>.100" (2.54mm) Center Header - 7 Pin</description>
<wire x1="-8.89" y1="3.175" x2="8.89" y2="3.175" width="0.254" layer="21"/>
<wire x1="8.89" y1="3.175" x2="8.89" y2="1.27" width="0.254" layer="21"/>
<wire x1="8.89" y1="1.27" x2="8.89" y2="-3.175" width="0.254" layer="21"/>
<wire x1="8.89" y1="-3.175" x2="-8.89" y2="-3.175" width="0.254" layer="21"/>
<wire x1="-8.89" y1="-3.175" x2="-8.89" y2="1.27" width="0.254" layer="21"/>
<wire x1="-8.89" y1="1.27" x2="-8.89" y2="3.175" width="0.254" layer="21"/>
<wire x1="-8.89" y1="1.27" x2="8.89" y2="1.27" width="0.254" layer="21"/>
<pad name="1" x="-7.62" y="0" drill="1" shape="long" rot="R90"/>
<pad name="2" x="-5.08" y="0" drill="1" shape="long" rot="R90"/>
<pad name="3" x="-2.54" y="0" drill="1" shape="long" rot="R90"/>
<pad name="4" x="0" y="0" drill="1" shape="long" rot="R90"/>
<pad name="5" x="2.54" y="0" drill="1" shape="long" rot="R90"/>
<pad name="6" x="5.08" y="0" drill="1" shape="long" rot="R90"/>
<pad name="7" x="7.62" y="0" drill="1" shape="long" rot="R90"/>
<text x="-8.89" y="3.81" size="1.016" layer="25" ratio="10">&gt;NAME</text>
<text x="-8.89" y="-5.08" size="1.016" layer="27" ratio="10">&gt;VALUE</text>
</package>
<package name="22-23-2041">
<description>.100" (2.54mm) Center Header - 4 Pin</description>
<wire x1="-5.08" y1="3.175" x2="5.08" y2="3.175" width="0.254" layer="21"/>
<wire x1="5.08" y1="3.175" x2="5.08" y2="1.27" width="0.254" layer="21"/>
<wire x1="5.08" y1="1.27" x2="5.08" y2="-3.175" width="0.254" layer="21"/>
<wire x1="5.08" y1="-3.175" x2="-5.08" y2="-3.175" width="0.254" layer="21"/>
<wire x1="-5.08" y1="-3.175" x2="-5.08" y2="1.27" width="0.254" layer="21"/>
<wire x1="-5.08" y1="1.27" x2="-5.08" y2="3.175" width="0.254" layer="21"/>
<wire x1="-5.08" y1="1.27" x2="5.08" y2="1.27" width="0.254" layer="21"/>
<pad name="1" x="-3.81" y="0" drill="1" shape="long" rot="R90"/>
<pad name="2" x="-1.27" y="0" drill="1" shape="long" rot="R90"/>
<pad name="3" x="1.27" y="0" drill="1" shape="long" rot="R90"/>
<pad name="4" x="3.81" y="0" drill="1" shape="long" rot="R90"/>
<text x="-5.08" y="3.81" size="1.016" layer="25" ratio="10">&gt;NAME</text>
<text x="-5.08" y="-5.08" size="1.016" layer="27" ratio="10">&gt;VALUE</text>
</package>
<package name="22-23-2031">
<description>.100" (2.54mm) Center Header - 3 Pin</description>
<wire x1="-3.81" y1="3.175" x2="3.81" y2="3.175" width="0.254" layer="21"/>
<wire x1="3.81" y1="3.175" x2="3.81" y2="1.27" width="0.254" layer="21"/>
<wire x1="3.81" y1="1.27" x2="3.81" y2="-3.175" width="0.254" layer="21"/>
<wire x1="3.81" y1="-3.175" x2="-3.81" y2="-3.175" width="0.254" layer="21"/>
<wire x1="-3.81" y1="-3.175" x2="-3.81" y2="1.27" width="0.254" layer="21"/>
<wire x1="-3.81" y1="1.27" x2="-3.81" y2="3.175" width="0.254" layer="21"/>
<wire x1="-3.81" y1="1.27" x2="3.81" y2="1.27" width="0.254" layer="21"/>
<pad name="1" x="-2.54" y="0" drill="1" shape="long" rot="R90"/>
<pad name="2" x="0" y="0" drill="1" shape="long" rot="R90"/>
<pad name="3" x="2.54" y="0" drill="1" shape="long" rot="R90"/>
<text x="-3.81" y="3.81" size="1.016" layer="25" ratio="10">&gt;NAME</text>
<text x="-3.81" y="-5.08" size="1.016" layer="27" ratio="10">&gt;VALUE</text>
</package>
</packages>
<symbols>
<symbol name="MV">
<wire x1="1.27" y1="0" x2="0" y2="0" width="0.6096" layer="94"/>
<text x="2.54" y="-0.762" size="1.524" layer="95">&gt;NAME</text>
<text x="-0.762" y="1.397" size="1.778" layer="96">&gt;VALUE</text>
<pin name="S" x="-2.54" y="0" visible="off" length="short" direction="pas"/>
</symbol>
<symbol name="M">
<wire x1="1.27" y1="0" x2="0" y2="0" width="0.6096" layer="94"/>
<text x="2.54" y="-0.762" size="1.524" layer="95">&gt;NAME</text>
<pin name="S" x="-2.54" y="0" visible="off" length="short" direction="pas"/>
</symbol>
</symbols>
<devicesets>
<deviceset name="22-23-2071" prefix="X">
<description>.100" (2.54mm) Center Header - 7 Pin</description>
<gates>
<gate name="-1" symbol="MV" x="0" y="7.62" addlevel="always" swaplevel="1"/>
<gate name="-2" symbol="M" x="0" y="5.08" addlevel="always" swaplevel="1"/>
<gate name="-3" symbol="M" x="0" y="2.54" addlevel="always" swaplevel="1"/>
<gate name="-4" symbol="M" x="0" y="0" addlevel="always" swaplevel="1"/>
<gate name="-5" symbol="M" x="0" y="-2.54" addlevel="always" swaplevel="1"/>
<gate name="-6" symbol="M" x="0" y="-5.08" addlevel="always" swaplevel="1"/>
<gate name="-7" symbol="M" x="0" y="-7.62" addlevel="always" swaplevel="1"/>
</gates>
<devices>
<device name="" package="22-23-2071">
<connects>
<connect gate="-1" pin="S" pad="1"/>
<connect gate="-2" pin="S" pad="2"/>
<connect gate="-3" pin="S" pad="3"/>
<connect gate="-4" pin="S" pad="4"/>
<connect gate="-5" pin="S" pad="5"/>
<connect gate="-6" pin="S" pad="6"/>
<connect gate="-7" pin="S" pad="7"/>
</connects>
<technologies>
<technology name="">
<attribute name="MF" value="MOLEX" constant="no"/>
<attribute name="MPN" value="22-23-2071" constant="no"/>
<attribute name="OC_FARNELL" value="1654534" constant="no"/>
<attribute name="OC_NEWARK" value="56H0445" constant="no"/>
</technology>
</technologies>
</device>
</devices>
</deviceset>
<deviceset name="22-23-2041" prefix="X">
<description>.100" (2.54mm) Center Header - 4 Pin</description>
<gates>
<gate name="-1" symbol="MV" x="0" y="2.54" addlevel="always" swaplevel="1"/>
<gate name="-2" symbol="M" x="0" y="0" addlevel="always" swaplevel="1"/>
<gate name="-3" symbol="M" x="0" y="-2.54" addlevel="always" swaplevel="1"/>
<gate name="-4" symbol="M" x="0" y="-5.08" addlevel="always" swaplevel="1"/>
</gates>
<devices>
<device name="" package="22-23-2041">
<connects>
<connect gate="-1" pin="S" pad="1"/>
<connect gate="-2" pin="S" pad="2"/>
<connect gate="-3" pin="S" pad="3"/>
<connect gate="-4" pin="S" pad="4"/>
</connects>
<technologies>
<technology name="">
<attribute name="MF" value="MOLEX" constant="no"/>
<attribute name="MPN" value="22-23-2041" constant="no"/>
<attribute name="OC_FARNELL" value="1462920" constant="no"/>
<attribute name="OC_NEWARK" value="38C0355" constant="no"/>
</technology>
</technologies>
</device>
</devices>
</deviceset>
<deviceset name="22-23-2031" prefix="X">
<description>.100" (2.54mm) Center Header - 3 Pin</description>
<gates>
<gate name="-1" symbol="MV" x="0" y="2.54" addlevel="always" swaplevel="1"/>
<gate name="-2" symbol="M" x="0" y="0" addlevel="always" swaplevel="1"/>
<gate name="-3" symbol="M" x="0" y="-2.54" addlevel="always" swaplevel="1"/>
</gates>
<devices>
<device name="" package="22-23-2031">
<connects>
<connect gate="-1" pin="S" pad="1"/>
<connect gate="-2" pin="S" pad="2"/>
<connect gate="-3" pin="S" pad="3"/>
</connects>
<technologies>
<technology name="">
<attribute name="MF" value="MOLEX" constant="no"/>
<attribute name="MPN" value="22-23-2031" constant="no"/>
<attribute name="OC_FARNELL" value="1462950" constant="no"/>
<attribute name="OC_NEWARK" value="30C0862" constant="no"/>
</technology>
</technologies>
</device>
</devices>
</deviceset>
</devicesets>
</library>
<library name="Arduino-clone">
<description>Arduino Clone pinheaders
By cl@xganon.com
http://www.xganon.com</description>
<packages>
<package name="NANO">
<pad name="TX0" x="5.08" y="-8.89" drill="0.8" shape="long"/>
<pad name="RX1" x="5.08" y="-6.35" drill="0.8" shape="long"/>
<pad name="RST1" x="5.08" y="-3.81" drill="0.8" shape="long"/>
<pad name="GND1" x="5.08" y="-1.27" drill="0.8" shape="long"/>
<pad name="D2" x="5.08" y="1.27" drill="0.8" shape="long"/>
<pad name="D3" x="5.08" y="3.81" drill="0.8" shape="long"/>
<pad name="D4" x="5.08" y="6.35" drill="0.8" shape="long"/>
<pad name="D5" x="5.08" y="8.89" drill="0.8" shape="long"/>
<pad name="D6" x="5.08" y="11.43" drill="0.8" shape="long"/>
<pad name="D7" x="5.08" y="13.97" drill="0.8" shape="long"/>
<pad name="D8" x="5.08" y="16.51" drill="0.8" shape="long"/>
<pad name="D9" x="5.08" y="19.05" drill="0.8" shape="long"/>
<pad name="RAW" x="-10.16" y="-8.89" drill="0.8" shape="long"/>
<pad name="GND" x="-10.16" y="-6.35" drill="0.8" shape="long"/>
<pad name="RST" x="-10.16" y="-3.81" drill="0.8" shape="long"/>
<pad name="A3" x="-10.16" y="11.43" drill="0.8" shape="long"/>
<pad name="A2" x="-10.16" y="13.97" drill="0.8" shape="long"/>
<pad name="A1" x="-10.16" y="16.51" drill="0.8" shape="long"/>
<pad name="A0" x="-10.16" y="19.05" drill="0.8" shape="long"/>
<pad name="D13" x="-10.16" y="26.67" drill="0.8" shape="long"/>
<pad name="D12" x="5.08" y="26.67" drill="0.8" shape="long"/>
<pad name="D11" x="5.08" y="24.13" drill="0.8" shape="long"/>
<pad name="D10" x="5.08" y="21.59" drill="0.8" shape="long"/>
<pad name="3.3V" x="-10.16" y="24.13" drill="0.8" shape="long" rot="R180"/>
<pad name="AREF" x="-10.16" y="21.59" drill="0.8" shape="long" rot="R180"/>
<pad name="5V" x="-10.16" y="-1.27" drill="0.8" shape="long"/>
<pad name="A4" x="-10.16" y="8.89" drill="0.8" shape="long" rot="R180"/>
<pad name="A5" x="-10.16" y="6.35" drill="0.8" shape="long" rot="R180"/>
<pad name="A6" x="-10.16" y="3.81" drill="0.8" shape="long" rot="R180"/>
<pad name="A7" x="-10.16" y="1.27" drill="0.8" shape="long" rot="R180"/>
</package>
</packages>
<symbols>
<symbol name="NANO">
<pin name="3.3V" x="-22.86" y="12.7" visible="pin" length="middle"/>
<pin name="AREF" x="-22.86" y="10.16" visible="pin" length="middle"/>
<pin name="TX0" x="10.16" y="-20.32" visible="pin" length="middle" rot="R180"/>
<pin name="RX1" x="10.16" y="-17.78" visible="pin" length="middle" rot="R180"/>
<pin name="RST1" x="10.16" y="-15.24" visible="pin" length="middle" rot="R180"/>
<pin name="GND2" x="10.16" y="-12.7" visible="pin" length="middle" rot="R180"/>
<pin name="D2" x="10.16" y="-10.16" visible="pin" length="middle" rot="R180"/>
<pin name="D3" x="10.16" y="-7.62" visible="pin" length="middle" rot="R180"/>
<pin name="D4" x="10.16" y="-5.08" visible="pin" length="middle" rot="R180"/>
<pin name="D5" x="10.16" y="-2.54" visible="pin" length="middle" rot="R180"/>
<pin name="D6" x="10.16" y="0" visible="pin" length="middle" rot="R180"/>
<pin name="D7" x="10.16" y="2.54" visible="pin" length="middle" rot="R180"/>
<pin name="D8" x="10.16" y="5.08" visible="pin" length="middle" rot="R180"/>
<pin name="D9" x="10.16" y="7.62" visible="pin" length="middle" rot="R180"/>
<pin name="RAW" x="-22.86" y="-20.32" visible="pin" length="middle"/>
<pin name="GND" x="-22.86" y="-17.78" visible="pin" length="middle"/>
<pin name="RST" x="-22.86" y="-15.24" visible="pin" length="middle"/>
<pin name="5.5V" x="-22.86" y="-12.7" visible="pin" length="middle"/>
<pin name="A3" x="-22.86" y="0" visible="pin" length="middle"/>
<pin name="A2" x="-22.86" y="2.54" visible="pin" length="middle"/>
<pin name="A1" x="-22.86" y="5.08" visible="pin" length="middle"/>
<pin name="A0" x="-22.86" y="7.62" visible="pin" length="middle"/>
<pin name="D13" x="-22.86" y="15.24" visible="pin" length="middle"/>
<pin name="D12" x="10.16" y="15.24" visible="pin" length="middle" rot="R180"/>
<pin name="D11" x="10.16" y="12.7" visible="pin" length="middle" rot="R180"/>
<pin name="D10" x="10.16" y="10.16" visible="pin" length="middle" rot="R180"/>
<pin name="A7" x="-22.86" y="-10.16" visible="pin" length="middle"/>
<pin name="A6" x="-22.86" y="-7.62" visible="pin" length="middle"/>
<pin name="A5" x="-22.86" y="-5.08" visible="pin" length="middle"/>
<pin name="A4" x="-22.86" y="-2.54" visible="pin" length="middle"/>
<wire x1="-17.78" y1="17.78" x2="-17.78" y2="-30.48" width="0.254" layer="94"/>
<wire x1="-17.78" y1="-30.48" x2="5.08" y2="-30.48" width="0.254" layer="94"/>
<wire x1="5.08" y1="-30.48" x2="5.08" y2="17.78" width="0.254" layer="94"/>
<wire x1="5.08" y1="17.78" x2="-17.78" y2="17.78" width="0.254" layer="94"/>
<text x="-12.7" y="20.32" size="1.778" layer="95">Arduino Nano</text>
</symbol>
</symbols>
<devicesets>
<deviceset name="NANO">
<description>Arduino Nano</description>
<gates>
<gate name="G$1" symbol="NANO" x="7.62" y="2.54"/>
</gates>
<devices>
<device name="" package="NANO">
<connects>
<connect gate="G$1" pin="3.3V" pad="3.3V"/>
<connect gate="G$1" pin="5.5V" pad="5V"/>
<connect gate="G$1" pin="A0" pad="A0"/>
<connect gate="G$1" pin="A1" pad="A1"/>
<connect gate="G$1" pin="A2" pad="A2"/>
<connect gate="G$1" pin="A3" pad="A3"/>
<connect gate="G$1" pin="A4" pad="A4"/>
<connect gate="G$1" pin="A5" pad="A5"/>
<connect gate="G$1" pin="A6" pad="A6"/>
<connect gate="G$1" pin="A7" pad="A7"/>
<connect gate="G$1" pin="AREF" pad="AREF"/>
<connect gate="G$1" pin="D10" pad="D10"/>
<connect gate="G$1" pin="D11" pad="D11"/>
<connect gate="G$1" pin="D12" pad="D12"/>
<connect gate="G$1" pin="D13" pad="D13"/>
<connect gate="G$1" pin="D2" pad="D2"/>
<connect gate="G$1" pin="D3" pad="D3"/>
<connect gate="G$1" pin="D4" pad="D4"/>
<connect gate="G$1" pin="D5" pad="D5"/>
<connect gate="G$1" pin="D6" pad="D6"/>
<connect gate="G$1" pin="D7" pad="D7"/>
<connect gate="G$1" pin="D8" pad="D8"/>
<connect gate="G$1" pin="D9" pad="D9"/>
<connect gate="G$1" pin="GND" pad="GND"/>
<connect gate="G$1" pin="GND2" pad="GND1"/>
<connect gate="G$1" pin="RAW" pad="RAW"/>
<connect gate="G$1" pin="RST" pad="RST"/>
<connect gate="G$1" pin="RST1" pad="RST1"/>
<connect gate="G$1" pin="RX1" pad="RX1"/>
<connect gate="G$1" pin="TX0" pad="TX0"/>
</connects>
<technologies>
<technology name=""/>
</technologies>
</device>
</devices>
</deviceset>
</devicesets>
</library>
</libraries>
<attributes>
</attributes>
<variantdefs>
</variantdefs>
<classes>
<class number="0" name="default" width="0" drill="0">
</class>
</classes>
<parts>
<part name="FRAME1" library="frames" deviceset="A3L-LOC" device=""/>
<part name="R1" library="isenproject" deviceset="R" device="1/4W" value="220"/>
<part name="LED1" library="isenproject" deviceset="LED" device="5MM"/>
<part name="X3" library="con-molex" deviceset="22-23-2071" device=""/>
<part name="U$1" library="Arduino-clone" deviceset="NANO" device=""/>
<part name="RASPI" library="con-molex" deviceset="22-23-2041" device=""/>
<part name="SUPPLY5" library="isenproject" deviceset="GND" device=""/>
<part name="SUPPLY6" library="isenproject" deviceset="+5V" device=""/>
<part name="SUPPLY7" library="isenproject" deviceset="+5V" device=""/>
<part name="SUPPLY8" library="isenproject" deviceset="+5V" device=""/>
<part name="SUPPLY9" library="isenproject" deviceset="GND" device=""/>
<part name="SUPPLY10" library="isenproject" deviceset="GND" device=""/>
<part name="R2" library="isenproject" deviceset="R" device="1/4W"/>
<part name="R3" library="isenproject" deviceset="R" device="1/4W"/>
<part name="R4" library="isenproject" deviceset="R" device="1/4W"/>
<part name="SUPPLY11" library="isenproject" deviceset="+5V" device=""/>
<part name="SERVO1" library="con-molex" deviceset="22-23-2031" device=""/>
<part name="SERVO2" library="con-molex" deviceset="22-23-2031" device=""/>
<part name="SERVO3" library="con-molex" deviceset="22-23-2031" device=""/>
<part name="SUPPLY12" library="isenproject" deviceset="+5V" device=""/>
<part name="SUPPLY13" library="isenproject" deviceset="GND" device=""/>
<part name="C5" library="isenproject" deviceset="C-POL" device="TT5D7"/>
<part name="R5" library="isenproject" deviceset="R" device="1/4W" value="220"/>
<part name="LED2" library="isenproject" deviceset="LED" device="5MM"/>
<part name="SUPPLY1" library="isenproject" deviceset="GND" device=""/>
<part name="R6" library="isenproject" deviceset="R" device="1/4W"/>
</parts>
<sheets>
<sheet>
<plain>
</plain>
<instances>
<instance part="FRAME1" gate="G$1" x="0" y="0"/>
<instance part="R1" gate="G$1" x="177.8" y="129.54" rot="R90"/>
<instance part="LED1" gate="G$1" x="177.8" y="119.38"/>
<instance part="X3" gate="-1" x="287.02" y="114.3"/>
<instance part="X3" gate="-2" x="287.02" y="111.76"/>
<instance part="X3" gate="-3" x="287.02" y="119.38"/>
<instance part="X3" gate="-4" x="287.02" y="109.22"/>
<instance part="X3" gate="-5" x="289.56" y="124.46"/>
<instance part="X3" gate="-6" x="287.02" y="116.84"/>
<instance part="X3" gate="-7" x="287.02" y="121.92"/>
<instance part="U$1" gate="G$1" x="238.76" y="119.38"/>
<instance part="RASPI" gate="-1" x="261.62" y="81.28" rot="R270"/>
<instance part="RASPI" gate="-2" x="259.08" y="81.28" rot="R270"/>
<instance part="RASPI" gate="-3" x="256.54" y="81.28" rot="R270"/>
<instance part="RASPI" gate="-4" x="254" y="81.28" rot="R270"/>
<instance part="SUPPLY5" gate="GND" x="208.28" y="101.6" rot="R270"/>
<instance part="SUPPLY6" gate="+5V" x="193.04" y="137.16" rot="R270"/>
<instance part="SUPPLY7" gate="+5V" x="208.28" y="99.06" rot="R90"/>
<instance part="SUPPLY8" gate="+5V" x="254" y="88.9"/>
<instance part="SUPPLY9" gate="GND" x="256.54" y="88.9" rot="R180"/>
<instance part="SUPPLY10" gate="GND" x="193.04" y="114.3" rot="R90"/>
<instance part="R2" gate="G$1" x="299.72" y="137.16"/>
<instance part="R3" gate="G$1" x="299.72" y="132.08"/>
<instance part="R4" gate="G$1" x="299.72" y="127"/>
<instance part="SUPPLY11" gate="+5V" x="312.42" y="132.08" rot="R270"/>
<instance part="SERVO1" gate="-1" x="248.92" y="160.02" rot="R90"/>
<instance part="SERVO1" gate="-2" x="251.46" y="160.02" rot="R90"/>
<instance part="SERVO1" gate="-3" x="254" y="160.02" rot="R90"/>
<instance part="SERVO2" gate="-1" x="259.08" y="160.02" rot="R90"/>
<instance part="SERVO2" gate="-2" x="261.62" y="160.02" rot="R90"/>
<instance part="SERVO2" gate="-3" x="264.16" y="160.02" rot="R90"/>
<instance part="SERVO3" gate="-1" x="269.24" y="160.02" rot="R90"/>
<instance part="SERVO3" gate="-2" x="271.78" y="160.02" rot="R90"/>
<instance part="SERVO3" gate="-3" x="274.32" y="160.02" rot="R90"/>
<instance part="SUPPLY12" gate="+5V" x="269.24" y="147.32" rot="R180"/>
<instance part="SUPPLY13" gate="GND" x="259.08" y="144.78"/>
<instance part="C5" gate="G$1" x="185.42" y="127"/>
<instance part="R5" gate="G$1" x="246.38" y="147.32" rot="R90"/>
<instance part="LED2" gate="G$1" x="238.76" y="154.94" rot="R180"/>
<instance part="SUPPLY1" gate="GND" x="238.76" y="165.1" rot="R180"/>
<instance part="R6" gate="G$1" x="299.72" y="144.78"/>
</instances>
<busses>
</busses>
<nets>
<net name="GND" class="0">
<segment>
<pinref part="SUPPLY5" gate="GND" pin="GND"/>
<pinref part="U$1" gate="G$1" pin="GND"/>
<wire x1="210.82" y1="101.6" x2="215.9" y2="101.6" width="0.1524" layer="91"/>
</segment>
<segment>
<pinref part="SERVO1" gate="-1" pin="S"/>
<wire x1="248.92" y1="157.48" x2="248.92" y2="152.4" width="0.1524" layer="91"/>
<wire x1="248.92" y1="152.4" x2="259.08" y2="152.4" width="0.1524" layer="91"/>
<pinref part="SERVO2" gate="-1" pin="S"/>
<wire x1="259.08" y1="152.4" x2="259.08" y2="157.48" width="0.1524" layer="91"/>
<pinref part="SERVO3" gate="-1" pin="S"/>
<wire x1="269.24" y1="157.48" x2="266.7" y2="157.48" width="0.1524" layer="91"/>
<wire x1="266.7" y1="157.48" x2="266.7" y2="152.4" width="0.1524" layer="91"/>
<wire x1="266.7" y1="152.4" x2="259.08" y2="152.4" width="0.1524" layer="91"/>
<junction x="259.08" y="152.4"/>
<pinref part="SUPPLY13" gate="GND" pin="GND"/>
<wire x1="259.08" y1="147.32" x2="259.08" y2="152.4" width="0.1524" layer="91"/>
</segment>
<segment>
<pinref part="RASPI" gate="-3" pin="S"/>
<pinref part="SUPPLY9" gate="GND" pin="GND"/>
<wire x1="256.54" y1="83.82" x2="256.54" y2="86.36" width="0.1524" layer="91"/>
</segment>
<segment>
<pinref part="LED1" gate="G$1" pin="C"/>
<wire x1="177.8" y1="114.3" x2="185.42" y2="114.3" width="0.1524" layer="91"/>
<pinref part="C5" gate="G$1" pin="-"/>
<wire x1="185.42" y1="121.92" x2="185.42" y2="114.3" width="0.1524" layer="91"/>
<pinref part="SUPPLY10" gate="GND" pin="GND"/>
<wire x1="185.42" y1="114.3" x2="190.5" y2="114.3" width="0.1524" layer="91"/>
<junction x="185.42" y="114.3"/>
</segment>
<segment>
<pinref part="LED2" gate="G$1" pin="C"/>
<pinref part="SUPPLY1" gate="GND" pin="GND"/>
<wire x1="238.76" y1="160.02" x2="238.76" y2="162.56" width="0.1524" layer="91"/>
</segment>
</net>
<net name="N$3" class="0">
<segment>
<pinref part="U$1" gate="G$1" pin="D8"/>
<pinref part="X3" gate="-5" pin="S"/>
<wire x1="248.92" y1="124.46" x2="281.94" y2="124.46" width="0.1524" layer="91"/>
<pinref part="R4" gate="G$1" pin="1"/>
<wire x1="281.94" y1="124.46" x2="287.02" y2="124.46" width="0.1524" layer="91"/>
<wire x1="294.64" y1="127" x2="281.94" y2="127" width="0.1524" layer="91"/>
<wire x1="281.94" y1="127" x2="281.94" y2="124.46" width="0.1524" layer="91"/>
<junction x="281.94" y="124.46"/>
</segment>
</net>
<net name="N$5" class="0">
<segment>
<pinref part="U$1" gate="G$1" pin="D7"/>
<pinref part="X3" gate="-7" pin="S"/>
<wire x1="248.92" y1="121.92" x2="284.48" y2="121.92" width="0.1524" layer="91"/>
<pinref part="R6" gate="G$1" pin="1"/>
<wire x1="294.64" y1="144.78" x2="284.48" y2="144.78" width="0.1524" layer="91"/>
<wire x1="284.48" y1="144.78" x2="284.48" y2="121.92" width="0.1524" layer="91"/>
<junction x="284.48" y="121.92"/>
</segment>
</net>
<net name="N$7" class="0">
<segment>
<pinref part="U$1" gate="G$1" pin="D6"/>
<pinref part="X3" gate="-3" pin="S"/>
<wire x1="248.92" y1="119.38" x2="276.86" y2="119.38" width="0.1524" layer="91"/>
<pinref part="R3" gate="G$1" pin="1"/>
<wire x1="276.86" y1="119.38" x2="284.48" y2="119.38" width="0.1524" layer="91"/>
<wire x1="294.64" y1="132.08" x2="276.86" y2="132.08" width="0.1524" layer="91"/>
<wire x1="276.86" y1="132.08" x2="276.86" y2="119.38" width="0.1524" layer="91"/>
<junction x="276.86" y="119.38"/>
</segment>
</net>
<net name="N$8" class="0">
<segment>
<pinref part="U$1" gate="G$1" pin="D5"/>
<pinref part="X3" gate="-6" pin="S"/>
<wire x1="248.92" y1="116.84" x2="284.48" y2="116.84" width="0.1524" layer="91"/>
</segment>
</net>
<net name="N$9" class="0">
<segment>
<pinref part="R2" gate="G$1" pin="1"/>
<wire x1="294.64" y1="137.16" x2="279.4" y2="137.16" width="0.1524" layer="91"/>
<pinref part="X3" gate="-1" pin="S"/>
<pinref part="U$1" gate="G$1" pin="D4"/>
<wire x1="248.92" y1="114.3" x2="279.4" y2="114.3" width="0.1524" layer="91"/>
<wire x1="279.4" y1="114.3" x2="284.48" y2="114.3" width="0.1524" layer="91"/>
<wire x1="279.4" y1="137.16" x2="279.4" y2="114.3" width="0.1524" layer="91"/>
<junction x="279.4" y="114.3"/>
</segment>
</net>
<net name="N$10" class="0">
<segment>
<pinref part="U$1" gate="G$1" pin="D3"/>
<pinref part="X3" gate="-2" pin="S"/>
<wire x1="248.92" y1="111.76" x2="284.48" y2="111.76" width="0.1524" layer="91"/>
</segment>
</net>
<net name="N$11" class="0">
<segment>
<pinref part="U$1" gate="G$1" pin="D2"/>
<pinref part="X3" gate="-4" pin="S"/>
<wire x1="248.92" y1="109.22" x2="284.48" y2="109.22" width="0.1524" layer="91"/>
</segment>
</net>
<net name="N$12" class="0">
<segment>
<pinref part="RASPI" gate="-1" pin="S"/>
<wire x1="261.62" y1="83.82" x2="261.62" y2="101.6" width="0.1524" layer="91"/>
<pinref part="U$1" gate="G$1" pin="RX1"/>
<wire x1="261.62" y1="101.6" x2="248.92" y2="101.6" width="0.1524" layer="91"/>
</segment>
</net>
<net name="N$13" class="0">
<segment>
<pinref part="RASPI" gate="-2" pin="S"/>
<wire x1="259.08" y1="83.82" x2="259.08" y2="99.06" width="0.1524" layer="91"/>
<pinref part="U$1" gate="G$1" pin="TX0"/>
<wire x1="259.08" y1="99.06" x2="248.92" y2="99.06" width="0.1524" layer="91"/>
</segment>
</net>
<net name="+5V" class="0">
<segment>
<pinref part="SUPPLY7" gate="+5V" pin="+5V"/>
<pinref part="U$1" gate="G$1" pin="RAW"/>
<wire x1="210.82" y1="99.06" x2="215.9" y2="99.06" width="0.1524" layer="91"/>
</segment>
<segment>
<pinref part="R2" gate="G$1" pin="2"/>
<wire x1="304.8" y1="137.16" x2="307.34" y2="137.16" width="0.1524" layer="91"/>
<pinref part="R4" gate="G$1" pin="2"/>
<wire x1="304.8" y1="127" x2="307.34" y2="127" width="0.1524" layer="91"/>
<wire x1="307.34" y1="127" x2="307.34" y2="132.08" width="0.1524" layer="91"/>
<pinref part="R3" gate="G$1" pin="2"/>
<wire x1="307.34" y1="132.08" x2="307.34" y2="137.16" width="0.1524" layer="91"/>
<wire x1="304.8" y1="132.08" x2="307.34" y2="132.08" width="0.1524" layer="91"/>
<junction x="307.34" y="132.08"/>
<wire x1="309.88" y1="132.08" x2="307.34" y2="132.08" width="0.1524" layer="91"/>
<pinref part="SUPPLY11" gate="+5V" pin="+5V"/>
<wire x1="307.34" y1="137.16" x2="307.34" y2="144.78" width="0.1524" layer="91"/>
<junction x="307.34" y="137.16"/>
<pinref part="R6" gate="G$1" pin="2"/>
<wire x1="307.34" y1="144.78" x2="304.8" y2="144.78" width="0.1524" layer="91"/>
</segment>
<segment>
<pinref part="SERVO1" gate="-2" pin="S"/>
<wire x1="251.46" y1="157.48" x2="251.46" y2="154.94" width="0.1524" layer="91"/>
<wire x1="251.46" y1="154.94" x2="261.62" y2="154.94" width="0.1524" layer="91"/>
<pinref part="SERVO2" gate="-2" pin="S"/>
<wire x1="261.62" y1="154.94" x2="261.62" y2="157.48" width="0.1524" layer="91"/>
<pinref part="SERVO3" gate="-2" pin="S"/>
<wire x1="271.78" y1="157.48" x2="271.78" y2="154.94" width="0.1524" layer="91"/>
<wire x1="271.78" y1="154.94" x2="269.24" y2="154.94" width="0.1524" layer="91"/>
<junction x="261.62" y="154.94"/>
<pinref part="SUPPLY12" gate="+5V" pin="+5V"/>
<wire x1="269.24" y1="154.94" x2="261.62" y2="154.94" width="0.1524" layer="91"/>
<wire x1="269.24" y1="154.94" x2="269.24" y2="149.86" width="0.1524" layer="91"/>
<junction x="269.24" y="154.94"/>
</segment>
<segment>
<pinref part="RASPI" gate="-4" pin="S"/>
<pinref part="SUPPLY8" gate="+5V" pin="+5V"/>
<wire x1="254" y1="83.82" x2="254" y2="86.36" width="0.1524" layer="91"/>
</segment>
<segment>
<pinref part="R1" gate="G$1" pin="2"/>
<wire x1="177.8" y1="137.16" x2="185.42" y2="137.16" width="0.1524" layer="91"/>
<wire x1="177.8" y1="134.62" x2="177.8" y2="137.16" width="0.1524" layer="91"/>
<pinref part="C5" gate="G$1" pin="+"/>
<wire x1="185.42" y1="129.54" x2="185.42" y2="137.16" width="0.1524" layer="91"/>
<pinref part="SUPPLY6" gate="+5V" pin="+5V"/>
<wire x1="185.42" y1="137.16" x2="190.5" y2="137.16" width="0.1524" layer="91"/>
<junction x="185.42" y="137.16"/>
</segment>
</net>
<net name="N$14" class="0">
<segment>
<pinref part="SERVO1" gate="-3" pin="S"/>
<wire x1="254" y1="157.48" x2="254" y2="127" width="0.1524" layer="91"/>
<pinref part="U$1" gate="G$1" pin="D9"/>
<wire x1="254" y1="127" x2="248.92" y2="127" width="0.1524" layer="91"/>
</segment>
</net>
<net name="N$15" class="0">
<segment>
<pinref part="SERVO2" gate="-3" pin="S"/>
<wire x1="264.16" y1="157.48" x2="264.16" y2="129.54" width="0.1524" layer="91"/>
<pinref part="U$1" gate="G$1" pin="D10"/>
<wire x1="264.16" y1="129.54" x2="248.92" y2="129.54" width="0.1524" layer="91"/>
</segment>
</net>
<net name="N$16" class="0">
<segment>
<pinref part="SERVO3" gate="-3" pin="S"/>
<wire x1="274.32" y1="157.48" x2="274.32" y2="132.08" width="0.1524" layer="91"/>
<pinref part="U$1" gate="G$1" pin="D11"/>
<wire x1="274.32" y1="132.08" x2="248.92" y2="132.08" width="0.1524" layer="91"/>
</segment>
</net>
<net name="N$6" class="0">
<segment>
<pinref part="LED1" gate="G$1" pin="A"/>
<pinref part="R1" gate="G$1" pin="1"/>
<wire x1="177.8" y1="121.92" x2="177.8" y2="124.46" width="0.1524" layer="91"/>
</segment>
</net>
<net name="N$1" class="0">
<segment>
<pinref part="U$1" gate="G$1" pin="D12"/>
<wire x1="248.92" y1="134.62" x2="248.92" y2="142.24" width="0.1524" layer="91"/>
<pinref part="R5" gate="G$1" pin="1"/>
<wire x1="248.92" y1="142.24" x2="246.38" y2="142.24" width="0.1524" layer="91"/>
</segment>
</net>
<net name="N$2" class="0">
<segment>
<pinref part="R5" gate="G$1" pin="2"/>
<pinref part="LED2" gate="G$1" pin="A"/>
<wire x1="246.38" y1="152.4" x2="238.76" y2="152.4" width="0.1524" layer="91"/>
</segment>
</net>
</nets>
</sheet>
</sheets>
</schematic>
</drawing>
</eagle>
