<?xml version="1.0" encoding="UTF-8" standalone="no"?>
<svg
   style="fill-opacity:1; color-rendering:auto; color-interpolation:auto; text-rendering:auto; stroke:black; stroke-linecap:square; stroke-miterlimit:10; shape-rendering:auto; stroke-opacity:1; fill:black; stroke-dasharray:none; font-weight:normal; stroke-width:1; font-family:'Dialog'; font-style:normal; stroke-linejoin:miter; font-size:12px; stroke-dashoffset:0; image-rendering:auto;"
   version="1.1"
   id="svg120"
   sodipodi:docname="client_serveur.svg"
   inkscape:version="1.1.1 (3bf5ae0d25, 2021-09-20)"
   xmlns:inkscape="http://www.inkscape.org/namespaces/inkscape"
   xmlns:sodipodi="http://sodipodi.sourceforge.net/DTD/sodipodi-0.dtd"
   xmlns:xlink="http://www.w3.org/1999/xlink"
   xmlns="http://www.w3.org/2000/svg"
   xmlns:svg="http://www.w3.org/2000/svg">
  <sodipodi:namedview
     id="namedview122"
     pagecolor="#ffffff"
     bordercolor="#666666"
     borderopacity="1.0"
     inkscape:pageshadow="2"
     inkscape:pageopacity="0.0"
     inkscape:pagecheckerboard="0"
     showgrid="false"
     inkscape:zoom="2.91"
     inkscape:cx="178.69416"
     inkscape:cy="97.938144"
     inkscape:window-width="3769"
     inkscape:window-height="2132"
     inkscape:window-x="71"
     inkscape:window-y="0"
     inkscape:window-maximized="1"
     inkscape:current-layer="svg120"
     inkscape:lockguides="false" />
  <!--Generated by Filius-->
  <defs
     id="genericDefs" />
  <g
     id="g118"
     transform="matrix(0.46988798,0,0,0.4855953,-35.967697,-70.407875)">
    <defs
       id="defs1">
      <clipPath
         clipPathUnits="userSpaceOnUse"
         id="clipPath1">
        <path
           d="M 0,0 H 2020 V 1620 H 0 Z"
           id="path3" />
      </clipPath>
      <clipPath
         clipPathUnits="userSpaceOnUse"
         id="clipPath2">
        <path
           d="M 0,0 V 1500 H 2000 V 0 Z"
           id="path6" />
      </clipPath>
      <clipPath
         clipPathUnits="userSpaceOnUse"
         id="clipPath3">
        <path
           d="M 0,0 V 78 H 176 V 0 Z"
           id="path9" />
      </clipPath>
      <clipPath
         clipPathUnits="userSpaceOnUse"
         id="clipPath4">
        <path
           d="M 0,0 V 23 H 242 V 0 Z"
           id="path12" />
      </clipPath>
      <clipPath
         clipPathUnits="userSpaceOnUse"
         id="clipPath5">
        <path
           d="M 0,0 V 89 H 241 V 0 Z"
           id="path15" />
      </clipPath>
      <clipPath
         clipPathUnits="userSpaceOnUse"
         id="clipPath6">
        <path
           d="M 0,0 V 87 H 232 V 0 Z"
           id="path18" />
      </clipPath>
      <clipPath
         clipPathUnits="userSpaceOnUse"
         id="clipPath7">
        <path
           d="M 0,0 V 72 H 70 V 0 Z"
           id="path21" />
      </clipPath>
      <clipPath
         clipPathUnits="userSpaceOnUse"
         id="clipPath8">
        <path
           d="M 0,0 V 114 H 64 V 0 Z"
           id="path24" />
      </clipPath>
      <clipPath
         clipPathUnits="userSpaceOnUse"
         id="clipPath9">
        <path
           d="M 0,0 V 100 H 84 V 0 Z"
           id="path27" />
      </clipPath>
      <clipPath
         clipPathUnits="userSpaceOnUse"
         id="clipPath10">
        <path
           d="M 0,0 V 1600 H 2000 V 0 Z"
           id="path30" />
      </clipPath>
      <clipPath
         clipPathUnits="userSpaceOnUse"
         id="clipPath11">
        <path
           d="M 0,0 V 15 H 57 V 0 Z"
           id="path33" />
      </clipPath>
      <font
         horiz-adv-x="60.009766"
         id="font1"
         horiz-origin-x="0"
         horiz-origin-y="0"
         vert-origin-x="512"
         vert-origin-y="768"
         vert-adv-y="1024">
        <font-face
           ascent="92.822266"
           descent="23.583984"
           units-per-em="100"
           style="font-style:normal; font-family:sans-serif; font-weight:bold;"
           id="font-face36" />
        <missing-glyph
           horiz-adv-x="60.009766"
           d="M4.9844 -17.6719 L4.9844 70.5156 L54.9844 70.5156 L54.9844 -17.6719 L4.9844 -17.6719 ZM10.5938 -12.1094 L49.4219 -12.1094 L49.4219 64.8906 L10.5938 64.8906 L10.5938 -12.1094 Z"
           id="missing-glyph38" />
        <glyph
           unicode="u"
           horiz-adv-x="71.19141"
           d="M7.8125 21.2969 L7.8125 54.6875 L25.3906 54.6875 L25.3906 49.2188 Q25.3906 44.7812 25.3438 38.0625 Q25.2969 31.3438 25.2969 29.1094 Q25.2969 22.5156 25.6406 19.6094 Q25.9844 16.7031 26.8125 15.375 Q27.875 13.6719 29.6094 12.7344 Q31.3438 11.8125 33.5938 11.8125 Q39.0625 11.8125 42.1875 16.0156 Q45.3125 20.2188 45.3125 27.6875 L45.3125 54.6875 L62.7969 54.6875 L62.7969 0 L45.3125 0 L45.3125 7.9062 Q41.3594 3.125 36.9375 0.8438 Q32.5156 -1.4219 27.2031 -1.4219 Q17.7188 -1.4219 12.7656 4.3906 Q7.8125 10.2031 7.8125 21.2969 Z"
           id="glyph40" />
        <glyph
           unicode="a"
           horiz-adv-x="67.48047"
           d="M32.9062 24.6094 Q27.4375 24.6094 24.6719 22.75 Q21.9219 20.9062 21.9219 17.2812 Q21.9219 13.9688 24.1406 12.0781 Q26.375 10.2031 30.3281 10.2031 Q35.25 10.2031 38.625 13.7344 Q42 17.2812 42 22.6094 L42 24.6094 L32.9062 24.6094 ZM59.625 31.2031 L59.625 0 L42 0 L42 8.1094 Q38.4844 3.125 34.0781 0.8438 Q29.6875 -1.4219 23.3906 -1.4219 Q14.8906 -1.4219 9.5938 3.5312 Q4.2969 8.5 4.2969 16.4062 Q4.2969 26.0312 10.9062 30.5156 Q17.5312 35.0156 31.6875 35.0156 L42 35.0156 L42 36.375 Q42 40.5312 38.7188 42.4531 Q35.4531 44.3906 28.5156 44.3906 Q22.9062 44.3906 18.0625 43.2656 Q13.2344 42.1406 9.0781 39.8906 L9.0781 53.2188 Q14.7031 54.5938 20.3594 55.2969 Q26.0312 56 31.6875 56 Q46.4844 56 53.0469 50.1719 Q59.625 44.3438 59.625 31.2031 Z"
           id="glyph42" />
        <glyph
           unicode="e"
           horiz-adv-x="67.822266"
           d="M62.9844 27.4844 L62.9844 22.5156 L22.125 22.5156 Q22.75 16.3594 26.5625 13.2812 Q30.375 10.2031 37.2031 10.2031 Q42.7188 10.2031 48.5 11.8438 Q54.2969 13.4844 60.4062 16.7969 L60.4062 3.3281 Q54.2031 0.9844 48 -0.2188 Q41.7969 -1.4219 35.5938 -1.4219 Q20.75 -1.4219 12.5156 6.125 Q4.2969 13.6719 4.2969 27.2969 Q4.2969 40.6719 12.375 48.3281 Q20.4531 56 34.625 56 Q47.5156 56 55.25 48.2344 Q62.9844 40.4844 62.9844 27.4844 ZM45.0156 33.2969 Q45.0156 38.2812 42.1094 41.3281 Q39.2031 44.3906 34.5156 44.3906 Q29.4375 44.3906 26.2656 41.5312 Q23.0938 38.6719 22.3125 33.2969 L45.0156 33.2969 Z"
           id="glyph44" />
        <glyph
           unicode="s"
           horiz-adv-x="59.521484"
           d="M51.125 52.9844 L51.125 39.7031 Q45.5156 42.0469 40.2812 43.2188 Q35.0625 44.3906 30.4219 44.3906 Q25.4375 44.3906 23.0156 43.1406 Q20.6094 41.8906 20.6094 39.3125 Q20.6094 37.2031 22.4375 36.0781 Q24.2656 34.9688 29 34.4219 L32.0781 33.9844 Q45.5156 32.2812 50.1406 28.375 Q54.7812 24.4688 54.7812 16.1094 Q54.7812 7.375 48.3281 2.9688 Q41.8906 -1.4219 29.1094 -1.4219 Q23.6875 -1.4219 17.8906 -0.5625 Q12.1094 0.2969 6 2 L6 15.2812 Q11.2344 12.75 16.7188 11.4688 Q22.2188 10.2031 27.875 10.2031 Q33.0156 10.2031 35.5938 11.6094 Q38.1875 13.0312 38.1875 15.8281 Q38.1875 18.1719 36.4062 19.3125 Q34.625 20.4531 29.2969 21.0938 L26.2188 21.4844 Q14.5469 22.9531 9.8594 26.9062 Q5.1719 30.8594 5.1719 38.9219 Q5.1719 47.6094 11.125 51.7969 Q17.0938 56 29.3906 56 Q34.2344 56 39.5469 55.2656 Q44.875 54.5469 51.125 52.9844 Z"
           id="glyph46" />
        <glyph
           unicode="é"
           horiz-adv-x="67.822266"
           d="M62.9844 27.4844 L62.9844 22.5156 L22.125 22.5156 Q22.75 16.3594 26.5625 13.2812 Q30.375 10.2031 37.2031 10.2031 Q42.7188 10.2031 48.5 11.8438 Q54.2969 13.4844 60.4062 16.7969 L60.4062 3.3281 Q54.2031 0.9844 48 -0.2188 Q41.7969 -1.4219 35.5938 -1.4219 Q20.75 -1.4219 12.5156 6.125 Q4.2969 13.6719 4.2969 27.2969 Q4.2969 40.6719 12.375 48.3281 Q20.4531 56 34.625 56 Q47.5156 56 55.25 48.2344 Q62.9844 40.4844 62.9844 27.4844 ZM45.0156 33.2969 Q45.0156 38.2812 42.1094 41.3281 Q39.2031 44.3906 34.5156 44.3906 Q29.4375 44.3906 26.2656 41.5312 Q23.0938 38.6719 22.3125 33.2969 L45.0156 33.2969 ZM42.1875 79.9844 L56 79.9844 L37.9844 61.625 L28.4219 61.625 L42.1875 79.9844 Z"
           id="glyph48" />
        <glyph
           unicode="R"
           horiz-adv-x="77.00195"
           d="M35.8906 40.5781 Q41.7969 40.5781 44.3594 42.7656 Q46.9219 44.9688 46.9219 50 Q46.9219 54.9844 44.3594 57.125 Q41.7969 59.2812 35.8906 59.2812 L27.9844 59.2812 L27.9844 40.5781 L35.8906 40.5781 ZM27.9844 27.5938 L27.9844 0 L9.1875 0 L9.1875 72.9062 L37.8906 72.9062 Q52.2969 72.9062 59 68.0625 Q65.7188 63.2344 65.7188 52.7812 Q65.7188 45.5625 62.2188 40.9219 Q58.7344 36.2812 51.7031 34.0781 Q55.5625 33.2031 58.6094 30.0938 Q61.6719 27 64.7969 20.7031 L75 0 L54.9844 0 L46.0938 18.1094 Q43.4062 23.5781 40.6406 25.5781 Q37.8906 27.5938 33.2969 27.5938 L27.9844 27.5938 Z"
           id="glyph50" />
        <glyph
           unicode="v"
           horiz-adv-x="65.18555"
           d="M1.5156 54.6875 L19 54.6875 L32.625 16.8906 L46.1875 54.6875 L63.7188 54.6875 L42.1875 0 L23 0 L1.5156 54.6875 Z"
           id="glyph52" />
        <glyph
           unicode="r"
           horiz-adv-x="49.316406"
           d="M49.0312 39.7969 Q46.7344 40.875 44.4531 41.375 Q42.1875 41.8906 39.8906 41.8906 Q33.1562 41.8906 29.5156 37.5625 Q25.875 33.25 25.875 25.2031 L25.875 0 L8.4062 0 L8.4062 54.6875 L25.875 54.6875 L25.875 45.7031 Q29.25 51.0781 33.6094 53.5312 Q37.9844 56 44.0938 56 Q44.9688 56 45.9844 55.9219 Q47.0156 55.8594 48.9688 55.6094 L49.0312 39.7969 Z"
           id="glyph54" />
        <glyph
           unicode="S"
           horiz-adv-x="72.021484"
           d="M59.9062 70.6094 L59.9062 55.1719 Q53.9062 57.8594 48.1875 59.2188 Q42.4844 60.5938 37.4062 60.5938 Q30.6719 60.5938 27.4375 58.7344 Q24.2188 56.8906 24.2188 52.9844 Q24.2188 50.0469 26.3906 48.4062 Q28.5625 46.7812 34.2812 45.6094 L42.2812 44 Q54.4375 41.5469 59.5625 36.5625 Q64.7031 31.5938 64.7031 22.4062 Q64.7031 10.3594 57.5469 4.4688 Q50.3906 -1.4219 35.6875 -1.4219 Q28.7656 -1.4219 21.7812 -0.0938 Q14.7969 1.2188 7.8125 3.8125 L7.8125 19.6719 Q14.7969 15.9688 21.3125 14.0781 Q27.8281 12.2031 33.8906 12.2031 Q40.0469 12.2031 43.3125 14.25 Q46.5781 16.3125 46.5781 20.125 Q46.5781 23.5312 44.3594 25.3906 Q42.1406 27.25 35.5 28.7188 L28.2188 30.3281 Q17.2812 32.6719 12.2188 37.7969 Q7.1719 42.9219 7.1719 51.6094 Q7.1719 62.5 14.2031 68.3594 Q21.2344 74.2188 34.4219 74.2188 Q40.4375 74.2188 46.7812 73.3125 Q53.125 72.4062 59.9062 70.6094 Z"
           id="glyph56" />
        <glyph
           unicode="t"
           horiz-adv-x="47.802734"
           d="M27.4844 70.2188 L27.4844 54.6875 L45.5156 54.6875 L45.5156 42.1875 L27.4844 42.1875 L27.4844 19 Q27.4844 15.1875 29 13.8438 Q30.5156 12.5 35.0156 12.5 L44 12.5 L44 0 L29 0 Q18.6562 0 14.3281 4.3125 Q10.0156 8.6406 10.0156 19 L10.0156 42.1875 L1.3125 42.1875 L1.3125 54.6875 L10.0156 54.6875 L10.0156 70.2188 L27.4844 70.2188 Z"
           id="glyph58" />
        <glyph
           unicode="n"
           horiz-adv-x="71.19141"
           d="M63.375 33.2969 L63.375 0 L45.7969 0 L45.7969 5.4219 L45.7969 25.4844 Q45.7969 32.5625 45.4844 35.25 Q45.1719 37.9375 44.3906 39.2031 Q43.3594 40.9219 41.5938 41.875 Q39.8438 42.8281 37.5938 42.8281 Q32.125 42.8281 29 38.5938 Q25.875 34.375 25.875 26.9062 L25.875 0 L8.4062 0 L8.4062 54.6875 L25.875 54.6875 L25.875 46.6875 Q29.8281 51.4688 34.2656 53.7344 Q38.7188 56 44.0938 56 Q53.5625 56 58.4688 50.1875 Q63.375 44.3906 63.375 33.2969 Z"
           id="glyph60" />
        <glyph
           unicode="i"
           horiz-adv-x="34.277344"
           d="M8.4062 54.6875 L25.875 54.6875 L25.875 0 L8.4062 0 L8.4062 54.6875 ZM8.4062 75.9844 L25.875 75.9844 L25.875 61.7188 L8.4062 61.7188 L8.4062 75.9844 Z"
           id="glyph62" />
        <glyph
           unicode="l"
           horiz-adv-x="34.277344"
           d="M8.4062 75.9844 L25.875 75.9844 L25.875 0 L8.4062 0 L8.4062 75.9844 Z"
           id="glyph64" />
        <glyph
           unicode="C"
           horiz-adv-x="73.38867"
           d="M67 4 Q61.8125 1.3125 56.2031 -0.0469 Q50.5938 -1.4219 44.4844 -1.4219 Q26.2656 -1.4219 15.625 8.7656 Q4.9844 18.9531 4.9844 36.375 Q4.9844 53.8594 15.625 64.0312 Q26.2656 74.2188 44.4844 74.2188 Q50.5938 74.2188 56.2031 72.8438 Q61.8125 71.4844 67 68.7969 L67 53.7188 Q61.7656 57.2812 56.6875 58.9375 Q51.6094 60.5938 46 60.5938 Q35.9375 60.5938 30.1719 54.1406 Q24.4219 47.7031 24.4219 36.375 Q24.4219 25.0938 30.1719 18.6406 Q35.9375 12.2031 46 12.2031 Q51.6094 12.2031 56.6875 13.8594 Q61.7656 15.5312 67 19.0938 L67 4 Z"
           id="glyph66" />
        <glyph
           unicode="F"
           horiz-adv-x="68.31055"
           d="M9.1875 72.9062 L59.9062 72.9062 L59.9062 58.6875 L27.9844 58.6875 L27.9844 45.125 L58.0156 45.125 L58.0156 30.9062 L27.9844 30.9062 L27.9844 0 L9.1875 0 L9.1875 72.9062 Z"
           id="glyph68" />
      </font>
    </defs>
    <g
       style="font-family:sans-serif;fill:#333333;stroke:#333333;text-rendering:optimizeLegibility"
       transform="translate(309,229)"
       id="g76">
      <rect
         x="1"
         y="1"
         width="174"
         style="stroke:none"
         rx="5"
         ry="5"
         height="76"
         clip-path="url(#clipPath3)"
         id="rect72" />
      <rect
         x="1"
         y="1"
         width="173"
         style="fill:none;stroke:#000000"
         rx="5"
         ry="5"
         height="75"
         clip-path="url(#clipPath3)"
         id="rect74" />
    </g>
    <g
       transform="translate(400,264)"
       style="font-family:sans-serif;fill:#404040;stroke:#404040;stroke-width:2;text-rendering:optimizeLegibility"
       id="g80">
      <path
         d="M 2,21 Q 60,5 240,2"
         style="fill:none;stroke:#e7e7e7"
         clip-path="url(#clipPath4)"
         id="path78" />
    </g>
    <g
       transform="translate(163,283)"
       style="font-family:sans-serif;fill:#404040;stroke:#404040;stroke-width:2;text-rendering:optimizeLegibility"
       id="g84">
      <path
         d="M 2,87 Q 60,22 239,2"
         style="fill:none;stroke:#e7e7e7"
         clip-path="url(#clipPath5)"
         id="path82" />
    </g>
    <g
       transform="translate(172,200)"
       style="font-family:sans-serif;fill:#404040;stroke:#404040;stroke-width:2;text-rendering:optimizeLegibility"
       id="g88">
      <path
         d="M 2,2 Q 174,21 230,85"
         style="fill:none;stroke:#e7e7e7"
         clip-path="url(#clipPath6)"
         id="path86" />
    </g>
    <g
       style="font-weight:bold;font-family:sans-serif;fill:#333333;stroke:#333333"
       transform="translate(367,249)"
       id="g94">
      <image
         x="0"
         y="1"
         width="70"
         xlink:href="data:image/png;base64,iVBORw0KGgoAAAANSUhEUgAAAEYAAAA0CAYAAAA3xE5OAAAMD0lEQVR4Xu2a6XNU VRqHkVVZVQRFQUAQ2ROWiKwJi7LJruxLkM2CURaFAQpIRFYTDIZYgQQIokmAQVHZ BaZLiqmR0plYM39A13zy01R/sGqkxqHeeZ9Dn9TJ6U7nkkAGcE7VrzpJd997znN+ 73LvTZ069+54tGHDhpkNGjQoU6X7b/4mx8MPP5zeqFGjsEqsFFL4NwuoSZMmyQol pJIECgPO/+4DOR7V0bhx4yOPPPKI+Hr88cdl2LBh8uKLL5qfnfcebEDqklUKJaIS V82bN5e+ffvK5MmTy/Xqq69Kr169zHsPLKCmTZumKZSwvoqvbt26GQguFB9Q7969 pUWLFi7MsB4v3T/PfTM0ajo0a9YsxK7rawU9++yzMmbMmBgQlckCcqEC+74CRB7R kcku+3ryySclLS0tZuFBBRwfsiqsSvfncU8NBZKuiqjE1RNPPCH9+/ePWWhQAfOZ Z54xOSeB7j1AuvC0xx57LKQSXyTRRHkkkQi3zp07V4DsyndkVGE2yJ9jrQ6dQIeW LVseUYkryu1zzz13W3nEFSCTk5NjIFemp556yrjqpZdeMj9Hwf1vAKlLMlURwsRV 27ZtZfjw4TGLDaqBAwdK69atDdyqxOdSUlIqfB+offr0kVatWllwtQNIJzNZFWZS rtq0aWOaM3+hQQXM9u3bV4DsO9EViThRiFpADuSwfi/dX0+Nhya/ZLVpiMriC9sn mmQijR07Vl544QWzw1UJWJ06dbqtEGVeNJAO1DsDqEOHDo+qG/biCCviGHXp0sUs zJ9MEDHhfv36ydNPPx0D2ncjateuXY1CFDiuG/U8P40cOfIf/noDDYWwSiceYfJW gFFYMmLEiJiTB9XgwYNN2FjAiUTOGjBgQMwxggqYHTt2rAAZ99F1T58+Xfw1Jxw6 mTQNnTJ6B1d0rCRH/+RBBUzCxnVfIpEjJkyYEHOcIMLJLN53o27qzXHjxsmiRYtk yZIlwcDolzqoZU9hW8RuWWH7mkwyKSnJwHXdV5m6du1a7RBljjSTftjrGm4OGjRI 5s+fLwsXLgwGhjyibsjEEb569OghEPYnEERMkkpF2LiQXbmOpPfRuI85TlANGTLE bKgb9ojiMGXKFJkzZ05wMAolXRUmb1ixkOeff15GjRoVc/KgGjp0qOlaLWDrwnji nOymf4ygAibz9UNf//afV155xeSSWbNmBQOjk0nWpBQiMbliMZD3Tx5UwMRlwE0k CwzbVzdEcTKXHH7Y6/FvsgZc8tprrwUDQ9gogCPY1he2r8kkyUPAdd1XmXr27Fmj EKVScS4/9AFNfpo0aVIMmLVr18r58+djwagbMrVBitAkuaKLrMkkqVRYGbi+A31R lWoSotz+pH9ywx5RgQgp1kGP5IIBQnFxsVy9elWuXbtWEYxeZIWZvKvu3bvLyy+/ HHPyoEpNTTUVxAftOxFxvpqGKGHjg9bj/kp+Yh10xC6YGTNmyL59uVJ0qEC++eZi fDB8ENJWNFn+yYOKSZDpyUdBhO1rGqI+aN2AX+lzuKqmP/LBbNq0SS5ePCdvvrmI cJEe3bvJ5cuXYsHwCyGDlRGW9CdRlcaPH2/ykAvYd6Er4PEd/zhBZEOUc/iOJLnz HpXPB7N48WIpKSmWktIivQxILr9P07VrF/nxr9djwSxYsMCcEOtbcfAgO8lncBhx bMEiF5ArJl6TEGWxhLkPWs/5C+7hvgvh44KZOnWqHCk6KKdPn5YTfzgqKSm3XGZD bsCAFPnh++9iwVCm5s6da6iyQCsWQexPnDgxZoKIaw1i2wXqygXFYqrjRCsboj5o gDAHoOBYFwx9yo4d22XPnh3SvHkzmTJ5opw9e1YOHs6TwUMGa56ZJsuXL5WTJ0s1 lC7Ltm3bLJiIgllZZ968eaaOz5w50xwMIIjFIMonJ7QVg88wEfu+CzOemGhlcKuS DVEXclQ3ODcpgHzig1m+fLl8Vlwk06ZNNDfGeXpA+Hx//U8GTknpIbl05XMJfXtB cnNzDRAMkp6enrN06dIWplTjFmo5mfr111+X0aNHmxMCxJUFVpUsMPqG6uYRQOJW jgdcz43/5m/MyQdD2Bw4cEA+LT4offv1qdAwpqUNk7/88GcD5sKFC3Ls+KcmbKIN Xkg5JJU3dYzZs2cbt/BlW+PJ4NwaxKaVyQdnxUSB6y82qMgLXFhawI4zf47mEwPL BUM+yc7Okg/37JatmVu0N/lMtr6/0YTfuPFjtBqNk6KiAvn666/l2LFjxlHRBi+i YBZUAGKHdUuDBg2M5TgYSZXdJlb5nQnEkw+L/sVfaFABk83wHapQblDaSZS8umBw 5YoVK+Tw4QLd9elSt25doz3Zu6W0tERy8z6QM+dK5cofz8iJEydk/fr1boOXoRFy K2ziDdxCa9ywYUPz7xb8RwFXnuwcCZncQpViF135kFB17qTRW5AXfMhIHXKD6x1C wgfDhu79aK/sy8vWMOpX4X7w3368LufOnpbjx4/Ll18dl6ysD8rPpWBCGnLtfQ4x A7dgK/t/KIDhYTkPq4hpwLBg3ENDhnVxkZUPjM8FSbZ8BofFcyRhY+/RRC/+ysHg rLy8XMnPz5eCgnyZO29mhRYhOTlJw0X7lZISycnJMWki2uCFNRIm+euvdJBwp02b Vg7FguFBOaHF3S2AUG7pWXAPlgdQPLFQ7qMS95UBAjYJ04eq4fEzILjFyE0kFwxh s2rVKikszDe9x5vLliigPDl46IC8s/Z36nrtV47my9GjBw00rTC2wYsomAw9Z+Vh E2+oWyJkc9ctQGnSpIkBQ7nDPXSWAKIkAoaFWRiAiCcWY3sKgLBzgI0D81+6+F94 IEYouGBoxmhCc3P3yvbtGSZcmCfz/eLz4wZCYWGBfHWmRE59VSpvvfWW2+CdUlUd NvGGuuUUk2YCLpQ6B+qUQ0G0z0yY2GfBLBx38LtNlPzMzvuAEknD458A4Rw+GIoA 1za5+7Jlxsyp3t23JG3lv5ODhYWmRG/cuME0gtEGL6zhn+qv9baGZuhUMjW7yRM6 HwyvQGHSvM9DKqxtEzDVgXJKPqKc4iw3UdqyisNcKcifOB67z/lcMDhy/frfy8d5 H8muXbtkz4dZsiB99q1KlNJf3+8vS5e+Ifv358vmzZtNUqWPUUdH1JEr/TVWe+jO 5NjyDAQ3hCwYXi0YJs/jBkDYJozEZ8sq4MgN7DA7jwP4Dt/nWBoGv9SrV89UQhcM UAmbjz/OlTmzzSMMeWfNSg2h7ZKzN1syt27Qjna/XLj4uQktioZt8BRKkb7eXh4J MjRrl+EakiyLdkOInQQMUHhlkcQ6CwaAvZgjHLlJRImlqmB5jsVn+S7HATgwXDAA I1ETDpTfPn2Syv/PhY7129Al2blzp2TvyZaTX3wib7+9woQhTlQwZeqwmoVNokHW 1lJYRsUADrttL83dMAIMC+WVRVO1AGCvVumgrVt4z3ULoHGjCwaANGnvvvuu7Ni1 RcOym3GcbecXL0qXkuJPDRg6VtwRbfAiCiZ+13qnB3DI5GR04JA3XCjWKT4YINgQ sm4hhFy3ABgHEDYAsWD43urVqw2Y97ZukTcWzTNJff6C2aaVz8raKWvWrDFJ1Wnw cu5K2FQ1FEoG+YbJEMM4wj78tiFkoQCAnSWUrFv4vOsWW3VwC5WPy494YNatW6eX /+/J7qxMuRL6Ui/0PjG9iNPghTSXVbzYq+2hV7dJmuHL6F0ozyRG6wAXjH0ghr3t Qy3XLTbh4hYqHmGUCMyGDRtky5bN6p6NJl9FG7yw/hy8a62NoYltpdo2gnMol7jC dQu7SUWih7EJ17rFJlzcQgjhFhqz+vXr/1wZGKoSf3M63wwFX/thE2QQzxr3Gbr4 COWZOLdhg5PoYwDnusUtz4SQdUs0v0R8MMuWLTOucxq8kEKuXtda2wNACiZHwURs M2dvQtNgWbf45dlzC7cGysHgMsLVafDC+v27V37v5sDaCmal7nbYLc9+M2cTrp9b HnrooZ/iNHj8u2uGf677diiUVN31InVLpLLyjFuAEHULHW3YBaPwTimU+yNsqjM0 jCYpmBz+I9J1CyHkuMUFU6Zg7s+wqe7AAQplki48Q6GE1C1lUbegv+vPd+5i7/+j 9sZ/AbIW0YRMrhPUAAAAAElFTkSuQmCC"
         height="52"
         preserveAspectRatio="none"
         clip-path="url(#clipPath7)"
         id="image90" />
      <text
         x="9"
         y="69"
         style="stroke:#e7e7e7;text-rendering:geometricPrecision"
         xml:space="preserve"
         clip-path="url(#clipPath7)"
         id="text92">Réseau</text>
    </g>
    <g
       style="font-weight:bold;font-family:sans-serif;fill:#333333;stroke:#333333"
       transform="translate(608,209)"
       id="g100">
      <image
         x="0"
         y="1"
         width="64"
         xlink:href="data:image/png;base64,iVBORw0KGgoAAAANSUhEUgAAAEAAAABeCAYAAACTtRI1AAAKSklEQVR4XuWaSWxU yxWGn5JI2UR5LJNFIi+yyC5v8bJ5ipDFAsVCiCchBpvJzJjBmHk2ZgYhhBksC4yN QYBBBIyQkZhbCMEigBuCmMFmnqEBg41tcOV8JZd1qW6759t9TUlHt/sOdev/6tSp U9X9ww9pWAKBQI9Xr14VvXnzxv/69etf7evdurx8+TJXxAdEuBIA2t6+fesTKBn2 vd2qiOhMEe+Xo8IsAEoAYMV4h/2sp8uzZ88yXrx4US3iFRYGgHr37p0cArl2PZ4r 9KQILxJTWBQAtL1//97f0NCQadfriSK9nvv8+fOAER8jAPXhwwes0jPDQoRninC/ HJUcO8THCUCJJwTEiuz3pU1hnD958qT66dOnCvFJAKA+fvyI1afVsKivr+/x6NGj IhGvMBcAqE+fPqnGxkZfU1NTht0eV8vDhw9zRXzg8ePHWrzLALQJhCKllLvxQURn PnjwwC9HhaUYgPr8+XO9HHPtdia8iLtn3L9/v1p6XmFpBEBbS0uLT+wnu91xF8a5 WLGIV9LzWnw6AmhubtYmECoTNixEeIFYAPEeAoA1yHOPbT0Rlzt37mTW1dXViykB oMV7CQDXqNfWFbYwzkW07969ewrxXgMg379Sh3mHra/Twji/e/dusZhCvNcAIJz7 nfVHDEDcvUAsgHgvAuA69dn1hwXAOL99+3a9HBXmNQCccwq36+8UwI0bNzJEuE9M YV4DIJ+/8rxdr11/EAC/39/j5s2bxWLq1q1bWryXAIh94V7qddYdEYDr168XiPAA 4r0IgOvUYcRHBUBcfrEAUHLU4r0EQL63Uo+pL1YAI7wGQL4384xdX0wApLKzIv6j FwDIsZV7qMdY3AAgSkPTHYAtPKEAeAHi0hGAfG7hOWcdCQeAcQLB6QJArNEpPOkA MKgjOsUAmrmP55zPugLAQEBoKgDI+SbncykBgBFxEeMWAPn+ifvMMykHYIwKEJks AGINXHfenzIAVG4DMN7AixCdQACfOR/q/pQByM3N7RSCAcGLEBwPAPnexH3G7PtT BqBnz55q9OjRXUIwRkXch/hIAcjnZ07haQmgV69eaujQoerKlStBojszswRtFxlK kBbuhJTWAHr37q0GDBig9u3bFyQ2GmM6FcGtRrinAPTp00f169dPzZ8/X7/EFheJ AcA5PDwJoH///mrkyJFq9+7dQQLDWbcBMGjQIB0Xpk+frk6cOBEktDPrdgCYJseM GaOHhc/n0y+xRX8XAPLy8tSUKVPUtGnTVFlZmTp58qROmT0PgMgfLYBZs2apefPm qcLCQrV06VK1atUqvbHiSQB+v1/17dv3+wWAXb58WYv9bgFgVDpz5sy0BsAa5Ny5 c+ro0aPqwIEDas+ePWrnzp16ut6/f7+qqalRZ8+e1bEpagDGKisr0wYAq9Bjx47p oMssNHHiRDVu3Dg1adIkNWzYMDV8+PBvjGu0c+rUqWrRokVq165d6urVq9EBwHiI l6QCAOfIO6hzwoQJauzYsVrsiBEjdFtI0Jw2atQobSzoMNqKmXOTJ09WW7Zs0V4R EsCSJUuCABjDxRDuFoBTp06pgoIC3XDg06sIN+KjAWAbHXrt2rVgAOQBy5YtCxJv jMACwWQDqKio0O+wXTteAHgQxj35+fnau4MAkAcsWLBABxobgDFEVFdXa49JNACC mnF1e1wnCgDxgfvXrl0bGgB5AEEmkj0Bts+PHDmitm7dqtasWRM3AKI4IpMNwATQ 7Ozsv4cEYPKAHTt2BImO1GIBcOHCBd04NwBwT05OTm6XAJgGmUZomC0wnMUCACP4 mcCXTADUMXjw4GlhAZg8oKSkRCcgttDOLFYAxBeEpB0AHqAikhGE2YJtixUA/1Vg FkhbACQlJBUEvePHj2sRtvh4AGCk4nYcSDqArKysqAA484Dly5fr+Zv0mbQ1XgDF xcVBcSDpAA4ePBgzAAIlecDKlSu1C8cLoLy83H0AGAEoHQBs3LgxNQCw8+fP692h VAFgHUD9rgdBpzGO58yZ4zoAdqXI0+3edx2AMTYZ3AJw8eJFvcjiXfYMkFQAbBLY wp3GL8EsfJIJgPUDC6ohQ4Zo8a4CYB/QFh3K6KHZs2cnHADLUtJfGmR631UAuLkt tis7ffq0WrduXUIAAH/x4sUd4lMCYPXq1Tr42ELDGQLYsiotLY0JAH+7Yc/OKT5l AOhRk8HFajyPeBNTugJQW1urZxkEOcWnDAA9xw4JvWILi9U6AwCohQsXajEEvVQA kOttUldDTk7OTx0AyOdZ4Fy6dClITFfGljMN3rt3b1gAbEYSSLkf8W4D4Lo8+0Wu /0dvh1GcABjHRUVFeicIV7XFhjJxI91gGtEVAP6Cy3SKGCHvKgBzbfz48TekvT+L xt8EAUC8AUBQY3OUPbpwIIwH2H+pcQLA7amX+xDvJgDuFeGf5FyhvO+PHcKdAOh9 UlCmJCcApjiC1ebNm9WZM2f01rgNoDMzAOh54gsNyc7Odg1A+/ev4vr/k3r/Zuvu KMYDCEz8C4SjDYD5fsaMGTphYeeXpTORnB8lbeE2ALbSaBDi3QBgIEiwe5+Xlzcm MzPzd7bmb4ozBiCaLA/RnQFg7uYets7JCrkOlO3bt6uqqir9KxJDhwRrw4YNenvL iE82gHZ3b5G2HZAV7V9trSELAFasWKHFEgMQzqIEsXPnzg0LgGmFsUYjaKCJ8Ijl u1N8MgFg0o6ALN562xq7LAaASWuJAUBAKD8eMCxiBcDnZANov/ZFxnq5rS2iYoYA UxQC2ZAkDgAB0eJSWijC0wkAJm7fJt56e2hXQS5csfMAIxJvMDGAIWGmFcZ0qgFw nalN3j0tKyvr97amqIpzGsT9mQpxe9wfDzAxgHOIJsLSIBN4EM85NwC0v/ertO2/ EuT+ZGuJqRgPwOURyRSIkbLS2yYOOGMAIBBOo2g0wgYOHNiRFSYDAD0v7Xkt7Rko 4n9r64i5SNr71AwBXB5P4G8oZhpEMD1MLGAodBUDaGiiAXBO3tMq8PfL5z/b7Y+7 HDp0qMwZAxBt3N/EAAIj50yigWjE2wASPQTa8/cX8ty/7HYntJSWljY6F0N4AL2N aMSbadC4Pw0zvW16yohJBACOArRV2rDVbmtSSk1NzQDJ19vsxRDbXvQwovnsnAbN f4ZMVDai4gHAd9bqMgyvSzzJsNuZ1HL48OF8GwBDgGBo3J81NTA6iwHxDAG8SOr/ LENurN021wqeIHl9W6jFEDMBggmICDWLDqDEA8B4jXjXcYnuf7Db5HoRCL+sX7++ 0QbgnAZxf5MPGLH8gBLtNMh1qe+FuPy/7XakvMiq7qAkRW2hAIQaAsSCaKZBGVYt Um+59PqP9rvTpsgU+ZfKykpfJAAiHQJAEvEPZJj9035f2hZAVFRU+MQjWuMBIPe1 yLBaaNfvqVJVVZVfUlJSK0JaIwUggZKh5E9Y/p4uRWD8sm3btrJNmzb5CgsLAzJl NjoBML0JoCZJrIbbz3b7UldX94/a2toJ32xBp2H5P3jtxdo6IKDZAAAAAElFTkSu QmCC"
         height="94"
         preserveAspectRatio="none"
         clip-path="url(#clipPath8)"
         id="image96" />
      <text
         x="5"
         y="111"
         style="stroke:#e7e7e7;text-rendering:geometricPrecision"
         xml:space="preserve"
         clip-path="url(#clipPath8)"
         id="text98">Serveur</text>
    </g>
    <g
       style="font-weight:bold;font-family:sans-serif;fill:#333333;stroke:#333333"
       transform="translate(123,320)"
       id="g106">
      <image
         x="0"
         y="1"
         width="84"
         xlink:href="data:image/png;base64,iVBORw0KGgoAAAANSUhEUgAAAFQAAABQCAYAAACH+lLXAAAgYElEQVR4Xu2cB3hV VdaGRxBIAglJCEFHR9GRsYwIKoIIShfpvQok1BCKBAhdSOihSCihjgoWwAIiRRQL USyoCNjFRhRFRNRQpAji+te79t3hcn8crAOW/TznOdybk3Pvec+3v1X2CX/722k8 Jk+evHn69OmJoe//NX7GGDduXBUFKtOmTZNZs2blzJs3LzH0mL/GTxgZGRl9goCK ApUFCxbkLFy4MH3ZsmXRocf/NU4yVKHLJk2aJKUqtZSazTpL5rTpMn/+fLn33nvl /vvvz126dOlfYH/KUKC5AA2/uIYUuPBaKVCyvFRo2FUmTc0CqDz00EOycuXK3Mce e2xqdnZ2ydDf/2sEjfT09JIKVFKGZkqh0vWk4OW1peBlNaXQJdWl4L9ukLL1usi4 zJkAFQUqTz31lKxbt27B+vXrS4ae66+hY+TIkQkArd0xQ8Iq3Cxh17SWsKtbSNhV TaVQmYYO8r9rS6lanSV98iwPVF544QV5+eWXFzz77LNVQ8/5px6q0PkALdVkjERU 7SHhVZIk/PquElapo4RVTJCwa4HcSgE3l0JlG8vZNyRKv7EzPVB5/vnnZe3atdmq 4Kqh5/5TDlXo5rFjx0p0gzFSuN5QibhpkETcmCrhtfpKRI3eElHNQ+4sYdclqorb mYpjKyVIl1tnyNqnnwGorF69Gq/NXrRoUePQz/jTDFVntAKVtJHjJbLlZIlsMVGK NBsvRVStRRqNlML1hyvkIRJRZ6BC7i/hNfso4J4KuLuEV+5sCg6/tp006TNB7r5v iQUvBUqGkDN79uzE0M/7w48hQ4ZUUajSpHeWRCXeLlHt50pUu1kS1XaGRLaZKpGt bpMizSco4HFSuNEoKdxghKm4sAHuJ+E1bpFwFHxDNwXcUa7rkC4TZsyzlGvOnDky derUnPHjxydy40I/+w85hg4dmgbQK7reK0W7PyhFu90nRbsulKKd75GoTgsc5A5A nqmApyngKQpYVdx0rBRpDGBVcN3BahOpEmHq7aVwk+SSZsOkb/okgMqECRNEZ0Gu flZ6SkrKHxvssGHDsgF6Tq9HJab/kxKT8phE3/KIRPdaIUV7LpPoZIWcBOR7A4Dv NMCRHjA2YQpW/22YFvDgAarevhJevbec12CQtE9Jk1GjRokClX79+uX26tUrPTEx 8Y8JlosEaOzwjRJ76waJHfaixAx5XmIGrZOY1GyJ6feERKesVsgrpWivhxXwEok2 wKpiACf8R21itkS2ne7Uiweregs3SpcIg6vWUCtFitcZIDd1Giz9+/cXBSpJSUnS rVu3Bd27dy8Z+p1+t2PAgAFlAdq2/yyJy/hQio19T4qNfkeKjXpTiqW/JrFpmw1y zND1CvhZiRmggPs/oSp+1ABH91omRZMfUJtYpBZxl6r3DoU7R6JuzpLI1gFrQLkN VLl1NbDVHiBRtVOlQutUSezaHaB++2OAVaB9AFq+32opPu1LiZ/yhRS/7TMpPulT iZvwkRQb/4FBjgXyyDckdsQmB3jIC3kKju77uET3wSJQLx6scDsFw50RgJuhnjva PDcCz9WAdnmzAdK64zGwXbt2zVawVUO/5+9mKND5AL0w/R2Jn31QSsw9rPsDEj9z n8RP32OQi0/ZKcUnfyZxEz82FceNQ8VvSWz6q2oTr5hFxA5+zqm33+POHno/rMpV uF093Nstc3CeO0ktgYwhPeC3qXJRk0HSJCH59w9W/SwHoMUn75T4rL0SP2uflJh9 KABWAc/7zl4b4BkKeOpXquKdAQXnKNz31R7eVvW+7tSL/wbgRvdbo7awSgPbQxrU 7peiXTSodZzvAhqqtWwhQwqTKdS/1bz2H42GSt32PYKtYLPCTQz93qfl0PSlZGqq elnvMQ7OxG0Kdrsq8nMFt0sV+rVBjJ+1X0rMcYDj5yjsOQHA03P1OCxiu7MH4Ko1 xKa/bsp1vrtOolOfVNWq5/ZerqpdoqpdLFHmt/8JZApTLZAVbhKwgzqDpET9oVKt bZ9gsDmnPdhbbrmlEUBv6DbPAhAeWWy0qm3MuwYnLiNHlbjNeWqmggMwKp55QJV7 xKl4Fvbwjf5stztGbwi/Z75LYLOg9rLE4rkDnnaWkKfa+ySqy93mtZFkCWoHDizp 1wgFO1hi6g2W61r3kc5dj4HV7fRMufr06ZMJ0AsTF5uSYkmVVFUGQBVmMAzyOwbI Af5EAe+QeBRs6j3gFItNsM9S5U772nw3To+NG6+Zw5gtzhJIyzj/wHWW7xLIyHOL dr9fwWoR0ZEgRvoF2EkOrGYHBLAimhlc1byftOtkqRZb7mkHVhW6mZwwttP9Oh1X uEitUzNGo3ZM6lMSM/AZ80MLOgb4VZdOjX3XQBXHIhRu8alfBvzXwXW+q/aQhefu kriAauP094qNfNN57dCXJJY0DLAEMdKvpABYyw6OKdalXSh2kOWzlzYZeJxiQ6/r lA0FKr1vSdUofLcGjHtcRE5a7PLKnksDkFcr4DXHAOvUNQWnb3Zwxzi4qBHvNd9V CzCw//k+T7UEM7MO9do4ct1Rb0mxQBCLJf0KVixFg1kBmQFgp2olNtGlXBq8iqgV BHnrstDrOiUjOTm5CkCrtx5uTZCom2e6tIa8MUEvpOOddlHklNHdFXCPAGBVE5WT +aHB1crKlPuWglLfnfCxpVjxXrUG9qjzWwVtdqCq5jgrIlSxBnboiy6AUZUZWPXY botdscD3IXi1ylSwGXKWwg0CmhZ6badkaI6XBtALbxquacto1+hoPt66Slabt850 oFUhVlp2mu9UrOqJNrjLrVqK6f+UVVCmNAVjgQ1LwG8nf+q8FrA+BTOw+OxXLrcl u8AKRlE0bHSZgc6EaAteK+2zinajxHXpFkXCpe2m5gHVyF8l9NpOyVCFLuvdu7dE V0vVcjDVNTPU/K0tp6lLEU26rR/aLCMAeKqpJKrDPLs4csropAf0gpdJjCqK6B0z 8GlV2gvObzUIEYziMrZqINNULJMg5sFqhjDnWxfAVMkuM9hqx+elXATIAWtdutVr uc6S+637VVT9tUrHcXlAQ6/rlA0FmgtQ62FWYUuS8KrdXWeeDv2NfQ0y9bcBbjzS qpvIFpNVudM0aMySojoVi3YO2AINk94rnd9qUk+a9P/AkuOaFezLq8qsaMja7bIC DXLFxn5g9hE7YrOzATICbEBTregezgZade3vgW4Ova5TMnSalNUpL7Ub95Swcq3c WlH51hJWoa1bO6IDX6mThF/fzQBH1LxFVdzfep4GVxNwvIxKh8Q8KmGetfWiAdsj CKwpdr2lS0xpswINSlY4ELxma8EwV5WKWsllsQH8NeMjl2oF1GrpXKqqte9jEtvz 4WD/zAy9tlMy9IskALRU+QQpdHkdKagbe1Y2C11RXwqVbSRhVzdzoFkBvS5RldxF FZws4TVTrGNUuN4wWx5hqYTGR+TNWarYeRZEolVFqAlVmRWQ4976kgteWji4rOBT q7JIrZj+2AC5rJW3FAjksOO8Wjflees5vVYFA00IvbZTMpKSkuYDNObihlKwVCUp eFFl2xewvW7/qiqFLq2pkG9ygK9sokpuaeo15ao1hJtqU0PAZlqmgM9ZhqDZgXWg +j5qfogvmuI0cJE6mVopEjTyWw7rg5YVB7uct47HW9+xm0G6dlnPJXlAO3fufH7o tZ2SgfcAtMD5FXW7SgqcW0bOPOcKOfPc0lLgH7o/70opULKcFLiwosK9XgpeWsMp uExDt1YP2MqAVcXW6GOLd94KirScqB473SIyzWdr5ZEV4IGkW6h12EuuSMjz1s+c txL9yVvpG8zcb7aQZwFkAmoBVXvM9EBPj4SeUo0v1KhpV4OY/+xL5Mz4UpI/7gLd zpd8xUpKvrgLJX+JUnLm3y9TwGWlwAXlnXIvre5UiyVgB9d2sLX7iOq9rLdpGYJm B5FkBuqvBC6Xz95rTZHoW1a4Ksx7q5a2wRbgUyxnAd+5PsG0XIX6uakZVbfpnpfU nx4JvU73Rnyh0uVbKrB/S/74iyRf7HmSL+osyVckTs4oHKP7Yvq6hOSLOVfyF79Q zjz7UgVbRhVbwR7LKXhZLbWCBlIIn63gbSDZykLKQ+rvIs3G2WppJAVDItnAPZr6 POiKAw0uVhiQYqVp7jr6TYX6gesTWI+AgsD5qpWwdLU0Cygx7sO86a6BtU/otZ2S oV8mjS8Ud1Fdm+L5S/zLAY2MlzPCo+WMguFyRoFw2+eLiHFgi52vx12sx19hD5AV LHW9FOK5Jw1iYVcCtW3AAtRbgVp3kC3WRWqxENnyNleFaXFghUF3+gZaFPQLygIo CChFx7/voFrO6oPVd67hPX23nJ/2RjDQ0yOhpxPOFwq7oIb6Zzmd9gqVKR/7DwcP qIUKuy0sSvIVjpN80ec4SzjrUjkTpV6AUq8PUmpze9CBhx4szeJpE623gRocrGh6 WEGQ7JVKBvCMKvXFwPR/K6BUpn/AU8lVTan75fKB2XlAQ6/rlIy33nqriCbzu/hC 4ee2cNNXp3GBf1xp0zp/8X86sNFnK9x4B7io/jvmPJv6BtRUeo1mBJWcp5auq1lA Y/dw2XUJViREVO+dlwFQ1ka2mGCdI3uAgiqLUjKZQPWIW7a2jhYNl9csovtAFc8a lwYnF/2PSPWU+V6d2aHX9j8fW7duvfHDDz/c9f7773+9ZMmSHT16pOwtVzFZws5p alPYwJ53lSr2cgV3iVOt+qvt1Rbyn32Z5Fc1c4x5qQWpQPQv29ilVRXbm0rDq/Z0 Kg1MfauwWjH1s6zRYdUVU19TKusH5FVWGwO9gPekOE0Wulczcm3Ko9K2PYZ6hZ66 hF4hltbtAd12fPDBB6JA5d1335X33nvvwNKlSz/r12/w3gqVe0nYuc2k4MVVLCd1 D9uqHZx3tQK80qVWag8FLrhGwVd0MC+pJgX/faMrBq5q6qJ+RY36lSkAmPYEqIHW eacnQD8gNJ2KNpWucsvSgXSKhT8f+Y81V/bJ2dP35E13Amvodf7mQ6HFqSpH5eTk vKnbft1EX4uCNagKVLZs2WJgV61atXvYsJH7KlVLkbDzmkshBcV0LnhJVQcZa2B/ sb7mAdxLax2X9Be6uqWrqCpRUfk0qm+gVPVAJ1kn3paVSaW6LgzU/6RS1P8aoIYQ oDa6pROWYCaqSjOdSs9PfzcPqG5FQ6/3Nx0KranCe/Gjjz7a88knn8iTTz4pXbp0 kREjRsiGDRsMbLBaAct+zZo1B8aMmXjwhloDJOzCNuaN9rAt4NjKsOnrMo1MlQSj sGvaaD6qAalSR8tJTZ0830TtX1/z0obpbsoDtM1056MGlNzUByca2NmBSmqDVlI0 VKj7c1xTWmv8K1If9zD/dwm9ArxAlbhUt6+3b99u4GbMmCFNmjSR66+/XmrWrCm1 a9cW1pEeffRRUytgUStA33nnHds/8cQTubfdNuNg9bpDJeLijqa+QjROymt6pJvl ngrRglAeSE2Zqqt3Wq3fX/1ziE13VjKtx9oq06VPHWikzHerA3kKJS9da00QGtah HSqmfbVe8/x0nx963b/6UKUVV3j9FegWBXngiy++kBdffFH69OkjN998s7Rq1Urq 1Kkj1157rVxzzTVStWpVuemmm6Rnz54GNlStHuzatWu/yMqad+BGeqOlk12Lz7bu ElE1yR5hZHrzOKMFIUCy7kPFxENjjcfYursFJPyT6U7qRF8zSYNSTxooK11OalOe FYBXrMQ8BtT5aIcermX3myb02dnZZ6rKaijIZxXknq+++ko+++wzycrKEmr1Ro0a SZs2baRDhw62r1evnlx33XVSsWJFA1ulShWpUaOGHauR/zi1erBs69at+/LOO+89 WKeF5pTl+jlwNKXrDHDPiAYa0xENbrXSk7WfSPLPFpOOdf7bz5aiVEyd7jJ1RndH ncvdoiCp08B1x5J8P+UDQM/K+CQ4IJUJ5fCrjG3btv1dp/bqjz/++Gsdsm/fPnn2 2Wdl+PDhPC5o6gQkSmSqs9WqVUuaN28urVu3lgYNGhjcq666ypTLz3j/7rvvPi5o AfTtt9+2/QsvvPDNosVLv61/syquEjnmKLd8QmefJRSDONFFdBbW8pZQAr5JugTM 5AdUnQ+rOgPrUwMD/sniHwk+VdO4D9z61G07pOSQjb9dQq9BJlxV2VdBbtu1a9dB HfL555/b08JpaWnSsWNHYa1o4MCB0rdvX2nbtq3BYsqzb9q0qbRo0cIAV6tWTerW rWv7ChUqSKVKlUyxHmyoWgHL9vLLL++9d+HyI1WaTJEiVcZKVOtpLnE3gFkOIus/ iVpudpwfALnQrWbSgGZJg9VUeqUEo8HPu5RJ63p7DoDm8vitbiU1c6dckeJ6oL9q Qs/01il5k4J8Rj1yz6FDh+Tw4cPy3HPP2RTnCWH+igN1AqRZs2YWjNq1a2dqTUlJ oX9oYJnq7PFXgGMFBC22cuXKmSXgs6h4ypQp8uqrrx4HVSsu22/cuHHPkqVrvq3e epZE1p7qHsQ1gHcdW5Zm5ZK+KH5pIFe55kgq0/wZiTWYPFix2SX1VEqUn6RM9kDF l1K9xyyv0F9nhVOndrSCnK/q/HL//v3CIPDge/xNJg8r8HQwf6fJXu+keSbAmOK8 5gsBmAAFWN6/8cYbpXr16qZWbwXcCIBfeeWVBheweHFGRoa89NJLx4F94403bHvt tddyV6x6+tsa7W+XqIbz3PNLBnCZg0jgseXnY+v7PK3HmpGlSSNeDcDcYl16VyWx FE2TZLck9OjrFfrLGyKqyiTSGw04B44cOSIHDhywvwniuXVSIoDy5zAElsTERAM5 ePBgmThxor1PitSyZUuDgqdiA2zAJoVq2LChAWXqAxxbADLv47/47NVXX21eix2M GTPGPj9YrR6sbgcfXr72SNV2GslbLXZTmoDDY448JEE1NBSvfMk9lkOT2T9PRQOZ ae6fRsnUOl6ro7Mmff7rJPSqyiq6bdKovZeAwxTH0/hLYUCR8uCZTMnRo0fbB/KY NbBI4ocMGWL/BiYKHjZsmB2Df/rojw2wcS4A3nDDDXlqxSrwWxTqMwM2/o3ncr5g sEFQsYKD9yxccbRSuzslJmGl80ceiKAKUjWyVGyBh+nNE3sZDiSP7FAZFWdJJPDc VMkRb3mYP2+FUyPsuQpysUbx7aRBwGS/cOFCUx4XQsXjAw5TuFOnTvaMPLDxU/5N cEKxBCemq4eOSpnyTG1Uyu+iTKY7Km/fvr3Ur1/fVIqnAhr4QEah2AAbAYxjBg0a RCFwIrXK+vXrD8yeu+hIhfYLJLZ7duChM/dkn6mRNSV7+Iyn+3ZaReRABh7lmXtY ygQqpJ+V0BO9FeZ2VeUBUqHdu3fbn/4xbQksXFiPHj3sInjgHwiAAxCKArI9r9S7 twUo1MtNABq/i1IJXuPHj7f0ihtC4EHFycnJ9jn4Le+hYsASvAhaKBeAvA9klFqm TBmDi2K5GfzF8ubNm/PAvv7667Y988wz+yfdNu9wufb3SFzfDQ7glJ0Sz+qmQcx1 vU+WlX2n3h6X/FZq9JzjFfrjVzjVJ6trpbNJE/TdpEBffvmlqfKOO+4wYExhrx68 Du9r3LixTVcUCxwAAwZIgAWcD1C85jjAAhvoKNsHM692YKFWPov3sBCmPcBQJ4C9 UglcvMYSKBLwWQIZN2758uXHqdWDVSUfHjl66pGyHRZK/JAtwoO89sAD6/KAvP17 iZ/LUyWH3M+y9krH5BSv0JMn9Dq9/6kgs1SVH9DE2LFjh+zcudMiuOaYBpbSEHUC kwtGLUxXLhQl8T6vuRCmN97JF0C9/IzXWMHMmTNNmUDlfZTOjeDv4zk/5+P3EhIS DC6btwI8lhuDWitXrmxq5Yb4Y7AG8li28uXL2zG8f+eddx6nVs0GbFu9evXhlNTx 35dqs0RKjNruVAlU/2y/RnZ89KwxOV6duaHsjhvklAqyi25bVJUH1C8FoDQ0gIpK g8GiVv67CqAxtVEs0xyVEolRCiBQlYeJYgHB7wCDKY3iCGjAZc97+CjnwyLwWvwZ n+UmoUbOyzn5LGYA6uVnZAMoF5jcWAD7IEZGgGL5GeeYPXu2vPLKK8eBxRqWLVt2 OLFr2tGL2i6V+OEfumUPvHTKDnseqmTqc/bZJ03oWYpQv3yfbpACFc0xJRgq9Xgw WK9WwHrFogAuErA+yGAFXByg+EOEW2+91SByscAAHKokpWK6YxkAZO//EIvj8FKA o3iyAmYF58AuKBxQOe+xoVryWXwVj/UFAdaEz2IDeC3HETD5U3DyWfYUDGwPPvjg t+07DfvuojYPSPHBmgHw1PPY9+SK5Pu8Qk+e0CvQ2bodBSrNX8B6qMFgT6RWAhb/ qwIgUCwXw8WhTN8E8ZUSrwcMGGDggMjxwAE6YLlI1ImKAQ5Un6sCk733YtSG7XAj USo3lj2fj6cClJ/xmXw27wGVrXTp0mYJvMfnLF26NE+tQEWxDzzwgHToMvzoRW3u k7h+L0mNLpO9Qk+e0GtOuZA6WQPS9yTuHmqwWtlC1QpYr9bc3NzjrACloh4uHIVg B/wbeIDxvuqtwVsHfooiKRJIr5jmnBPV8poAhzqBRJD0NwVrALC/Qfwe9gM00iqU ymf670PwKlu2rO35bhQJa9asMbAe6qZNmwJgRxztkuT+ICyU3QmHwnwUXyFZp20G 1GC1AvZkagUsagUsivVWwEUClosEoJ+aBBHUihV4fwUKkACG4skA8FL+LJuUC+D8 HvAJaqgZO8F7USOw+BmfzbEA9akVUAGHFaFSvgPv4714LFaAakkDNa7kqRWobKri 7/S77FOvPfl/ZqAQ7+OO0AhGqbTMQsGGqvVEQStYreStHixq4QLxRC6aJJ8pTODg olAVXkm1BVxecxxqBRp9AeCjZi4Y0ExvbhLnwUuxAs4BXEByXm8FqBsl+xTLzxZv BWQCgCW48R6B0gct9iq0T7RYWKYK3qZA/3tQYiiwkgpwhzdpmg5A9WB/iVpDwaJW NnyVC0dZ3l+BAxCgMb2B69MmINIzwApQJzcINQONdAzwHMNNAjSfgQp9ZeWDJtOW zwEgquUYrID3mPYIy7cGFeTXev0blMkrrIU98sgjZAMnB8rQX7xaT/A2UKmIAquQ P2gDP6RW6mmmSHDQAuqePXvMo7hoLg4FAYQAA1xfJAAAJRK0AIkNYAEEKIAAEMUB FSvAUwHI76F8bwXcEI7lpnHDuFEoHkvATwHv81duIMB8z1WFdFCvd49CfQQeNMsD QDc/9NBDJw9KfuiJquoJt+KnNBuQu++Y/xi1LliwwFTIBTBF+SKhag0Gy7FcGMcD 1qdVwAUEMH2/gJ9x8fgwx/I+MPmc4CmPraBCpjjH8f+X4NP8m5vIebmReDTH03bk evyytl7jdt0/osLYjYcGgOYq0B9fbgYPPeFFuuVu3LjRgLD3vurBhqqV/zOJKc3U 8VUTPoUnoSrSklC17t27Nw8s4JiiXDRAmX4A8T7rLQElAY4Axc3gWODRJ8D3qMIA zHk4HzcBX/bVF6/5PF7PnTvXpjUzjWvQ68nV/QYVyRauj5kWAJqpZerPb9Ux8FQF t0wVunf9+vV0arynHBe0gIrv8OWZUr4dhy/5AEAbjgQbddGlQs3Bag0F622AqYn3 +eYI52ba+8YMQAGLz3Kc/x2iPvns9OnTj7MNVIodAB1LwvuZVQrxkF7HLrWrbGIA 3y8ANFuPO3nN/mOHQovSE6epl36CBQSr1XsrYMk98S6+OF4IAKoV37skFSGKkmj7 IHHXXXfZDQmGSmswGCyqZAMS0ADNuX0QIRBhBagWG0DRfg2Lac50xovxU15TOPA/ kAGNAAo4BblfwW44dOhQLt8jADRXv9vPm94/ZijUcvoB21StewhWbORowZkAjQcf uT1Q1EkTmAaF71cCA7XhcwBgMS9UrYB9/PHHj1MsUH3JihK5eXyGDywAp+/Kxs8B zvchMGEFq1atMjViOUDTaZ2r2yb9rE+///57a5jz+RpI0/R6f9n0/jGDel+hTiRg MV0IWOSsgRzNoPJYDUm4X67wTWHUCVy6QiT1RHgUzX9biUqCgxYXxQbUYLAo0IP1 jRYsxquYm+MjPVZAwEK5dK/4ftwobppCPaRT/ENV5Rucn4XFANBs/fzzQ6/7Nx8K 7jLdFirgzwGIDaBYwDKFPVgUSzACIl7KHnWiXqYewey/FQTBamUhMBgsN8ODJQ1i D1QyA2YIHkvThenNsjbrXpxbp/dhgg5K9asPCjRHRP73T8+FDoVXXeFtUuPe4/M0 bwXeBgCM9y5evNiS8czMTPt5cEFwop5raIrl1fpDYLEBAhYK5SaSSnEe1Mfv6eft oTWps2sPN5LPVaC5+rM0hfnbT++fMtRv6im4T1Wx+z1Y7IDg5T02NMX6oYLgRF2s E6kVxbFuRLLvwQKS6E6awwCmnueQ+uT7Wj5uZQYRTANAl52S6f1jh37JMIXWVr/w elXsFx4sG//2FxNcFIQWBMFqDe65hqr1h8A++OCD9v7Ro0ftOIKOzobNpHu+mazf QT8658dXOad6KJQIhdZYVfmUgt2FSrEBbwe89rkscE8E9qeolQ2o+CRRmvf1PHv1 87drVbOHjhGfq0BzFejJm8Kn81DFVtYLu1un/TZVykGU4lXLRZIpABc7YMMKQtV6 ohWCE6mVvR5Lcv6Rgty5YsUKa8YAVO1nvgI9vXzyl4xAGTtR4X6lcL/x5Wzw5qck yvV+6332v6mVjZ+pyj/V83xEI5ipzyqnAt28du3a38/0/jlDp3htBbtSoX2jAA8F e22weoF+AsDfAxj1+kpHz3dAA87H99xzj6VplLUKNFeB/nYPwZ6Og0pEt04K9zkN FDsVykHgkh2EAuY9fuZ7lKr2b9Ue9un+kAL8hrqcFh5AFy1alKkq/eNM758zFOx5 uvVQNa7TQJaDcoOD2Yk2UiNabhQIAaDZd9xxx6/XxPijjBy3apCgqr1ft3c1t90B PCqv4KCGWgNAcxXob9fE+CMNUjAFXEH9M1XVu0K3rcr4M1XxTp3632oEfzkjI+PP Pb1/6VDAZyng8kBWm6gR+vPTZfwfbRF2DKQgMl8AAAAASUVORK5CYII="
         height="80"
         preserveAspectRatio="none"
         clip-path="url(#clipPath9)"
         id="image102" />
      <text
         x="22"
         y="97"
         style="stroke:#e7e7e7;text-rendering:geometricPrecision"
         xml:space="preserve"
         clip-path="url(#clipPath9)"
         id="text104">Client</text>
    </g>
    <g
       style="font-weight:bold;font-family:sans-serif;fill:#333333;stroke:#333333"
       transform="translate(132,152)"
       id="g112">
      <image
         x="0"
         y="1"
         width="84"
         xlink:href="data:image/png;base64,iVBORw0KGgoAAAANSUhEUgAAAFQAAABQCAYAAACH+lLXAAAgYElEQVR4Xu2cB3hV VdaGRxBIAglJCEFHR9GRsYwIKoIIShfpvQok1BCKBAhdSOihSCihjgoWwAIiRRQL USyoCNjFRhRFRNRQpAji+te79t3hcn8crAOW/TznOdybk3Pvec+3v1X2CX/722k8 Jk+evHn69OmJoe//NX7GGDduXBUFKtOmTZNZs2blzJs3LzH0mL/GTxgZGRl9goCK ApUFCxbkLFy4MH3ZsmXRocf/NU4yVKHLJk2aJKUqtZSazTpL5rTpMn/+fLn33nvl /vvvz126dOlfYH/KUKC5AA2/uIYUuPBaKVCyvFRo2FUmTc0CqDz00EOycuXK3Mce e2xqdnZ2ydDf/2sEjfT09JIKVFKGZkqh0vWk4OW1peBlNaXQJdWl4L9ukLL1usi4 zJkAFQUqTz31lKxbt27B+vXrS4ae66+hY+TIkQkArd0xQ8Iq3Cxh17SWsKtbSNhV TaVQmYYO8r9rS6lanSV98iwPVF544QV5+eWXFzz77LNVQ8/5px6q0PkALdVkjERU 7SHhVZIk/PquElapo4RVTJCwa4HcSgE3l0JlG8vZNyRKv7EzPVB5/vnnZe3atdmq 4Kqh5/5TDlXo5rFjx0p0gzFSuN5QibhpkETcmCrhtfpKRI3eElHNQ+4sYdclqorb mYpjKyVIl1tnyNqnnwGorF69Gq/NXrRoUePQz/jTDFVntAKVtJHjJbLlZIlsMVGK NBsvRVStRRqNlML1hyvkIRJRZ6BC7i/hNfso4J4KuLuEV+5sCg6/tp006TNB7r5v iQUvBUqGkDN79uzE0M/7w48hQ4ZUUajSpHeWRCXeLlHt50pUu1kS1XaGRLaZKpGt bpMizSco4HFSuNEoKdxghKm4sAHuJ+E1bpFwFHxDNwXcUa7rkC4TZsyzlGvOnDky derUnPHjxydy40I/+w85hg4dmgbQK7reK0W7PyhFu90nRbsulKKd75GoTgsc5A5A nqmApyngKQpYVdx0rBRpDGBVcN3BahOpEmHq7aVwk+SSZsOkb/okgMqECRNEZ0Gu flZ6SkrKHxvssGHDsgF6Tq9HJab/kxKT8phE3/KIRPdaIUV7LpPoZIWcBOR7A4Dv NMCRHjA2YQpW/22YFvDgAarevhJevbec12CQtE9Jk1GjRokClX79+uX26tUrPTEx 8Y8JlosEaOzwjRJ76waJHfaixAx5XmIGrZOY1GyJ6feERKesVsgrpWivhxXwEok2 wKpiACf8R21itkS2ne7Uiweregs3SpcIg6vWUCtFitcZIDd1Giz9+/cXBSpJSUnS rVu3Bd27dy8Z+p1+t2PAgAFlAdq2/yyJy/hQio19T4qNfkeKjXpTiqW/JrFpmw1y zND1CvhZiRmggPs/oSp+1ABH91omRZMfUJtYpBZxl6r3DoU7R6JuzpLI1gFrQLkN VLl1NbDVHiBRtVOlQutUSezaHaB++2OAVaB9AFq+32opPu1LiZ/yhRS/7TMpPulT iZvwkRQb/4FBjgXyyDckdsQmB3jIC3kKju77uET3wSJQLx6scDsFw50RgJuhnjva PDcCz9WAdnmzAdK64zGwXbt2zVawVUO/5+9mKND5AL0w/R2Jn31QSsw9rPsDEj9z n8RP32OQi0/ZKcUnfyZxEz82FceNQ8VvSWz6q2oTr5hFxA5+zqm33+POHno/rMpV uF093Nstc3CeO0ktgYwhPeC3qXJRk0HSJCH59w9W/SwHoMUn75T4rL0SP2uflJh9 KABWAc/7zl4b4BkKeOpXquKdAQXnKNz31R7eVvW+7tSL/wbgRvdbo7awSgPbQxrU 7peiXTSodZzvAhqqtWwhQwqTKdS/1bz2H42GSt32PYKtYLPCTQz93qfl0PSlZGqq elnvMQ7OxG0Kdrsq8nMFt0sV+rVBjJ+1X0rMcYDj5yjsOQHA03P1OCxiu7MH4Ko1 xKa/bsp1vrtOolOfVNWq5/ZerqpdoqpdLFHmt/8JZApTLZAVbhKwgzqDpET9oVKt bZ9gsDmnPdhbbrmlEUBv6DbPAhAeWWy0qm3MuwYnLiNHlbjNeWqmggMwKp55QJV7 xKl4Fvbwjf5stztGbwi/Z75LYLOg9rLE4rkDnnaWkKfa+ySqy93mtZFkCWoHDizp 1wgFO1hi6g2W61r3kc5dj4HV7fRMufr06ZMJ0AsTF5uSYkmVVFUGQBVmMAzyOwbI Af5EAe+QeBRs6j3gFItNsM9S5U772nw3To+NG6+Zw5gtzhJIyzj/wHWW7xLIyHOL dr9fwWoR0ZEgRvoF2EkOrGYHBLAimhlc1byftOtkqRZb7mkHVhW6mZwwttP9Oh1X uEitUzNGo3ZM6lMSM/AZ80MLOgb4VZdOjX3XQBXHIhRu8alfBvzXwXW+q/aQhefu kriAauP094qNfNN57dCXJJY0DLAEMdKvpABYyw6OKdalXSh2kOWzlzYZeJxiQ6/r lA0FKr1vSdUofLcGjHtcRE5a7PLKnksDkFcr4DXHAOvUNQWnb3Zwxzi4qBHvNd9V CzCw//k+T7UEM7MO9do4ct1Rb0mxQBCLJf0KVixFg1kBmQFgp2olNtGlXBq8iqgV BHnrstDrOiUjOTm5CkCrtx5uTZCom2e6tIa8MUEvpOOddlHklNHdFXCPAGBVE5WT +aHB1crKlPuWglLfnfCxpVjxXrUG9qjzWwVtdqCq5jgrIlSxBnboiy6AUZUZWPXY botdscD3IXi1ylSwGXKWwg0CmhZ6badkaI6XBtALbxquacto1+hoPt66Slabt850 oFUhVlp2mu9UrOqJNrjLrVqK6f+UVVCmNAVjgQ1LwG8nf+q8FrA+BTOw+OxXLrcl u8AKRlE0bHSZgc6EaAteK+2zinajxHXpFkXCpe2m5gHVyF8l9NpOyVCFLuvdu7dE V0vVcjDVNTPU/K0tp6lLEU26rR/aLCMAeKqpJKrDPLs4csropAf0gpdJjCqK6B0z 8GlV2gvObzUIEYziMrZqINNULJMg5sFqhjDnWxfAVMkuM9hqx+elXATIAWtdutVr uc6S+637VVT9tUrHcXlAQ6/rlA0FmgtQ62FWYUuS8KrdXWeeDv2NfQ0y9bcBbjzS qpvIFpNVudM0aMySojoVi3YO2AINk94rnd9qUk+a9P/AkuOaFezLq8qsaMja7bIC DXLFxn5g9hE7YrOzATICbEBTregezgZade3vgW4Ova5TMnSalNUpL7Ub95Swcq3c WlH51hJWoa1bO6IDX6mThF/fzQBH1LxFVdzfep4GVxNwvIxKh8Q8KmGetfWiAdsj CKwpdr2lS0xpswINSlY4ELxma8EwV5WKWsllsQH8NeMjl2oF1GrpXKqqte9jEtvz 4WD/zAy9tlMy9IskALRU+QQpdHkdKagbe1Y2C11RXwqVbSRhVzdzoFkBvS5RldxF FZws4TVTrGNUuN4wWx5hqYTGR+TNWarYeRZEolVFqAlVmRWQ4976kgteWji4rOBT q7JIrZj+2AC5rJW3FAjksOO8Wjflees5vVYFA00IvbZTMpKSkuYDNObihlKwVCUp eFFl2xewvW7/qiqFLq2pkG9ygK9sokpuaeo15ao1hJtqU0PAZlqmgM9ZhqDZgXWg +j5qfogvmuI0cJE6mVopEjTyWw7rg5YVB7uct47HW9+xm0G6dlnPJXlAO3fufH7o tZ2SgfcAtMD5FXW7SgqcW0bOPOcKOfPc0lLgH7o/70opULKcFLiwosK9XgpeWsMp uExDt1YP2MqAVcXW6GOLd94KirScqB473SIyzWdr5ZEV4IGkW6h12EuuSMjz1s+c txL9yVvpG8zcb7aQZwFkAmoBVXvM9EBPj4SeUo0v1KhpV4OY/+xL5Mz4UpI/7gLd zpd8xUpKvrgLJX+JUnLm3y9TwGWlwAXlnXIvre5UiyVgB9d2sLX7iOq9rLdpGYJm B5FkBuqvBC6Xz95rTZHoW1a4Ksx7q5a2wRbgUyxnAd+5PsG0XIX6uakZVbfpnpfU nx4JvU73Rnyh0uVbKrB/S/74iyRf7HmSL+osyVckTs4oHKP7Yvq6hOSLOVfyF79Q zjz7UgVbRhVbwR7LKXhZLbWCBlIIn63gbSDZykLKQ+rvIs3G2WppJAVDItnAPZr6 POiKAw0uVhiQYqVp7jr6TYX6gesTWI+AgsD5qpWwdLU0Cygx7sO86a6BtU/otZ2S oV8mjS8Ud1Fdm+L5S/zLAY2MlzPCo+WMguFyRoFw2+eLiHFgi52vx12sx19hD5AV LHW9FOK5Jw1iYVcCtW3AAtRbgVp3kC3WRWqxENnyNleFaXFghUF3+gZaFPQLygIo CChFx7/voFrO6oPVd67hPX23nJ/2RjDQ0yOhpxPOFwq7oIb6Zzmd9gqVKR/7DwcP qIUKuy0sSvIVjpN80ec4SzjrUjkTpV6AUq8PUmpze9CBhx4szeJpE623gRocrGh6 WEGQ7JVKBvCMKvXFwPR/K6BUpn/AU8lVTan75fKB2XlAQ6/rlIy33nqriCbzu/hC 4ee2cNNXp3GBf1xp0zp/8X86sNFnK9x4B7io/jvmPJv6BtRUeo1mBJWcp5auq1lA Y/dw2XUJViREVO+dlwFQ1ka2mGCdI3uAgiqLUjKZQPWIW7a2jhYNl9csovtAFc8a lwYnF/2PSPWU+V6d2aHX9j8fW7duvfHDDz/c9f7773+9ZMmSHT16pOwtVzFZws5p alPYwJ53lSr2cgV3iVOt+qvt1Rbyn32Z5Fc1c4x5qQWpQPQv29ilVRXbm0rDq/Z0 Kg1MfauwWjH1s6zRYdUVU19TKusH5FVWGwO9gPekOE0Wulczcm3Ko9K2PYZ6hZ66 hF4hltbtAd12fPDBB6JA5d1335X33nvvwNKlSz/r12/w3gqVe0nYuc2k4MVVLCd1 D9uqHZx3tQK80qVWag8FLrhGwVd0MC+pJgX/faMrBq5q6qJ+RY36lSkAmPYEqIHW eacnQD8gNJ2KNpWucsvSgXSKhT8f+Y81V/bJ2dP35E13Amvodf7mQ6HFqSpH5eTk vKnbft1EX4uCNagKVLZs2WJgV61atXvYsJH7KlVLkbDzmkshBcV0LnhJVQcZa2B/ sb7mAdxLax2X9Be6uqWrqCpRUfk0qm+gVPVAJ1kn3paVSaW6LgzU/6RS1P8aoIYQ oDa6pROWYCaqSjOdSs9PfzcPqG5FQ6/3Nx0KranCe/Gjjz7a88knn8iTTz4pXbp0 kREjRsiGDRsMbLBaAct+zZo1B8aMmXjwhloDJOzCNuaN9rAt4NjKsOnrMo1MlQSj sGvaaD6qAalSR8tJTZ0830TtX1/z0obpbsoDtM1056MGlNzUByca2NmBSmqDVlI0 VKj7c1xTWmv8K1If9zD/dwm9ArxAlbhUt6+3b99u4GbMmCFNmjSR66+/XmrWrCm1 a9cW1pEeffRRUytgUStA33nnHds/8cQTubfdNuNg9bpDJeLijqa+QjROymt6pJvl ngrRglAeSE2Zqqt3Wq3fX/1ziE13VjKtx9oq06VPHWikzHerA3kKJS9da00QGtah HSqmfbVe8/x0nx963b/6UKUVV3j9FegWBXngiy++kBdffFH69OkjN998s7Rq1Urq 1Kkj1157rVxzzTVStWpVuemmm6Rnz54GNlStHuzatWu/yMqad+BGeqOlk12Lz7bu ElE1yR5hZHrzOKMFIUCy7kPFxENjjcfYursFJPyT6U7qRF8zSYNSTxooK11OalOe FYBXrMQ8BtT5aIcermX3myb02dnZZ6rKaijIZxXknq+++ko+++wzycrKEmr1Ro0a SZs2baRDhw62r1evnlx33XVSsWJFA1ulShWpUaOGHauR/zi1erBs69at+/LOO+89 WKeF5pTl+jlwNKXrDHDPiAYa0xENbrXSk7WfSPLPFpOOdf7bz5aiVEyd7jJ1RndH ncvdoiCp08B1x5J8P+UDQM/K+CQ4IJUJ5fCrjG3btv1dp/bqjz/++Gsdsm/fPnn2 2Wdl+PDhPC5o6gQkSmSqs9WqVUuaN28urVu3lgYNGhjcq666ypTLz3j/7rvvPi5o AfTtt9+2/QsvvPDNosVLv61/syquEjnmKLd8QmefJRSDONFFdBbW8pZQAr5JugTM 5AdUnQ+rOgPrUwMD/sniHwk+VdO4D9z61G07pOSQjb9dQq9BJlxV2VdBbtu1a9dB HfL555/b08JpaWnSsWNHYa1o4MCB0rdvX2nbtq3BYsqzb9q0qbRo0cIAV6tWTerW rWv7ChUqSKVKlUyxHmyoWgHL9vLLL++9d+HyI1WaTJEiVcZKVOtpLnE3gFkOIus/ iVpudpwfALnQrWbSgGZJg9VUeqUEo8HPu5RJ63p7DoDm8vitbiU1c6dckeJ6oL9q Qs/01il5k4J8Rj1yz6FDh+Tw4cPy3HPP2RTnCWH+igN1AqRZs2YWjNq1a2dqTUlJ oX9oYJnq7PFXgGMFBC22cuXKmSXgs6h4ypQp8uqrrx4HVSsu22/cuHHPkqVrvq3e epZE1p7qHsQ1gHcdW5Zm5ZK+KH5pIFe55kgq0/wZiTWYPFix2SX1VEqUn6RM9kDF l1K9xyyv0F9nhVOndrSCnK/q/HL//v3CIPDge/xNJg8r8HQwf6fJXu+keSbAmOK8 5gsBmAAFWN6/8cYbpXr16qZWbwXcCIBfeeWVBheweHFGRoa89NJLx4F94403bHvt tddyV6x6+tsa7W+XqIbz3PNLBnCZg0jgseXnY+v7PK3HmpGlSSNeDcDcYl16VyWx FE2TZLck9OjrFfrLGyKqyiTSGw04B44cOSIHDhywvwniuXVSIoDy5zAElsTERAM5 ePBgmThxor1PitSyZUuDgqdiA2zAJoVq2LChAWXqAxxbADLv47/47NVXX21eix2M GTPGPj9YrR6sbgcfXr72SNV2GslbLXZTmoDDY448JEE1NBSvfMk9lkOT2T9PRQOZ ae6fRsnUOl6ro7Mmff7rJPSqyiq6bdKovZeAwxTH0/hLYUCR8uCZTMnRo0fbB/KY NbBI4ocMGWL/BiYKHjZsmB2Df/rojw2wcS4A3nDDDXlqxSrwWxTqMwM2/o3ncr5g sEFQsYKD9yxccbRSuzslJmGl80ceiKAKUjWyVGyBh+nNE3sZDiSP7FAZFWdJJPDc VMkRb3mYP2+FUyPsuQpysUbx7aRBwGS/cOFCUx4XQsXjAw5TuFOnTvaMPLDxU/5N cEKxBCemq4eOSpnyTG1Uyu+iTKY7Km/fvr3Ur1/fVIqnAhr4QEah2AAbAYxjBg0a RCFwIrXK+vXrD8yeu+hIhfYLJLZ7duChM/dkn6mRNSV7+Iyn+3ZaReRABh7lmXtY ygQqpJ+V0BO9FeZ2VeUBUqHdu3fbn/4xbQksXFiPHj3sInjgHwiAAxCKArI9r9S7 twUo1MtNABq/i1IJXuPHj7f0ihtC4EHFycnJ9jn4Le+hYsASvAhaKBeAvA9klFqm TBmDi2K5GfzF8ubNm/PAvv7667Y988wz+yfdNu9wufb3SFzfDQ7glJ0Sz+qmQcx1 vU+WlX2n3h6X/FZq9JzjFfrjVzjVJ6trpbNJE/TdpEBffvmlqfKOO+4wYExhrx68 Du9r3LixTVcUCxwAAwZIgAWcD1C85jjAAhvoKNsHM692YKFWPov3sBCmPcBQJ4C9 UglcvMYSKBLwWQIZN2758uXHqdWDVSUfHjl66pGyHRZK/JAtwoO89sAD6/KAvP17 iZ/LUyWH3M+y9krH5BSv0JMn9Dq9/6kgs1SVH9DE2LFjh+zcudMiuOaYBpbSEHUC kwtGLUxXLhQl8T6vuRCmN97JF0C9/IzXWMHMmTNNmUDlfZTOjeDv4zk/5+P3EhIS DC6btwI8lhuDWitXrmxq5Yb4Y7AG8li28uXL2zG8f+eddx6nVs0GbFu9evXhlNTx 35dqs0RKjNruVAlU/2y/RnZ89KwxOV6duaHsjhvklAqyi25bVJUH1C8FoDQ0gIpK g8GiVv67CqAxtVEs0xyVEolRCiBQlYeJYgHB7wCDKY3iCGjAZc97+CjnwyLwWvwZ n+UmoUbOyzn5LGYA6uVnZAMoF5jcWAD7IEZGgGL5GeeYPXu2vPLKK8eBxRqWLVt2 OLFr2tGL2i6V+OEfumUPvHTKDnseqmTqc/bZJ03oWYpQv3yfbpACFc0xJRgq9Xgw WK9WwHrFogAuErA+yGAFXByg+EOEW2+91SByscAAHKokpWK6YxkAZO//EIvj8FKA o3iyAmYF58AuKBxQOe+xoVryWXwVj/UFAdaEz2IDeC3HETD5U3DyWfYUDGwPPvjg t+07DfvuojYPSPHBmgHw1PPY9+SK5Pu8Qk+e0CvQ2bodBSrNX8B6qMFgT6RWAhb/ qwIgUCwXw8WhTN8E8ZUSrwcMGGDggMjxwAE6YLlI1ImKAQ5Un6sCk733YtSG7XAj USo3lj2fj6cClJ/xmXw27wGVrXTp0mYJvMfnLF26NE+tQEWxDzzwgHToMvzoRW3u k7h+L0mNLpO9Qk+e0GtOuZA6WQPS9yTuHmqwWtlC1QpYr9bc3NzjrACloh4uHIVg B/wbeIDxvuqtwVsHfooiKRJIr5jmnBPV8poAhzqBRJD0NwVrALC/Qfwe9gM00iqU ymf670PwKlu2rO35bhQJa9asMbAe6qZNmwJgRxztkuT+ICyU3QmHwnwUXyFZp20G 1GC1AvZkagUsagUsivVWwEUClosEoJ+aBBHUihV4fwUKkACG4skA8FL+LJuUC+D8 HvAJaqgZO8F7USOw+BmfzbEA9akVUAGHFaFSvgPv4714LFaAakkDNa7kqRWobKri 7/S77FOvPfl/ZqAQ7+OO0AhGqbTMQsGGqvVEQStYreStHixq4QLxRC6aJJ8pTODg olAVXkm1BVxecxxqBRp9AeCjZi4Y0ExvbhLnwUuxAs4BXEByXm8FqBsl+xTLzxZv BWQCgCW48R6B0gct9iq0T7RYWKYK3qZA/3tQYiiwkgpwhzdpmg5A9WB/iVpDwaJW NnyVC0dZ3l+BAxCgMb2B69MmINIzwApQJzcINQONdAzwHMNNAjSfgQp9ZeWDJtOW zwEgquUYrID3mPYIy7cGFeTXev0blMkrrIU98sgjZAMnB8rQX7xaT/A2UKmIAquQ P2gDP6RW6mmmSHDQAuqePXvMo7hoLg4FAYQAA1xfJAAAJRK0AIkNYAEEKIAAEMUB FSvAUwHI76F8bwXcEI7lpnHDuFEoHkvATwHv81duIMB8z1WFdFCvd49CfQQeNMsD QDc/9NBDJw9KfuiJquoJt+KnNBuQu++Y/xi1LliwwFTIBTBF+SKhag0Gy7FcGMcD 1qdVwAUEMH2/gJ9x8fgwx/I+MPmc4CmPraBCpjjH8f+X4NP8m5vIebmReDTH03bk evyytl7jdt0/osLYjYcGgOYq0B9fbgYPPeFFuuVu3LjRgLD3vurBhqqV/zOJKc3U 8VUTPoUnoSrSklC17t27Nw8s4JiiXDRAmX4A8T7rLQElAY4Axc3gWODRJ8D3qMIA zHk4HzcBX/bVF6/5PF7PnTvXpjUzjWvQ68nV/QYVyRauj5kWAJqpZerPb9Ux8FQF t0wVunf9+vV0arynHBe0gIrv8OWZUr4dhy/5AEAbjgQbddGlQs3Bag0F622AqYn3 +eYI52ba+8YMQAGLz3Kc/x2iPvns9OnTj7MNVIodAB1LwvuZVQrxkF7HLrWrbGIA 3y8ANFuPO3nN/mOHQovSE6epl36CBQSr1XsrYMk98S6+OF4IAKoV37skFSGKkmj7 IHHXXXfZDQmGSmswGCyqZAMS0ADNuX0QIRBhBagWG0DRfg2Lac50xovxU15TOPA/ kAGNAAo4BblfwW44dOhQLt8jADRXv9vPm94/ZijUcvoB21StewhWbORowZkAjQcf uT1Q1EkTmAaF71cCA7XhcwBgMS9UrYB9/PHHj1MsUH3JihK5eXyGDywAp+/Kxs8B zvchMGEFq1atMjViOUDTaZ2r2yb9rE+///57a5jz+RpI0/R6f9n0/jGDel+hTiRg MV0IWOSsgRzNoPJYDUm4X67wTWHUCVy6QiT1RHgUzX9biUqCgxYXxQbUYLAo0IP1 jRYsxquYm+MjPVZAwEK5dK/4ftwobppCPaRT/ENV5Rucn4XFANBs/fzzQ6/7Nx8K 7jLdFirgzwGIDaBYwDKFPVgUSzACIl7KHnWiXqYewey/FQTBamUhMBgsN8ODJQ1i D1QyA2YIHkvThenNsjbrXpxbp/dhgg5K9asPCjRHRP73T8+FDoVXXeFtUuPe4/M0 bwXeBgCM9y5evNiS8czMTPt5cEFwop5raIrl1fpDYLEBAhYK5SaSSnEe1Mfv6eft oTWps2sPN5LPVaC5+rM0hfnbT++fMtRv6im4T1Wx+z1Y7IDg5T02NMX6oYLgRF2s E6kVxbFuRLLvwQKS6E6awwCmnueQ+uT7Wj5uZQYRTANAl52S6f1jh37JMIXWVr/w elXsFx4sG//2FxNcFIQWBMFqDe65hqr1h8A++OCD9v7Ro0ftOIKOzobNpHu+mazf QT8658dXOad6KJQIhdZYVfmUgt2FSrEBbwe89rkscE8E9qeolQ2o+CRRmvf1PHv1 87drVbOHjhGfq0BzFejJm8Kn81DFVtYLu1un/TZVykGU4lXLRZIpABc7YMMKQtV6 ohWCE6mVvR5Lcv6Rgty5YsUKa8YAVO1nvgI9vXzyl4xAGTtR4X6lcL/x5Wzw5qck yvV+6332v6mVjZ+pyj/V83xEI5ipzyqnAt28du3a38/0/jlDp3htBbtSoX2jAA8F e22weoF+AsDfAxj1+kpHz3dAA87H99xzj6VplLUKNFeB/nYPwZ6Og0pEt04K9zkN FDsVykHgkh2EAuY9fuZ7lKr2b9Ue9un+kAL8hrqcFh5AFy1alKkq/eNM758zFOx5 uvVQNa7TQJaDcoOD2Yk2UiNabhQIAaDZd9xxx6/XxPijjBy3apCgqr1ft3c1t90B PCqv4KCGWgNAcxXob9fE+CMNUjAFXEH9M1XVu0K3rcr4M1XxTp3632oEfzkjI+PP Pb1/6VDAZyng8kBWm6gR+vPTZfwfbRF2DKQgMl8AAAAASUVORK5CYII="
         height="80"
         preserveAspectRatio="none"
         clip-path="url(#clipPath9)"
         id="image108" />
      <text
         x="22"
         y="97"
         style="stroke:#e7e7e7;text-rendering:geometricPrecision"
         xml:space="preserve"
         clip-path="url(#clipPath9)"
         id="text110">Client</text>
    </g>
    <g
       transform="translate(123,440)"
       style="font-weight:bold;font-family:sans-serif;fill:#c0c0c0;stroke:#c0c0c0;text-rendering:geometricPrecision"
       id="g116">
      <text
         x="0"
         xml:space="preserve"
         y="12"
         style="stroke:none"
         clip-path="url(#clipPath11)"
         id="text114">eSkool</text>
    </g>
  </g>
</svg>
