  0 KSP Residual norm 1256.28
  1 KSP Residual norm 187.086
  2 KSP Residual norm 148.893
  3 KSP Residual norm 53.8971
  4 KSP Residual norm 43.2629
  5 KSP Residual norm 9.9666
  6 KSP Residual norm 5.19949
  7 KSP Residual norm 1.98703
  8 KSP Residual norm 1.44082
  9 KSP Residual norm 0.620827
 10 KSP Residual norm 0.293975
 11 KSP Residual norm 0.0750849
 12 KSP Residual norm 0.0298144
 13 KSP Residual norm 0.00985124
Linear solve converged due to CONVERGED_RTOL iterations 13
KSP Object: 8 MPI processes
  type: cg
  maximum iterations=10000, initial guess is zero
  tolerances:  relative=1e-05, absolute=1e-50, divergence=10000.
  left preconditioning
  using PRECONDITIONED norm type for convergence test
PC Object: 8 MPI processes
  type: gamg
    type is MULTIPLICATIVE, levels=3 cycles=v
      Cycles per PCApply=1
      Using externally compute Galerkin coarse grid matrices
      GAMG specific options
        Threshold for dropping small values in graph on each level =   -0.01
        Threshold scaling factor for each level not specified = 1.
        Using aggregates from coarsening process to define subdomains for PCASM
        Using parallel coarse grid solver (all coarse grid equations not put on one process)
        AGG specific options
          Symmetric graph false
          Number of levels to square graph 1
          Number smoothing steps 1
        Complexity:    grid = 1.11594
  Coarse grid solver -- level -------------------------------
    KSP Object: (mg_coarse_) 8 MPI processes
      type: cg
      maximum iterations=10000, initial guess is zero
      tolerances:  relative=1e-05, absolute=1e-50, divergence=10000.
      left preconditioning
      using PRECONDITIONED norm type for convergence test
    PC Object: (mg_coarse_) 8 MPI processes
      type: jacobi
        type DIAGONAL
      linear system matrix = precond matrix:
      Mat Object: 8 MPI processes
        type: mpiaij
        rows=48, cols=48, bs=6
        total: nonzeros=2304, allocated nonzeros=2304
        total number of mallocs used during MatSetValues calls=0
          using I-node (on process 0) routines: found 5 nodes, limit used is 5
  Down solver (pre-smoother) on level 1 -------------------------------
    KSP Object: (mg_levels_1_) 8 MPI processes
      type: chebyshev
        eigenvalue estimates used:  min = 0.361588, max = 1.89833
        eigenvalues estimate via gmres min 0.061898, max 1.80794
        eigenvalues estimated using gmres with translations  [0. 0.2; 0. 1.05]
        KSP Object: (mg_levels_1_esteig_) 8 MPI processes
          type: gmres
            restart=30, using Classical (unmodified) Gram-Schmidt Orthogonalization with no iterative refinement
            happy breakdown tolerance 1e-30
          maximum iterations=10, initial guess is zero
          tolerances:  relative=1e-12, absolute=1e-50, divergence=10000.
          left preconditioning
          using PRECONDITIONED norm type for convergence test
        estimating eigenvalues using noisy right hand side
      maximum iterations=1, nonzero initial guess
      tolerances:  relative=1e-05, absolute=1e-50, divergence=10000.
      left preconditioning
      using NONE norm type for convergence test
    PC Object: (mg_levels_1_) 8 MPI processes
      type: asm
        total subdomain blocks = 12, amount of overlap = 0
        restriction/interpolation type - BASIC
        Local solver is the same for all blocks, as in the following KSP and PC objects on rank 0:
      KSP Object: (mg_levels_1_sub_) 1 MPI processes
        type: preonly
        maximum iterations=10000, initial guess is zero
        tolerances:  relative=1e-05, absolute=1e-50, divergence=10000.
        left preconditioning
        using NONE norm type for convergence test
      PC Object: (mg_levels_1_sub_) 1 MPI processes
        type: lu
          out-of-place factorization
          tolerance for zero pivot 2.22045e-14
          matrix ordering: nd
          factor fill ratio given 5., needed 1.03896
            Factored matrix follows:
              Mat Object: 1 MPI processes
                type: seqaij
                rows=84, cols=84
                package used to perform factorization: petsc
                total: nonzeros=5760, allocated nonzeros=5760
                  using I-node routines: found 19 nodes, limit used is 5
        linear system matrix = precond matrix:
        Mat Object: 1 MPI processes
          type: seqaij
          rows=84, cols=84
          total: nonzeros=5544, allocated nonzeros=5544
          total number of mallocs used during MatSetValues calls=0
            using I-node routines: found 25 nodes, limit used is 5
      linear system matrix = precond matrix:
      Mat Object: 8 MPI processes
        type: mpiaij
        rows=474, cols=474, bs=6
        total: nonzeros=64476, allocated nonzeros=64476
        total number of mallocs used during MatSetValues calls=0
          using I-node (on process 0) routines: found 33 nodes, limit used is 5
  Up solver (post-smoother) same as down solver (pre-smoother)
  Down solver (pre-smoother) on level 2 -------------------------------
    KSP Object: (mg_levels_2_) 8 MPI processes
      type: chebyshev
        eigenvalue estimates used:  min = 0.386231, max = 2.02771
        eigenvalues estimate via cg min 0.0227137, max 1.93116
        eigenvalues estimated using cg with translations  [0. 0.2; 0. 1.05]
        KSP Object: (mg_levels_2_esteig_) 8 MPI processes
          type: cg
          maximum iterations=10, initial guess is zero
          tolerances:  relative=1e-12, absolute=1e-50, divergence=10000.
          left preconditioning
          using PRECONDITIONED norm type for convergence test
        estimating eigenvalues using noisy right hand side
      maximum iterations=1, nonzero initial guess
      tolerances:  relative=1e-05, absolute=1e-50, divergence=10000.
      left preconditioning
      using NONE norm type for convergence test
    PC Object: (mg_levels_2_) 8 MPI processes
      type: asm
        total subdomain blocks = 79, amount of overlap = 0
        restriction/interpolation type - BASIC
        Local solver is the same for all blocks, as in the following KSP and PC objects on rank 0:
      KSP Object: (mg_levels_2_sub_) 1 MPI processes
        type: preonly
        maximum iterations=10000, initial guess is zero
        tolerances:  relative=1e-05, absolute=1e-50, divergence=10000.
        left preconditioning
        using NONE norm type for convergence test
      PC Object: (mg_levels_2_sub_) 1 MPI processes
        type: lu
          out-of-place factorization
          tolerance for zero pivot 2.22045e-14
          matrix ordering: nd
          factor fill ratio given 5., needed 1.05263
            Factored matrix follows:
              Mat Object: 1 MPI processes
                type: seqaij
                rows=48, cols=48
                package used to perform factorization: petsc
                total: nonzeros=1440, allocated nonzeros=1440
                  using I-node routines: found 14 nodes, limit used is 5
        linear system matrix = precond matrix:
        Mat Object: 1 MPI processes
          type: seqaij
          rows=48, cols=48
          total: nonzeros=1368, allocated nonzeros=1368
          total number of mallocs used during MatSetValues calls=0
            using I-node routines: found 16 nodes, limit used is 5
      linear system matrix = precond matrix:
      Mat Object: 8 MPI processes
        type: mpiaij
        rows=8232, cols=8232, bs=3
        total: nonzeros=576000, allocated nonzeros=666792
        total number of mallocs used during MatSetValues calls=0
          has attached near null space
          using I-node (on process 0) routines: found 343 nodes, limit used is 5
  Up solver (post-smoother) same as down solver (pre-smoother)
  linear system matrix = precond matrix:
  Mat Object: 8 MPI processes
    type: mpiaij
    rows=8232, cols=8232, bs=3
    total: nonzeros=576000, allocated nonzeros=666792
    total number of mallocs used during MatSetValues calls=0
      has attached near null space
      using I-node (on process 0) routines: found 343 nodes, limit used is 5
  0 KSP Residual norm 0.0125628
  1 KSP Residual norm 0.00187086
  2 KSP Residual norm 0.00148893
  3 KSP Residual norm 0.000538971
  4 KSP Residual norm 0.000432629
  5 KSP Residual norm 9.9666e-05
  6 KSP Residual norm 5.19949e-05
  7 KSP Residual norm 1.98703e-05
  8 KSP Residual norm 1.44082e-05
  9 KSP Residual norm 6.20827e-06
 10 KSP Residual norm 2.93975e-06
 11 KSP Residual norm 7.50849e-07
 12 KSP Residual norm 2.98144e-07
 13 KSP Residual norm 9.85124e-08
Linear solve converged due to CONVERGED_RTOL iterations 13
KSP Object: 8 MPI processes
  type: cg
  maximum iterations=10000, initial guess is zero
  tolerances:  relative=1e-05, absolute=1e-50, divergence=10000.
  left preconditioning
  using PRECONDITIONED norm type for convergence test
PC Object: 8 MPI processes
  type: gamg
    type is MULTIPLICATIVE, levels=3 cycles=v
      Cycles per PCApply=1
      Using externally compute Galerkin coarse grid matrices
      GAMG specific options
        Threshold for dropping small values in graph on each level =   -0.01
        Threshold scaling factor for each level not specified = 1.
        Using aggregates from coarsening process to define subdomains for PCASM
        Using parallel coarse grid solver (all coarse grid equations not put on one process)
        AGG specific options
          Symmetric graph false
          Number of levels to square graph 1
          Number smoothing steps 1
        Complexity:    grid = 1.11594
  Coarse grid solver -- level -------------------------------
    KSP Object: (mg_coarse_) 8 MPI processes
      type: cg
      maximum iterations=10000, initial guess is zero
      tolerances:  relative=1e-05, absolute=1e-50, divergence=10000.
      left preconditioning
      using PRECONDITIONED norm type for convergence test
    PC Object: (mg_coarse_) 8 MPI processes
      type: jacobi
        type DIAGONAL
      linear system matrix = precond matrix:
      Mat Object: 8 MPI processes
        type: mpiaij
        rows=48, cols=48, bs=6
        total: nonzeros=2304, allocated nonzeros=2304
        total number of mallocs used during MatSetValues calls=0
          using nonscalable MatPtAP() implementation
          using I-node (on process 0) routines: found 5 nodes, limit used is 5
  Down solver (pre-smoother) on level 1 -------------------------------
    KSP Object: (mg_levels_1_) 8 MPI processes
      type: chebyshev
        eigenvalue estimates used:  min = 0.361588, max = 1.89833
        eigenvalues estimate via gmres min 0.061898, max 1.80794
        eigenvalues estimated using gmres with translations  [0. 0.2; 0. 1.05]
        KSP Object: (mg_levels_1_esteig_) 8 MPI processes
          type: gmres
            restart=30, using Classical (unmodified) Gram-Schmidt Orthogonalization with no iterative refinement
            happy breakdown tolerance 1e-30
          maximum iterations=10, initial guess is zero
          tolerances:  relative=1e-12, absolute=1e-50, divergence=10000.
          left preconditioning
          using PRECONDITIONED norm type for convergence test
        estimating eigenvalues using noisy right hand side
      maximum iterations=1, nonzero initial guess
      tolerances:  relative=1e-05, absolute=1e-50, divergence=10000.
      left preconditioning
      using NONE norm type for convergence test
    PC Object: (mg_levels_1_) 8 MPI processes
      type: asm
        total subdomain blocks = 12, amount of overlap = 0
        restriction/interpolation type - BASIC
        Local solver is the same for all blocks, as in the following KSP and PC objects on rank 0:
      KSP Object: (mg_levels_1_sub_) 1 MPI processes
        type: preonly
        maximum iterations=10000, initial guess is zero
        tolerances:  relative=1e-05, absolute=1e-50, divergence=10000.
        left preconditioning
        using NONE norm type for convergence test
      PC Object: (mg_levels_1_sub_) 1 MPI processes
        type: lu
          out-of-place factorization
          tolerance for zero pivot 2.22045e-14
          matrix ordering: nd
          factor fill ratio given 5., needed 1.03896
            Factored matrix follows:
              Mat Object: 1 MPI processes
                type: seqaij
                rows=84, cols=84
                package used to perform factorization: petsc
                total: nonzeros=5760, allocated nonzeros=5760
                  using I-node routines: found 19 nodes, limit used is 5
        linear system matrix = precond matrix:
        Mat Object: 1 MPI processes
          type: seqaij
          rows=84, cols=84
          total: nonzeros=5544, allocated nonzeros=5544
          total number of mallocs used during MatSetValues calls=0
            using I-node routines: found 25 nodes, limit used is 5
      linear system matrix = precond matrix:
      Mat Object: 8 MPI processes
        type: mpiaij
        rows=474, cols=474, bs=6
        total: nonzeros=64476, allocated nonzeros=64476
        total number of mallocs used during MatSetValues calls=0
          using nonscalable MatPtAP() implementation
          using I-node (on process 0) routines: found 33 nodes, limit used is 5
  Up solver (post-smoother) same as down solver (pre-smoother)
  Down solver (pre-smoother) on level 2 -------------------------------
    KSP Object: (mg_levels_2_) 8 MPI processes
      type: chebyshev
        eigenvalue estimates used:  min = 0.386231, max = 2.02771
        eigenvalues estimate via cg min 0.0227137, max 1.93116
        eigenvalues estimated using cg with translations  [0. 0.2; 0. 1.05]
        KSP Object: (mg_levels_2_esteig_) 8 MPI processes
          type: cg
          maximum iterations=10, initial guess is zero
          tolerances:  relative=1e-12, absolute=1e-50, divergence=10000.
          left preconditioning
          using PRECONDITIONED norm type for convergence test
        estimating eigenvalues using noisy right hand side
      maximum iterations=1, nonzero initial guess
      tolerances:  relative=1e-05, absolute=1e-50, divergence=10000.
      left preconditioning
      using NONE norm type for convergence test
    PC Object: (mg_levels_2_) 8 MPI processes
      type: asm
        total subdomain blocks = 79, amount of overlap = 0
        restriction/interpolation type - BASIC
        Local solver is the same for all blocks, as in the following KSP and PC objects on rank 0:
      KSP Object: (mg_levels_2_sub_) 1 MPI processes
        type: preonly
        maximum iterations=10000, initial guess is zero
        tolerances:  relative=1e-05, absolute=1e-50, divergence=10000.
        left preconditioning
        using NONE norm type for convergence test
      PC Object: (mg_levels_2_sub_) 1 MPI processes
        type: lu
          out-of-place factorization
          tolerance for zero pivot 2.22045e-14
          matrix ordering: nd
          factor fill ratio given 5., needed 1.05263
            Factored matrix follows:
              Mat Object: 1 MPI processes
                type: seqaij
                rows=48, cols=48
                package used to perform factorization: petsc
                total: nonzeros=1440, allocated nonzeros=1440
                  using I-node routines: found 14 nodes, limit used is 5
        linear system matrix = precond matrix:
        Mat Object: 1 MPI processes
          type: seqaij
          rows=48, cols=48
          total: nonzeros=1368, allocated nonzeros=1368
          total number of mallocs used during MatSetValues calls=0
            using I-node routines: found 16 nodes, limit used is 5
      linear system matrix = precond matrix:
      Mat Object: 8 MPI processes
        type: mpiaij
        rows=8232, cols=8232, bs=3
        total: nonzeros=576000, allocated nonzeros=666792
        total number of mallocs used during MatSetValues calls=0
          has attached near null space
          using I-node (on process 0) routines: found 343 nodes, limit used is 5
  Up solver (post-smoother) same as down solver (pre-smoother)
  linear system matrix = precond matrix:
  Mat Object: 8 MPI processes
    type: mpiaij
    rows=8232, cols=8232, bs=3
    total: nonzeros=576000, allocated nonzeros=666792
    total number of mallocs used during MatSetValues calls=0
      has attached near null space
      using I-node (on process 0) routines: found 343 nodes, limit used is 5
  0 KSP Residual norm 0.0125628
  1 KSP Residual norm 0.00187086
  2 KSP Residual norm 0.00148893
  3 KSP Residual norm 0.000538971
  4 KSP Residual norm 0.000432629
  5 KSP Residual norm 9.9666e-05
  6 KSP Residual norm 5.19949e-05
  7 KSP Residual norm 1.98703e-05
  8 KSP Residual norm 1.44082e-05
  9 KSP Residual norm 6.20827e-06
 10 KSP Residual norm 2.93975e-06
 11 KSP Residual norm 7.50849e-07
 12 KSP Residual norm 2.98144e-07
 13 KSP Residual norm 9.85124e-08
Linear solve converged due to CONVERGED_RTOL iterations 13
KSP Object: 8 MPI processes
  type: cg
  maximum iterations=10000, initial guess is zero
  tolerances:  relative=1e-05, absolute=1e-50, divergence=10000.
  left preconditioning
  using PRECONDITIONED norm type for convergence test
PC Object: 8 MPI processes
  type: gamg
    type is MULTIPLICATIVE, levels=3 cycles=v
      Cycles per PCApply=1
      Using externally compute Galerkin coarse grid matrices
      GAMG specific options
        Threshold for dropping small values in graph on each level =   -0.01
        Threshold scaling factor for each level not specified = 1.
        Using aggregates from coarsening process to define subdomains for PCASM
        Using parallel coarse grid solver (all coarse grid equations not put on one process)
        AGG specific options
          Symmetric graph false
          Number of levels to square graph 1
          Number smoothing steps 1
        Complexity:    grid = 1.11594
  Coarse grid solver -- level -------------------------------
    KSP Object: (mg_coarse_) 8 MPI processes
      type: cg
      maximum iterations=10000, initial guess is zero
      tolerances:  relative=1e-05, absolute=1e-50, divergence=10000.
      left preconditioning
      using PRECONDITIONED norm type for convergence test
    PC Object: (mg_coarse_) 8 MPI processes
      type: jacobi
        type DIAGONAL
      linear system matrix = precond matrix:
      Mat Object: 8 MPI processes
        type: mpiaij
        rows=48, cols=48, bs=6
        total: nonzeros=2304, allocated nonzeros=2304
        total number of mallocs used during MatSetValues calls=0
          using nonscalable MatPtAP() implementation
          using I-node (on process 0) routines: found 5 nodes, limit used is 5
  Down solver (pre-smoother) on level 1 -------------------------------
    KSP Object: (mg_levels_1_) 8 MPI processes
      type: chebyshev
        eigenvalue estimates used:  min = 0.361588, max = 1.89833
        eigenvalues estimate via gmres min 0.061898, max 1.80794
        eigenvalues estimated using gmres with translations  [0. 0.2; 0. 1.05]
        KSP Object: (mg_levels_1_esteig_) 8 MPI processes
          type: gmres
            restart=30, using Classical (unmodified) Gram-Schmidt Orthogonalization with no iterative refinement
            happy breakdown tolerance 1e-30
          maximum iterations=10, initial guess is zero
          tolerances:  relative=1e-12, absolute=1e-50, divergence=10000.
          left preconditioning
          using PRECONDITIONED norm type for convergence test
        estimating eigenvalues using noisy right hand side
      maximum iterations=1, nonzero initial guess
      tolerances:  relative=1e-05, absolute=1e-50, divergence=10000.
      left preconditioning
      using NONE norm type for convergence test
    PC Object: (mg_levels_1_) 8 MPI processes
      type: asm
        total subdomain blocks = 12, amount of overlap = 0
        restriction/interpolation type - BASIC
        Local solver is the same for all blocks, as in the following KSP and PC objects on rank 0:
      KSP Object: (mg_levels_1_sub_) 1 MPI processes
        type: preonly
        maximum iterations=10000, initial guess is zero
        tolerances:  relative=1e-05, absolute=1e-50, divergence=10000.
        left preconditioning
        using NONE norm type for convergence test
      PC Object: (mg_levels_1_sub_) 1 MPI processes
        type: lu
          out-of-place factorization
          tolerance for zero pivot 2.22045e-14
          matrix ordering: nd
          factor fill ratio given 5., needed 1.03896
            Factored matrix follows:
              Mat Object: 1 MPI processes
                type: seqaij
                rows=84, cols=84
                package used to perform factorization: petsc
                total: nonzeros=5760, allocated nonzeros=5760
                  using I-node routines: found 19 nodes, limit used is 5
        linear system matrix = precond matrix:
        Mat Object: 1 MPI processes
          type: seqaij
          rows=84, cols=84
          total: nonzeros=5544, allocated nonzeros=5544
          total number of mallocs used during MatSetValues calls=0
            using I-node routines: found 25 nodes, limit used is 5
      linear system matrix = precond matrix:
      Mat Object: 8 MPI processes
        type: mpiaij
        rows=474, cols=474, bs=6
        total: nonzeros=64476, allocated nonzeros=64476
        total number of mallocs used during MatSetValues calls=0
          using nonscalable MatPtAP() implementation
          using I-node (on process 0) routines: found 33 nodes, limit used is 5
  Up solver (post-smoother) same as down solver (pre-smoother)
  Down solver (pre-smoother) on level 2 -------------------------------
    KSP Object: (mg_levels_2_) 8 MPI processes
      type: chebyshev
        eigenvalue estimates used:  min = 0.386231, max = 2.02771
        eigenvalues estimate via cg min 0.0227137, max 1.93116
        eigenvalues estimated using cg with translations  [0. 0.2; 0. 1.05]
        KSP Object: (mg_levels_2_esteig_) 8 MPI processes
          type: cg
          maximum iterations=10, initial guess is zero
          tolerances:  relative=1e-12, absolute=1e-50, divergence=10000.
          left preconditioning
          using PRECONDITIONED norm type for convergence test
        estimating eigenvalues using noisy right hand side
      maximum iterations=1, nonzero initial guess
      tolerances:  relative=1e-05, absolute=1e-50, divergence=10000.
      left preconditioning
      using NONE norm type for convergence test
    PC Object: (mg_levels_2_) 8 MPI processes
      type: asm
        total subdomain blocks = 79, amount of overlap = 0
        restriction/interpolation type - BASIC
        Local solver is the same for all blocks, as in the following KSP and PC objects on rank 0:
      KSP Object: (mg_levels_2_sub_) 1 MPI processes
        type: preonly
        maximum iterations=10000, initial guess is zero
        tolerances:  relative=1e-05, absolute=1e-50, divergence=10000.
        left preconditioning
        using NONE norm type for convergence test
      PC Object: (mg_levels_2_sub_) 1 MPI processes
        type: lu
          out-of-place factorization
          tolerance for zero pivot 2.22045e-14
          matrix ordering: nd
          factor fill ratio given 5., needed 1.05263
            Factored matrix follows:
              Mat Object: 1 MPI processes
                type: seqaij
                rows=48, cols=48
                package used to perform factorization: petsc
                total: nonzeros=1440, allocated nonzeros=1440
                  using I-node routines: found 14 nodes, limit used is 5
        linear system matrix = precond matrix:
        Mat Object: 1 MPI processes
          type: seqaij
          rows=48, cols=48
          total: nonzeros=1368, allocated nonzeros=1368
          total number of mallocs used during MatSetValues calls=0
            using I-node routines: found 16 nodes, limit used is 5
      linear system matrix = precond matrix:
      Mat Object: 8 MPI processes
        type: mpiaij
        rows=8232, cols=8232, bs=3
        total: nonzeros=576000, allocated nonzeros=666792
        total number of mallocs used during MatSetValues calls=0
          has attached near null space
          using I-node (on process 0) routines: found 343 nodes, limit used is 5
  Up solver (post-smoother) same as down solver (pre-smoother)
  linear system matrix = precond matrix:
  Mat Object: 8 MPI processes
    type: mpiaij
    rows=8232, cols=8232, bs=3
    total: nonzeros=576000, allocated nonzeros=666792
    total number of mallocs used during MatSetValues calls=0
      has attached near null space
      using I-node (on process 0) routines: found 343 nodes, limit used is 5
[0]main |b-Ax|/|b|=2.647174e-04, |b|=4.630910e+00, emax=9.962576e-01
