{
    "$schema": "http:\/\/json-schema.org\/draft-04\/schema#",
    "type": "object",
    "title": "ZoneCommunes2019",
    "description": "<strong>Zone des communes 2019 (octobre 2019)<\/strong><br>Base de données commune à 4 simulateurs :<br>- Connaître la zone de sa commune : A, A bis, B1, B2 ou C<br>- Connaître la zone de sa commune : 1, 1 bis, 2 ou 3<br>- Savoir si un logement est situé en zone tendue<br>- Simulateur des frais de mise en location imputables au locataire<br>Fichier établi par fusion de 3 fichiers du ministère de la Cohésion des territoiresdisponibles sur leur site (« Zonage_abc_communes_2019 » mis à jour en2019, &nbsp;« DGALN_zonage_i-ii-iii »,« La listes des communes (taxe sur les logements vacants) »)<br>Code commune = Code Insee<br>Nom commune<br>zonage_abc<br>zonage123<br>zone-tendue = communes où est inscrit « périmètre de la TLV » dans la colonne 3du fichier «La listes des communes (taxe sur les logements vacants) »<br>frais_locataire &nbsp; 2 (très tendue) =communes A bis ; 1 (tendue) = communes où zone_tendue est = à 1 et où zonage_abcn’est pas = à A bis ; 0 (non tendue) = le reste\n<br>\nBase de données commune à 4 simulateurs :\n<br>\n- Connaître la zone de sa commune : A, A bis, B1, B2 ou C\n<br>\n- Connaître la zone de sa commune : 1, 1 bis, 2 ou 3\n<br>\n- Savoir si un logement est situé en zone tendue\n<br>\n- Simulateur des frais de mise en location imputables au locataire\n<br>\nFichier établi par fusion de 3 fichiers du ministère de la Cohésion des territoiresdisponibles sur leur site (« Zonage_abc_communes_2019 » mis à jour en2019, &nbsp;« DGALN_zonage_i-ii-iii »,« La listes des communes (taxe sur les logements vacants) »)\n<br>\nCode commune = Code Insee\n<br>\nNom commune\n<br>\nzonage_abc\n<br>\nzonage123\n<br>\nzone-tendue = communes où est inscrit « périmètre de la TLV » dans la colonne 3du fichier «La listes des communes (taxe sur les logements vacants) »\n<br>\nfrais_locataire &nbsp; 2 (très tendue) =communes A bis ; 1 (tendue) = communes où zone_tendue est = à 1 et où zonage_abcn’est pas = à A bis ; 0 (non tendue) = le reste",
    "databaseName": "ZoneCommunes2019.db",
    "databaseLabel": "Zone des communes 2019 (octobre 2019) ",
    "databaseDatasimulator": "",
    "databaseDatanextchange": "",
    "databaseDatauserchange": "",
    "properties": {
        "zonetable": {
            "type": "array",
            "title": "zonetable",
            "description": "",
            "items": {
                "type": "object",
                "properties": {
                    "id": {
                        "type": "integer",
                        "title": "id [type:integer]",
                        "description": "Identifiant interne"
                    },
                    "codecommune": {
                        "type": "string",
                        "title": "codecommune [type:text]",
                        "description": "",
                        "maxLength": 5
                    },
                    "nomcommune": {
                        "type": "string",
                        "title": "nomcommune [type:text]",
                        "description": "",
                        "maxLength": 45
                    },
                    "zonage_abc": {
                        "type": "string",
                        "title": "zonage_abc [type:text]",
                        "description": "",
                        "maxLength": 5
                    },
                    "zonage123": {
                        "type": "string",
                        "title": "zonage123 [type:text]",
                        "description": "",
                        "maxLength": 6
                    },
                    "zone_tendue": {
                        "type": "integer",
                        "title": "zone_tendue [type:integer]",
                        "description": ""
                    },
                    "frais_locataire": {
                        "type": "integer",
                        "title": "frais_locataire [type:integer]",
                        "description": ""
                    }
                },
                "required": []
            }
        }
    },
    "required": [
        "zonetable"
    ]
}