{
    "categorie": [
        {
            "id": 1,
            "Categorie_infraction": "Conduite sous l'emprise d'alcool ou de drogue"
        },
        {
            "id": 2,
            "Categorie_infraction": "Excès de vitesse"
        },
        {
            "id": 3,
            "Categorie_infraction": "Autre"
        }
    ],
    "detail_infraction": [
        {
            "id": 1,
            "nom_infraction": "Apprenti - Conduire avec une alcoolémie de 0,2 g et plus\/l de sang (0,1 mg\/l d'air expiré et plus)",
            "cat_infraction": "1",
            "points": "6 points",
            "Contravention": "4e classe, soit une amende forfaitaire de 135 €",
            "Suspension": "3 ans maximum",
            "Interdiction": "3 ans maximum, sauf si le véhicule est équipé d’un système anti-démarrage par éthylotest électronique",
            "Vehicule": "Immobilisation du véhicule",
            "Source": "Article R234-1 du code de la route",
            "Code_legi": "Route R",
            "Code_Url": "https:\/\/www.legifrance.gouv.fr\/affichCodeArticle.do?idArticle=LEGIARTI000030800862&cidTexte=LEGITEXT000006074229",
            "Probatoire": "P"
        },
        {
            "id": 2,
            "nom_infraction": "Conduire un transport en commun avec une alcoolémie de 0,2 g et plus\/l de sang (0,1 mg\/l d'air expiré et plus)",
            "cat_infraction": "1",
            "points": "6 points",
            "Contravention": "4e classe, soit une amende forfaitaire de 135 €",
            "Suspension": "3 ans maximum",
            "Interdiction": "3 ans maximum, sauf si le véhicule est équipé d’un système anti-démarrage par éthylotest électronique",
            "Vehicule": "Immobilisation du véhicule",
            "Source": "Article R234-1 du code de la route",
            "Code_legi": "Route R",
            "Code_Url": "https:\/\/www.legifrance.gouv.fr\/affichCodeArticle.do?idArticle=LEGIARTI000030800862&cidTexte=LEGITEXT000006074230",
            "Probatoire": "P"
        },
        {
            "id": 3,
            "nom_infraction": "Conduire avec une alcoolémie entre 0,5 et 0,8 g\/l de sang (0,25 et 0,4 mg\/l d'air expiré)",
            "cat_infraction": "1",
            "points": "6 points",
            "Contravention": "4e classe, soit une amende forfaitaire de 135 €",
            "Suspension": "3 ans maximum",
            "Interdiction": "3 ans maximum, sauf si le véhicule est équipé d’un système anti-démarrage par éthylotest électronique",
            "Vehicule": "Immobilisation du véhicule",
            "Source": "Article R234-1 du code de la route",
            "Code_legi": "Route R",
            "Code_Url": "https:\/\/www.legifrance.gouv.fr\/affichCodeArticle.do?idArticle=LEGIARTI000030800862&cidTexte=LEGITEXT000006074228",
            "Probatoire": "P"
        },
        {
            "id": 4,
            "nom_infraction": "Conduire avec une alcoolémie de 0,8 g\/l de sang et plus (0,4 mg\/l d'air expiré et plus)",
            "cat_infraction": "1",
            "points": "6 points",
            "Delit": "4 500 €",
            "TIG": "oui",
            "Suspension": "3 ans maximum",
            "Interdiction": "5 ans maximum, y compris pour les véhicules à moteur ne nécessitant pas de permis",
            "Annulation": "Avec interdiction d’en repasser un nouveau pour 3 ans maximum",
            "Prison": "2 ans maximum",
            "Vehicule": "Immobilisation du véhicule, obligation d’installer un éthylotest antidémarrage",
            "Stage": "Suivre un stage de sensibilisation à la sécurité routière (à vos frais)",
            "Source": "Article L234-1 et 2 du code de la route",
            "Code_legi": "Route L",
            "Code_Url": "https:\/\/www.legifrance.gouv.fr\/affichCode.do;?idSectionTA=LEGISCTA000006159521&cidTexte=LEGITEXT000006074228",
            "Probatoire": "P",
            "JoursAmendes": "Oui"
        },
        {
            "id": 5,
            "nom_infraction": "Récidive de conduite avec une alcoolémie de 0,8 g\/l de sang et plus (0,4 mg\/l d'air expiré et plus)",
            "cat_infraction": "1",
            "points": "6 points",
            "Delit": "9 000 €",
            "TIG": "oui",
            "Interdiction": "5 ans maximum, y compris pour les véhicules à moteur ne nécessitant pas de permis",
            "Annulation": "Avec interdiction d’en repasser un nouveau pour 3 ans maximum",
            "Prison": "4 ans maximum",
            "Vehicule": "Confiscation du véhicule, son immobilisation pendant 1 an maximum, obligation d’installer un éthylotest antidémarrage",
            "Source": "Article L234-12 du code de la route",
            "Code_legi": "Route L",
            "Code_Url": "https:\/\/www.legifrance.gouv.fr\/affichCode.do?idSectionTA=LEGISCTA000006159521&cidTexte=LEGITEXT000006074228",
            "Probatoire": "P",
            "JoursAmendes": "Oui"
        },
        {
            "id": 6,
            "nom_infraction": "Refuser de se soumettre à une vérification de présence d'alcool dans le sang",
            "cat_infraction": "1",
            "points": "6 points",
            "Delit": "4 500 €",
            "TIG": "oui",
            "Suspension": "3 ans maximum",
            "Interdiction": "5 ans maximum, y compris pour les véhicules à moteur ne nécessitant pas de permis",
            "Annulation": "Avec interdiction d’en repasser un nouveau pour 3 ans maximum",
            "Prison": "2 ans",
            "Vehicule": "Immobilisation du véhicule",
            "Stage": "Suivre un stage de sensibilisation à la sécurité routière (à vos frais)",
            "Source": "Article L234-8 du code de la route",
            "Code_legi": "Route L",
            "Code_Url": "https:\/\/www.legifrance.gouv.fr\/affichCode.do?idSectionTA=LEGISCTA000006159521&cidTexte=LEGITEXT000006074228",
            "Probatoire": "P",
            "JoursAmendes": "Oui"
        },
        {
            "id": 7,
            "nom_infraction": "Conduire sous l’emprise de stupéfiants (drogue)",
            "cat_infraction": "1",
            "points": "6 points",
            "Delit": "4 500 €",
            "TIG": "oui",
            "Suspension": "3 ans maximum",
            "Interdiction": "5 ans maximum, y compris pour les véhicules à moteur ne nécessitant pas de permis",
            "Annulation": "Avec interdiction d’en repasser un nouveau pour 3 ans maximum",
            "Prison": "2 ans maximum ",
            "Vehicule": "Immobilisation du véhicule, mise en fourrière",
            "Stage": "Suivre un stage de sensibilisation à la sécurité routière (à vos frais), et un stage de sensibilisation aux dangers de l’usage des produits stupéfiants",
            "Source": "Article L235-1 du code de la route",
            "Code_legi": "Route L",
            "Code_Url": "https:\/\/www.legifrance.gouv.fr\/affichCode.do?idSectionTA=LEGISCTA000024041725&cidTexte=LEGITEXT000006074228",
            "Probatoire": "P",
            "JoursAmendes": "Oui"
        },
        {
            "id": 8,
            "nom_infraction": "Refuser le dépistage de stupéfiants (drogue)",
            "cat_infraction": "1",
            "points": "6 points",
            "Delit": "4 500 €",
            "TIG": "oui",
            "Suspension": "3 ans maximum",
            "Interdiction": "5 ans maximum, y compris pour les véhicules à moteur ne nécessitant pas de permis",
            "Annulation": "Avec interdiction d’en repasser un nouveau pour 3 ans maximum",
            "Prison": "2 ans maximum",
            "Vehicule": "Immobilisation du véhicule, mise en fourrière",
            "Stage": "Suivre à vos frais un stage de sensibilisation à la sécurité routière + stage de sensibilisation aux dangers de l’usage des produits stupéfiants",
            "Source": "Article L235-3 du code de la route",
            "Code_legi": "Route L",
            "Code_Url": "https:\/\/www.legifrance.gouv.fr\/affichCode.do?idSectionTA=LEGISCTA000024041725&cidTexte=LEGITEXT000006074228",
            "Probatoire": "P",
            "JoursAmendes": "Oui"
        },
        {
            "id": 9,
            "nom_infraction": "Excès de vitesse de moins de 20 km\/h, en ville",
            "cat_infraction": "2",
            "points": "1 point",
            "Contravention": "4e classe, soit une amende forfaitaire de 135 €",
            "Source": "Article R413-14 du code de la route",
            "Code_legi": "Route R",
            "Code_Url": "https:\/\/www.legifrance.gouv.fr\/affichCode.do?idSectionTA=LEGISCTA000006177128&cidTexte=LEGITEXT000006074228"
        },
        {
            "id": 10,
            "nom_infraction": "Excès de vitesse de moins de 20 km\/h, hors agglomération",
            "cat_infraction": "2",
            "points": "1 point",
            "Contravention": "3e classe, soit une amende forfaitaire de 68 €",
            "Source": "Article R413-14 du code de la route",
            "Code_legi": "Route R",
            "Code_Url": "https:\/\/www.legifrance.gouv.fr\/affichCode.do?idSectionTA=LEGISCTA000006177128&cidTexte=LEGITEXT000006074228"
        },
        {
            "id": 11,
            "nom_infraction": "Excès de vitesse de 20 à 29 km\/h",
            "cat_infraction": "2",
            "points": "2 points",
            "Contravention": "4e classe, soit une amende forfaitaire de 135 €",
            "Source": "Article R413-14 du code de la route",
            "Code_legi": "Route R",
            "Code_Url": "https:\/\/www.legifrance.gouv.fr\/affichCode.do?idSectionTA=LEGISCTA000006177128&cidTexte=LEGITEXT000006074228"
        },
        {
            "id": 12,
            "nom_infraction": "Excès de vitesse de 30 à 39 km\/h",
            "cat_infraction": "2",
            "points": "3 points",
            "Contravention": "4e classe, soit une amende forfaitaire de 135 €",
            "Suspension": "3 ans maximum",
            "Interdiction": "3 ans maximum, y compris pour les véhicules à moteur ne nécessitant pas de permis",
            "Stage": "Suivre un stage de sensibilisation à la sécurité routière (à vos frais)",
            "Source": "Article R413-14 du code de la route",
            "Code_legi": "Route R",
            "Code_Url": "https:\/\/www.legifrance.gouv.fr\/affichCode.do?idSectionTA=LEGISCTA000006177128&cidTexte=LEGITEXT000006074228"
        },
        {
            "id": 13,
            "nom_infraction": "Excès de vitesse de 40 à 49 km\/h",
            "cat_infraction": "2",
            "points": "4 points",
            "Contravention": "4e classe, soit une amende forfaitaire de 135 €",
            "Suspension": "3 ans maximum",
            "Interdiction": "3 ans maximum, y compris pour les véhicules à moteur ne nécessitant pas de permis",
            "Stage": "Suivre un stage de sensibilisation à la sécurité routière (à vos frais)",
            "Source": "Article R413-14 du code de la route",
            "Code_legi": "Route R",
            "Code_Url": "https:\/\/www.legifrance.gouv.fr\/affichCode.do?idSectionTA=LEGISCTA000006177128&cidTexte=LEGITEXT000006074228"
        },
        {
            "id": 14,
            "nom_infraction": "Excès de vitesse de 50 km\/h ou plus",
            "cat_infraction": "2",
            "points": "6 points",
            "Contravention": "5e classe, soit une amende de 1 500 €",
            "Suspension": "3 ans maximum",
            "Interdiction": "3 ans maximum, y compris pour les véhicules à moteur ne nécessitant pas de permis",
            "Vehicule": "Confiscation du véhicule",
            "Stage": "Suivre un stage de sensibilisation à la sécurité routière (à vos frais)",
            "Source": "Article R413-14-1 du code de la route",
            "Code_legi": "Route R",
            "Code_Url": "https:\/\/www.legifrance.gouv.fr\/affichCode.do?idSectionTA=LEGISCTA000006177128&cidTexte=LEGITEXT000006074228",
            "Probatoire": "P"
        },
        {
            "id": 15,
            "nom_infraction": "Récidive d’excès de vitesse de 50 km\/h ou plus",
            "cat_infraction": "2",
            "points": "6 points",
            "Delit": "3 750 €",
            "Suspension": "3 ans maximum",
            "Interdiction": "5 ans maximum, y compris pour les véhicules à moteur ne nécessitant pas de permis",
            "Prison": "3 mois maximum",
            "Vehicule": "Confiscation du véhicule",
            "Stage": "Suivre un stage de sensibilisation à la sécurité routière (à vos frais)",
            "Source": "Article L413-1 du code de la route",
            "Code_legi": "Route L",
            "Code_Url": "https:\/\/www.legifrance.gouv.fr\/affichCode.do?idSectionTA=LEGISCTA000006159544&cidTexte=LEGITEXT000006074228",
            "Probatoire": "P"
        },
        {
            "id": 16,
            "nom_infraction": "Utiliser ou détenir un détecteur ou avertisseur de radars",
            "cat_infraction": "2",
            "points": "6 points",
            "Contravention": "5e classe, soit une amende de 1 500 €",
            "Suspension": "3 ans maximum",
            "Vehicule": "Saisie de l’appareil ou du véhicule dans lequel il est installé",
            "Source": "Article R413-15 du code de la route",
            "Code_legi": "Route R",
            "Code_Url": "https:\/\/www.legifrance.gouv.fr\/affichCode.do?idSectionTA=LEGISCTA000006177128&cidTexte=LEGITEXT000006074235",
            "Probatoire": "P"
        },
        {
            "id": 17,
            "nom_infraction": "Conduire a une vitesse anormalement réduite",
            "cat_infraction": "2",
            "Contravention": "2e classe, soit une amende forfaitaire de 35 €",
            "Source": "Article R413-19 du code de la route",
            "Code_legi": "RouteR",
            "Code_Url": "https:\/\/www.legifrance.gouv.fr\/affichCode.do?idSectionTA=LEGISCTA000006177129&cidTexte=LEGITEXT000006074228"
        },
        {
            "id": 18,
            "nom_infraction": "Excès de vitesse d’un véhicule non motorisé (vélo…)",
            "cat_infraction": "2",
            "Contravention": "2e classe, soit une amende forfaitaire de 35 €",
            "Source": "Article R413-16 du code de la route",
            "Code_legi": "Route R",
            "Code_Url": "https:\/\/www.legifrance.gouv.fr\/affichCode.do?idSectionTA=LEGISCTA000006177128&cidTexte=LEGITEXT000006074236"
        },
        {
            "id": 19,
            "nom_infraction": "Conduire un engin (trottinette, vélo...) sur un trottoir à plus de 6 km\/h",
            "cat_infraction": "2",
            "Contravention": "4e classe, soit une amende forfaitaire de 135 €",
            "Source": "Article R413-18 du code de la route",
            "Code_legi": "Route R",
            "Code_Url": "https:\/\/www.legifrance.gouv.fr\/affichCode.do?idSectionTA=LEGISCTA000006177129&cidTexte=LEGITEXT000006074228"
        },
        {
            "id": 20,
            "nom_infraction": "Tenir un téléphone à la main en conduisant",
            "cat_infraction": "3",
            "points": "3 points (si le véhicule nécessite un permis de conduire)",
            "Contravention": "4e classe, soit une amende forfaitaire de 135 €",
            "Source": "Article R412-6-1 du code de la route",
            "Code_legi": "Route R",
            "Code_Url": "https:\/\/www.legifrance.gouv.fr\/affichCodeArticle.do?cidTexte=LEGITEXT000006074228&idArticle=LEGIARTI000006842118",
            "Probatoire": "S"
        },
        {
            "id": 21,
            "nom_infraction": "Stationnement dangereux",
            "cat_infraction": "3",
            "points": "3 points",
            "Contravention": "4e classe, soit une amende forfaitaire de 135 €",
            "Suspension": "3 ans maximum",
            "Vehicule": "Mise en fourrière",
            "Source": "Article R417-9 du code de la route",
            "Code_legi": "Route R",
            "Code_Url": "https:\/\/www.legifrance.gouv.fr\/affichCode.do?idSectionTA=LEGISCTA000006177136&cidTexte=LEGITEXT000006074228",
            "Probatoire": "S"
        },
        {
            "id": 22,
            "nom_infraction": "Stationnement abusif (plus de 7 jours)",
            "cat_infraction": "3",
            "Contravention": "2e classe, soit une amende forfaitaire de 35 €",
            "Vehicule": "Mise en fourrière",
            "Source": "Article R417-12 du code de la route",
            "Code_legi": "Route L",
            "Code_Url": "https:\/\/www.legifrance.gouv.fr\/affichCode.do?idSectionTA=LEGISCTA000006177136&cidTexte=LEGITEXT000006074228"
        },
        {
            "id": 23,
            "nom_infraction": "Stationnement gênant",
            "cat_infraction": "3",
            "Contravention": "2e classe, soit une amende forfaitaire de 35 €",
            "Vehicule": "Mise en fourrière",
            "Source": "Article R417-10 du code de la route",
            "Code_legi": "Route R",
            "Code_Url": "https:\/\/www.legifrance.gouv.fr\/affichCode.do?idSectionTA=LEGISCTA000006177136&cidTexte=LEGITEXT000006074228"
        },
        {
            "id": 24,
            "nom_infraction": "Stationnement sur une place handicapée (très gênant)",
            "cat_infraction": "3",
            "Contravention": "4e classe, soit une amende forfaitaire de 135 €",
            "Vehicule": "Mise en fourrière",
            "Source": "Article R417-11 du code de la route",
            "Code_legi": "Route R",
            "Code_Url": "https:\/\/www.legifrance.gouv.fr\/affichCode.do?idSectionTA=LEGISCTA000006177136&cidTexte=LEGITEXT000006074228"
        },
        {
            "id": 25,
            "nom_infraction": "Stationnement sur une piste cyclable (très gênant)",
            "cat_infraction": "3",
            "Contravention": "4e classe, soit une amende forfaitaire de 135 €",
            "Vehicule": "Mise en fourrière",
            "Source": "Article R417-11 du code de la route",
            "Code_legi": "Route R",
            "Code_Url": "https:\/\/www.legifrance.gouv.fr\/affichCode.do?idSectionTA=LEGISCTA000006177136&cidTexte=LEGITEXT000006074228"
        },
        {
            "id": 26,
            "nom_infraction": "Stationnement sur un passage piéton (très gênant)",
            "cat_infraction": "3",
            "Contravention": "4e classe, soit une amende forfaitaire de 135 €",
            "Vehicule": "Mise en fourrière",
            "Source": "Article R417-11 du code de la route",
            "Code_legi": "Route R",
            "Code_Url": "https:\/\/www.legifrance.gouv.fr\/affichCode.do?idSectionTA=LEGISCTA000006177136&cidTexte=LEGITEXT000006074228"
        },
        {
            "id": 27,
            "nom_infraction": "Ne pas respecter l'arrêt au feu rouge",
            "cat_infraction": "3",
            "points": "4 points",
            "Contravention": "4e classe, soit une amende forfaitaire de 135 €",
            "Suspension": "3 ans maximum",
            "Source": "Article R412-30 du code de la route",
            "Code_legi": "Route R",
            "Code_Url": "https:\/\/www.legifrance.gouv.fr\/affichCode.do?idSectionTA=LEGISCTA000006177124&cidTexte=LEGITEXT000006074228",
            "Probatoire": "S"
        },
        {
            "id": 28,
            "nom_infraction": "Ne pas respecter l'arrêt au stop",
            "cat_infraction": "3",
            "points": "4 points",
            "Contravention": "4e classe, soit une amende forfaitaire de 135 €",
            "Suspension": "3 ans maximum",
            "Source": "Article R415-6 du code de la route",
            "Code_legi": "Route R",
            "Code_Url": "https:\/\/www.legifrance.gouv.fr\/affichCode.do?idSectionTA=LEGISCTA000006159602&cidTexte=LEGITEXT000006074228",
            "Probatoire": "S"
        },
        {
            "id": 29,
            "nom_infraction": "Ne pas respecter un sas vélo (espace avant un feu réservé aux cyclistes)",
            "cat_infraction": "3",
            "Contravention": "2e classe, soit une amende forfaitaire de 35 €",
            "Source": "Article R415-2 du code de la route",
            "Code_legi": "Route R",
            "Code_Url": "https:\/\/www.legifrance.gouv.fr\/affichCode.do?idSectionTA=LEGISCTA000006159602&cidTexte=LEGITEXT000006074228"
        },
        {
            "id": 30,
            "nom_infraction": "Contrôle routier : ne pas avoir un gilet haute visibilité et un triangle (sauf pour un 2 roues)",
            "cat_infraction": "3",
            "Contravention": "1re classe, soit une amende forfaitaire de 11 €",
            "Source": "Article R233-1 du code de la route",
            "Code_legi": "Route R",
            "Code_Url": "https:\/\/www.legifrance.gouv.fr\/affichCode.do?idSectionTA=LEGISCTA000006159569&cidTexte=LEGITEXT000006074228"
        },
        {
            "id": 31,
            "nom_infraction": "Contrôle routier : ne pas avoir les documents d’assurance",
            "cat_infraction": "3",
            "Contravention": "2e classe, soit une amende forfaitaire de 35 €",
            "Source": "Article R233-3 du code de la route",
            "Code_legi": "Route R",
            "Code_Url": "https:\/\/www.legifrance.gouv.fr\/affichCode.do?idSectionTA=LEGISCTA000006159569&cidTexte=LEGITEXT000006074229"
        },
        {
            "id": 32,
            "nom_infraction": "Contrôle routier : refuser le contrôle par un agent",
            "cat_infraction": "3",
            "points": "6 points",
            "Delit": "3 750 €",
            "Suspension": "3 ans maximum",
            "Annulation": "Avec interdiction d’en repasser un nouveau pour 3 ans maximum",
            "Prison": "3 mois maximum",
            "Source": "Article L233-2 du code de la route",
            "Code_legi": "Route L",
            "Code_Url": "https:\/\/www.legifrance.gouv.fr\/affichCode.do?idSectionTA=LEGISCTA000006159520&cidTexte=LEGITEXT000006074228",
            "Probatoire": "P"
        },
        {
            "id": 33,
            "nom_infraction": "Refuser de s’arrêter en cas de sommation d’un agent",
            "cat_infraction": "3",
            "points": "6 points",
            "Delit": "7 500 €",
            "TIG": "oui",
            "Suspension": "3 ans maximum",
            "Annulation": "Avec interdiction d’en repasser un nouveau pour 3 ans maximum",
            "Prison": "1 an maximum",
            "Vehicule": "Confiscation du véhicule",
            "Stage": "Suivre un stage de sensibilisation à la sécurité routière (à vos frais)",
            "Source": "Article L233-1 du code de la route",
            "Code_legi": "Route L",
            "Code_Url": "https:\/\/www.legifrance.gouv.fr\/affichCode.do?idSectionTA=LEGISCTA000006159520&cidTexte=LEGITEXT000006074228",
            "Probatoire": "P",
            "JoursAmendes": "Oui"
        },
        {
            "id": 34,
            "nom_infraction": "Délit de fuite après un accident",
            "cat_infraction": "3",
            "points": "6 points",
            "Delit": "75 000 €",
            "Interdiction": "5 ans maximum, y compris pour les véhicules à moteur ne nécessitant pas de permis",
            "Annulation": "Avec interdiction d’en repasser un nouveau pour 3 ans maximum",
            "Prison": "3 ans maximum",
            "Vehicule": "Confiscation du véhicule",
            "Stage": "Suivre un stage de sensibilisation à la sécurité routière (à vos frais)",
            "Source": "Article L231-1 du code de la route",
            "Code_legi": "Route R",
            "Code_Url": "https:\/\/www.legifrance.gouv.fr\/affichCode.do?idSectionTA=LEGISCTA000006159518&cidTexte=LEGITEXT000006074228",
            "Probatoire": "P",
            "JoursAmendes": "Oui"
        },
        {
            "id": 35,
            "nom_infraction": "Ne pas assurer son véhicule, conduire sans assurance",
            "cat_infraction": "3",
            "Delit": "3 750 € (ou, sous conditions, une amende forfaitaire de 750€ *)",
            "TIG": "oui",
            "Suspension": "3 ans maximum",
            "Interdiction": "5 ans maximum, y compris pour les véhicules à moteur ne nécessitant pas de permis",
            "Annulation": "Avec interdiction d’en repasser un nouveau pour 3 ans maximum",
            "Vehicule": "Confiscation du véhicule",
            "Stage": "Suivre un stage de sensibilisation à la sécurité routière (à vos frais)",
            "Source": "Article L324-2 du code de la route",
            "Code_legi": "Route L",
            "Code_Url": "https:\/\/www.legifrance.gouv.fr\/affichCode.do?idSectionTA=LEGISCTA000006159534&cidTexte=LEGITEXT000006074228",
            "JoursAmendes": "Oui"
        },
        {
            "id": 36,
            "nom_infraction": "Conduire sans avoir obtenu le permis",
            "cat_infraction": "3",
            "Delit": "15 000 € (ou, sous conditions, une amende forfaitaire de 800€ *)",
            "Interdiction": "5 ans maximum, y compris pour les véhicules à moteur ne nécessitant pas de permis",
            "Prison": "1 an maximum",
            "Vehicule": "Confiscation du véhicule",
            "Stage": "Suivre un stage de sensibilisation à la sécurité routière (à vos frais)",
            "Source": "Article L221-2 du code de la route",
            "Code_legi": "Route L",
            "Code_Url": "https:\/\/www.legifrance.gouv.fr\/affichCode.do?idSectionTA=LEGISCTA000031008682&cidTexte=LEGITEXT000006074228",
            "JoursAmendes": "Oui"
        },
        {
            "id": 37,
            "nom_infraction": "Ne pas respecter un cédez le passage",
            "cat_infraction": "3",
            "points": "4 points",
            "Contravention": "4e classe, soit une amende forfaitaire de 135 €",
            "Suspension": "3 ans maximum",
            "Source": "Article R415-7 du code de la route",
            "Code_legi": "Route R",
            "Code_Url": "https:\/\/www.legifrance.gouv.fr\/affichCode.do?idSectionTA=LEGISCTA000006159602&cidTexte=LEGITEXT000006074228",
            "Probatoire": "S"
        },
        {
            "id": 38,
            "nom_infraction": "Refuser de céder le passage à un piéton traversant une voie",
            "cat_infraction": "3",
            "points": "6 points",
            "Contravention": "4e classe, soit une amende forfaitaire de 135 €",
            "Suspension": "3 ans maximum",
            "Source": "Article R415-11 du code de la route",
            "Code_legi": "Route R",
            "Code_Url": "https:\/\/www.legifrance.gouv.fr\/affichCode.do?idSectionTA=LEGISCTA000006159602&cidTexte=LEGITEXT000006074228",
            "Probatoire": "P"
        },
        {
            "id": 39,
            "nom_infraction": "Refuser la priorité à un autre véhicule",
            "cat_infraction": "3",
            "points": "4 points",
            "Contravention": "4e classe, soit une amende forfaitaire de 135 €",
            "Suspension": "3 ans maximum",
            "Source": "Article R415-5 du code de la route",
            "Code_legi": "Route R",
            "Code_Url": "https:\/\/www.legifrance.gouv.fr\/affichCode.do?idSectionTA=LEGISCTA000006159602&cidTexte=LEGITEXT000006074228",
            "Probatoire": "S"
        },
        {
            "id": 40,
            "nom_infraction": "Refuser de régler le péage autoroutier",
            "cat_infraction": "3",
            "Contravention": "2e classe, soit une amende forfaitaire de 35 €",
            "Source": "Article R421-9 du code de la route",
            "Code_legi": "Route R",
            "Code_Url": "https:\/\/www.legifrance.gouv.fr\/affichCode.do?idSectionTA=LEGISCTA000006159606&cidTexte=LEGITEXT000006074228"
        },
        {
            "id": 41,
            "nom_infraction": "Circuler en sens interdit",
            "cat_infraction": "3",
            "points": "4 points",
            "Contravention": "4e classe, soit une amende forfaitaire de 135 €",
            "Suspension": "3 ans maximum",
            "Source": "Article R412-28 du code de la route",
            "Code_legi": "Route R",
            "Code_Url": "https:\/\/www.legifrance.gouv.fr\/affichCode.do?idSectionTA=LEGISCTA000006177123&cidTexte=LEGITEXT000006074228",
            "Probatoire": "S"
        },
        {
            "id": 42,
            "nom_infraction": "Circuler sur la bande d'arrêt d'urgence",
            "cat_infraction": "3",
            "points": "3 points",
            "Contravention": "4e classe, soit une amende forfaitaire de 135 €",
            "Suspension": "3 ans maximum",
            "Source": "Article R412-8 du code de la route",
            "Code_legi": "Route R",
            "Code_Url": "https:\/\/www.legifrance.gouv.fr\/affichCode.do?idSectionTA=LEGISCTA000006177121&cidTexte=LEGITEXT000006074228",
            "Probatoire": "S"
        },
        {
            "id": 43,
            "nom_infraction": "Circuler sans éclairage la nuit ou par visibilité insuffisante",
            "cat_infraction": "3",
            "points": "4 points",
            "Contravention": "4e classe, soit une amende forfaitaire de 135 €",
            "Suspension": "3 ans maximum",
            "Source": "Article R416-11 du code de la route",
            "Code_legi": "Route R",
            "Code_Url": "https:\/\/www.legifrance.gouv.fr\/affichCode.do?idSectionTA=LEGISCTA000006177133&cidTexte=LEGITEXT000006074228",
            "Probatoire": "S"
        },
        {
            "id": 44,
            "nom_infraction": "Circuler à gauche sur une chaussée à double sens",
            "cat_infraction": "3",
            "points": "3 points",
            "Contravention": "4e classe, soit une amende forfaitaire de 135 €",
            "Suspension": "3 ans maximum",
            "Source": "Article R412-9 du code de la route",
            "Code_legi": "Route R",
            "Code_Url": "https:\/\/www.legifrance.gouv.fr\/affichCode.do?idSectionTA=LEGISCTA000006177121&cidTexte=LEGITEXT000006074228",
            "Probatoire": "S"
        },
        {
            "id": 45,
            "nom_infraction": "Ne pas circuler sur la voie de droite (sauf en cas de dépassement)",
            "cat_infraction": "3",
            "Contravention": "2e classe, soit une amende forfaitaire de 35 €",
            "Source": "Article R412-9 du code de la route",
            "Code_legi": "Route R",
            "Code_Url": "https:\/\/www.legifrance.gouv.fr\/affichCode.do?idSectionTA=LEGISCTA000006177121&cidTexte=LEGITEXT000006074228"
        },
        {
            "id": 46,
            "nom_infraction": "S'engager sur un carrefour alors qu'on risque d'y être immobilisé",
            "cat_infraction": "3",
            "Contravention": "4e classe, soit une amende forfaitaire de 135 €",
            "Source": "Article R415-2 du code de la route",
            "Code_legi": "Route R",
            "Code_Url": "https:\/\/www.legifrance.gouv.fr\/affichCode.do?idSectionTA=LEGISCTA000006159602&cidTexte=LEGITEXT000006074228"
        },
        {
            "id": 47,
            "nom_infraction": "Faire une marche arrière sur autoroute",
            "cat_infraction": "3",
            "points": "4 points",
            "Contravention": "4e classe, soit une amende forfaitaire de 135 €",
            "Suspension": "3 ans maximum",
            "Source": "Article R421-6 du code de la route",
            "Code_legi": "Route R",
            "Code_Url": "https:\/\/www.legifrance.gouv.fr\/affichCode.do?idSectionTA=LEGISCTA000006159606&cidTexte=LEGITEXT000006074228",
            "Probatoire": "S"
        },
        {
            "id": 48,
            "nom_infraction": "Faire demi-tour sur autoroute",
            "cat_infraction": "3",
            "points": "4 points",
            "Contravention": "4e classe, soit une amende forfaitaire de 135 €",
            "Suspension": "3 ans maximum",
            "Source": "Article R421-6 du code de la route",
            "Code_legi": "Route R",
            "Code_Url": "https:\/\/www.legifrance.gouv.fr\/affichCode.do?idSectionTA=LEGISCTA000006159606&cidTexte=LEGITEXT000006074228",
            "Probatoire": "S"
        },
        {
            "id": 49,
            "nom_infraction": "Ne pas respecter les distances de sécurité entre 2 véhicules",
            "cat_infraction": "3",
            "points": "3 points",
            "Contravention": "4e classe, soit une amende forfaitaire de 135 €",
            "Suspension": "3 ans maximum",
            "Source": "Article R412-12 du code de la route",
            "Code_legi": "Route R",
            "Code_Url": "https:\/\/www.legifrance.gouv.fr\/affichCode.do?idSectionTA=LEGISCTA000006177121&cidTexte=LEGITEXT000006074228",
            "Probatoire": "S"
        },
        {
            "id": 50,
            "nom_infraction": "Chevaucher ou franchir la bande d’arrêt d’urgence",
            "cat_infraction": "3",
            "points": "1 point",
            "Contravention": "4e classe, soit une amende forfaitaire de 135 €",
            "Suspension": "3 ans maximum",
            "Source": "Article R412-22 du code de la route",
            "Code_legi": "Route R",
            "Code_Url": "https:\/\/www.legifrance.gouv.fr\/affichCode.do?idSectionTA=LEGISCTA000006177122&cidTexte=LEGITEXT000006074228"
        },
        {
            "id": 51,
            "nom_infraction": "Franchir la ligne continue",
            "cat_infraction": "3",
            "points": "3 points",
            "Contravention": "4e classe, soit une amende forfaitaire de 135 €",
            "Suspension": "3 ans maximum",
            "Source": "Article R412-19 du code de la route",
            "Code_legi": "Route R",
            "Code_Url": "https:\/\/www.legifrance.gouv.fr\/affichCode.do?idSectionTA=LEGISCTA000006177122&cidTexte=LEGITEXT000006074228",
            "Probatoire": "S"
        },
        {
            "id": 52,
            "nom_infraction": "Changer de direction sans utiliser son clignotant au préalable",
            "cat_infraction": "3",
            "points": "3 points",
            "Contravention": "2e classe, soit une amende forfaitaire de 35 €",
            "Suspension": "3 ans maximum",
            "Source": "Article R412-10 du code de la route",
            "Code_legi": "Route R",
            "Code_Url": "https:\/\/www.legifrance.gouv.fr\/affichCode.do?idSectionTA=LEGISCTA000006177121&cidTexte=LEGITEXT000006074228",
            "Probatoire": "S"
        },
        {
            "id": 53,
            "nom_infraction": "Changer de file dans un embouteillage (sauf en cas de changement de direction)",
            "cat_infraction": "3",
            "Contravention": "2e classe, soit une amende forfaitaire de 35 €",
            "Source": "Article R412-24 du code de la route",
            "Code_legi": "Route R",
            "Code_Url": "https:\/\/www.legifrance.gouv.fr\/affichCode.do?idSectionTA=LEGISCTA000006177122&cidTexte=LEGITEXT000006074228"
        },
        {
            "id": 54,
            "nom_infraction": "Effectuer un dépassement dangereux",
            "cat_infraction": "3",
            "points": "3 points",
            "Contravention": "4e classe, soit une amende forfaitaire de 135 €",
            "Suspension": "3 ans maximum",
            "Source": "Article R414-4 du code de la route",
            "Code_legi": "Route R",
            "Code_Url": "https:\/\/www.legifrance.gouv.fr\/affichCode.do?idSectionTA=LEGISCTA000006177131&cidTexte=LEGITEXT000006074228",
            "Probatoire": "S"
        },
        {
            "id": 55,
            "nom_infraction": "Accélérer quand on est sur le point d'être dépassé",
            "cat_infraction": "3",
            "points": "2 points",
            "Contravention": "4e classe, soit une amende forfaitaire de 135 €",
            "Suspension": "3 ans maximum",
            "Source": "Article R414-16 du code de la route",
            "Code_legi": "Route R",
            "Code_Url": "https:\/\/www.legifrance.gouv.fr\/affichCode.do?idSectionTA=LEGISCTA000006177131&cidTexte=LEGITEXT000006074228"
        },
        {
            "id": 56,
            "nom_infraction": "Se rabattre et faire ralentir le véhicule que l’on vient de dépasser («queue de poisson»)",
            "cat_infraction": "3",
            "points": "3 points",
            "Contravention": "4e classe, soit une amende forfaitaire de 135 €",
            "Suspension": "3 ans maximum",
            "Source": "Article R414-10 du code de la route",
            "Code_legi": "Route R",
            "Code_Url": "https:\/\/www.legifrance.gouv.fr\/affichCode.do?idSectionTA=LEGISCTA000006177131&cidTexte=LEGITEXT000006074228",
            "Probatoire": "S"
        },
        {
            "id": 57,
            "nom_infraction": "Regarder un écran vidéo en conduisant (autre qu'un GPS)",
            "cat_infraction": "3",
            "points": "3 points",
            "Contravention": "5e classe, soit une amende de 1 500 €",
            "Vehicule": "Saisie et confiscation de l'appareil",
            "Source": "Article R412-6-2 du code de la route",
            "Code_legi": "Route R",
            "Code_Url": "https:\/\/www.legifrance.gouv.fr\/affichCode.do?idSectionTA=LEGISCTA000006177121&cidTexte=LEGITEXT000006074228",
            "Probatoire": "S"
        },
        {
            "id": 58,
            "nom_infraction": "Ne pas avoir de plaque d’immatriculation",
            "cat_infraction": "3",
            "Contravention": "4e classe, soit une amende forfaitaire de 135 €",
            "Vehicule": "Immobilisation du véhicule",
            "Source": "Article R317-8 du code de la route",
            "Code_legi": "Route R",
            "Code_Url": "https:\/\/www.legifrance.gouv.fr\/affichCode.do?idSectionTA=LEGISCTA000006177090&cidTexte=LEGITEXT000006074228"
        },
        {
            "id": 59,
            "nom_infraction": "Avoir des feux de direction et de clignotants défectueux",
            "cat_infraction": "3",
            "Contravention": "3e classe, soit une amende forfaitaire de 68 €",
            "Vehicule": "Immobilisation du véhicule si la visibilité est réduite",
            "Source": "Article R313-14 du code de la route",
            "Code_legi": "Route R",
            "Code_Url": "https:\/\/www.legifrance.gouv.fr\/affichCodeArticle.do?cidTexte=LEGITEXT000006074228&idArticle=LEGIARTI000032401327"
        },
        {
            "id": 60,
            "nom_infraction": "Circuler avec un pare-brise ou des vitres latérales avant insuffisamment transparents",
            "cat_infraction": "3",
            "points": "3 points",
            "Contravention": "4e classe, soit une amende forfaitaire de 135 €",
            "Vehicule": "Immobilisation du véhicule",
            "Source": "Article R316-3-1 du code de la route",
            "Code_legi": "Route R",
            "Code_Url": "https:\/\/www.legifrance.gouv.fr\/affichCodeArticle.do?idArticle=LEGIARTI000032401382&cidTexte=LEGITEXT000006074228",
            "Probatoire": "S"
        },
        {
            "id": 61,
            "nom_infraction": "Ne pas afficher le certificat d’assurance (papillon vert)",
            "cat_infraction": "3",
            "Contravention": "2e classe, soit une amende forfaitaire de 35 €",
            "Source": "Article R211-21-5 du code des assurances",
            "Code_legi": "Assurances",
            "Code_Url": "https:\/\/www.legifrance.gouv.fr\/affichCode.do?idSectionTA=LEGISCTA000006187941&cidTexte=LEGITEXT000006073984"
        },
        {
            "id": 62,
            "nom_infraction": "Circuler avec des pneus en mauvais état",
            "cat_infraction": "3",
            "Contravention": "4e classe, soit une amende forfaitaire de 135 €",
            "Vehicule": "Immobilisation du véhicule",
            "Source": "Article R314-1 du code de la route",
            "Code_legi": "Route R",
            "Code_Url": "https:\/\/www.legifrance.gouv.fr\/affichCode.do?idSectionTA=LEGISCTA000006159580&cidTexte=LEGITEXT000006074228"
        },
        {
            "id": 63,
            "nom_infraction": "Rouler sans gants (2 roues motorisé)",
            "cat_infraction": "3",
            "points": "1 point",
            "Contravention": "3e classe, soit une amende forfaitaire de 68 €",
            "Source": "Article R431-1-2 du code de la route",
            "Code_legi": "Route R",
            "Code_Url": "https:\/\/www.legifrance.gouv.fr\/affichCode.do?idSectionTA=LEGISCTA000006159608&cidTexte=LEGITEXT000006074228"
        },
        {
            "id": 64,
            "nom_infraction": "Rouler sans casque (2 roues motorisé)",
            "cat_infraction": "3",
            "points": "3 points",
            "Contravention": "4e classe, soit une amende forfaitaire de 135 €",
            "Source": "Article R431-1 du code de la route",
            "Code_legi": "Route R",
            "Code_Url": "https:\/\/www.legifrance.gouv.fr\/affichCode.do?idSectionTA=LEGISCTA000006159608&cidTexte=LEGITEXT000006074228",
            "Probatoire": "S"
        },
        {
            "id": 65,
            "nom_infraction": "Port d’une oreillette ou d’un système audio à l’oreille",
            "cat_infraction": "3",
            "points": "3 points",
            "Contravention": "4e classe, soit une amende forfaitaire de 135 €",
            "Source": "Article R412-6-1 du code de la route",
            "Code_legi": "Route R",
            "Code_Url": "https:\/\/www.legifrance.gouv.fr\/affichCode.do?idSectionTA=LEGISCTA000006177121&cidTexte=LEGITEXT000006074228",
            "Probatoire": "S"
        },
        {
            "id": 66,
            "nom_infraction": "Port d’un casque audio ou d’écouteurs par un conducteur (y compris à vélo ou en trottinette))",
            "cat_infraction": "3",
            "points": "3 points (si le véhicule nécessite un permis de conduire)",
            "Contravention": "4e classe, soit une amende forfaitaire de 135 €",
            "Source": "Article R412-6-1 du code de la route",
            "Code_legi": "Route R",
            "Code_Url": "https:\/\/www.legifrance.gouv.fr\/affichCode.do?idSectionTA=LEGISCTA000006177121&cidTexte=LEGITEXT000006074228",
            "Probatoire": "S"
        },
        {
            "id": 67,
            "nom_infraction": "Ne pas attacher sa ceinture de sécurité (pour le conducteur)",
            "cat_infraction": "3",
            "points": "3 points",
            "Contravention": "4e classe, soit une amende forfaitaire de 135 €",
            "Source": "Article R412-1 du code de la route",
            "Code_legi": "Route R",
            "Code_Url": "https:\/\/www.legifrance.gouv.fr\/affichCode.do?idSectionTA=LEGISCTA000006177120&cidTexte=LEGITEXT000006074228",
            "Probatoire": "S"
        },
        {
            "id": 68,
            "nom_infraction": "Ne pas attacher sa ceinture de sécurité (pour un passager)",
            "cat_infraction": "3",
            "Contravention": "4e classe, soit une amende forfaitaire de 135 €",
            "Source": "Article R412-1 du code de la route",
            "Code_legi": "Route R",
            "Code_Url": "https:\/\/www.legifrance.gouv.fr\/affichCode.do?idSectionTA=LEGISCTA000006177120&cidTexte=LEGITEXT000006074228"
        },
        {
            "id": 69,
            "nom_infraction": "Transporter un enfant non attaché (avec une ceinture de sécurité ou un un autre système de sécurité)",
            "cat_infraction": "3",
            "Contravention": "4e classe, soit une amende forfaitaire de 135 €",
            "Source": "Article R412-2 du code de la route",
            "Code_legi": "Route R",
            "Code_Url": "https:\/\/www.legifrance.gouv.fr\/affichCode.do?idSectionTA=LEGISCTA000006177120&cidTexte=LEGITEXT000006074228"
        },
        {
            "id": 70,
            "nom_infraction": "Transporter un enfant de moins de 10 ans à l’avant du véhicule",
            "cat_infraction": "3",
            "Contravention": "4e classe, soit une amende forfaitaire de 135 €",
            "Source": "Article R412-3 du code de la route",
            "Code_legi": "Route R",
            "Code_Url": "https:\/\/www.legifrance.gouv.fr\/affichCode.do?idSectionTA=LEGISCTA000006177120&cidTexte=LEGITEXT000006074228"
        },
        {
            "id": 71,
            "nom_infraction": "Transporter plus de passagers que le nombre de places assises indiquées sur la carte grise",
            "cat_infraction": "3",
            "points": "3 points",
            "Contravention": "4e classe, soit une amende forfaitaire de 135 €",
            "Source": "Article R412-1-1 du code de la route",
            "Code_legi": "Route R",
            "Code_Url": "https:\/\/www.legifrance.gouv.fr\/affichCode.do?idSectionTA=LEGISCTA000006177120&cidTexte=LEGITEXT000006074228",
            "Probatoire": "S"
        },
        {
            "id": 72
        },
        {
            "id": 74,
            "nom_infraction": "Circuler à plusieurs personnes sur un engin de déplacement motorisé (trottinette éléctrique...) ",
            "cat_infraction": "3",
            "Contravention": "2e classe, soit une amende forfaitaire de 35 €",
            "Source": "Article R412-43-3 du code de la route",
            "Code_legi": "Route R",
            "Code_Url": "https:\/\/www.legifrance.gouv.fr\/affichCode.do?idSectionTA=LEGISCTA000039276187&cidTexte=LEGITEXT000006074228"
        }
    ]
}