{
    "$schema": "http:\/\/json-schema.org\/draft-04\/schema#",
    "type": "object",
    "title": "documents_de_naturalisation",
    "description": "documents_de_naturalisation",
    "databaseName": "documents_de_naturalisation.db",
    "databaseLabel": "documents_de_naturalisation",
    "properties": {
        "Situation_Familiale": {
            "type": "array",
            "title": "Situation_Familiale",
            "description": "",
            "items": {
                "type": "object",
                "properties": {
                    "id": {
                        "type": "integer",
                        "title": "id [primarykey:1, autoincrement:22, type:integer]",
                        "description": "Identifiant interne"
                    },
                    "Situation_familiale": {
                        "type": "string",
                        "title": "Situation_familiale [type:text]",
                        "description": ""
                    },
                    "Doc_Famille": {
                        "type": "string",
                        "title": "Document Famille [type:text]",
                        "description": ""
                    },
                    "id_situation": {
                        "type": "integer",
                        "title": "id_situation [type:integer]",
                        "description": ""
                    }
                },
                "required": [
                    "id",
                    "Situation_familiale",
                    "id_situation"
                ]
            }
        },
        "Enfants": {
            "type": "array",
            "title": "Enfants",
            "description": "",
            "items": {
                "type": "object",
                "properties": {
                    "id": {
                        "type": "integer",
                        "title": "id [primarykey:1, autoincrement:7, type:integer]",
                        "description": "Identifiant interne"
                    },
                    "Enfant": {
                        "type": "string",
                        "title": "Enfant [type:text]",
                        "description": ""
                    },
                    "Doc_Enfant": {
                        "type": "string",
                        "title": "Document enfant [type:text]",
                        "description": ""
                    }
                },
                "required": [
                    "id",
                    "Enfant"
                ]
            }
        },
        "Domicile": {
            "type": "array",
            "title": "Domicile",
            "description": "",
            "items": {
                "type": "object",
                "properties": {
                    "id": {
                        "type": "integer",
                        "title": "id [primarykey:1, autoincrement:6, type:integer]",
                        "description": "Identifiant interne"
                    },
                    "Domicile": {
                        "type": "string",
                        "title": "Domicile [type:text]",
                        "description": ""
                    },
                    "Doc_Domicile": {
                        "type": "string",
                        "title": "Document Domicile [type:text]",
                        "description": ""
                    },
                    "Id_Domicile": {
                        "type": "integer",
                        "title": "Id_Domicile [type:integer]",
                        "description": ""
                    }
                },
                "required": [
                    "id",
                    "Domicile",
                    "Doc_Domicile"
                ]
            }
        },
        "Situation_Professionnelle": {
            "type": "array",
            "title": "Situation_Professionnelle",
            "description": "",
            "items": {
                "type": "object",
                "properties": {
                    "id": {
                        "type": "integer",
                        "title": "id [primarykey:1, autoincrement:24, type:integer]",
                        "description": "Identifiant interne"
                    },
                    "Situation_Professionnelle": {
                        "type": "string",
                        "title": "Situation_Professionnelle [type:text]",
                        "description": ""
                    },
                    "Doc_Pro": {
                        "type": "string",
                        "title": "Document Prof [type:text]",
                        "description": ""
                    },
                    "Id_Pro": {
                        "type": "integer",
                        "title": "Id_Pro [type:integer]",
                        "description": ""
                    }
                },
                "required": [
                    "id",
                    "Situation_Professionnelle"
                ]
            }
        },
        "Commun": {
            "type": "array",
            "title": "Documents communs",
            "description": "",
            "items": {
                "type": "object",
                "properties": {
                    "id": {
                        "type": "integer",
                        "title": "id [primarykey:1, autoincrement:11, type:integer]",
                        "description": "Identifiant interne"
                    },
                    "Toute_categorie": {
                        "type": "string",
                        "title": "Toute Catégorie [type:text]",
                        "description": ""
                    },
                    "Doc_Commun": {
                        "type": "string",
                        "title": "Document commun [type:text]",
                        "description": ""
                    }
                },
                "required": [
                    "id",
                    "Toute_categorie",
                    "Doc_Commun"
                ]
            }
        },
        "Autres_Ressources": {
            "type": "array",
            "title": "Autres_Ressources",
            "description": "",
            "items": {
                "type": "object",
                "properties": {
                    "id": {
                        "type": "integer",
                        "title": "id [primarykey:1, autoincrement:13, type:integer]",
                        "description": "Identifiant interne"
                    },
                    "Ressources": {
                        "type": "string",
                        "title": "Ressources [type:text]",
                        "description": ""
                    },
                    "Doc_Ressources": {
                        "type": "string",
                        "title": "Document Ressources [type:text]",
                        "description": ""
                    },
                    "Id_Ress": {
                        "type": "integer",
                        "title": "Id_Ress [type:integer]",
                        "description": ""
                    }
                },
                "required": [
                    "id",
                    "Ressources",
                    "Doc_Ressources"
                ]
            }
        },
        "Pays_Francophone": {
            "type": "array",
            "title": "Pays_Francophone",
            "description": "",
            "items": {
                "type": "object",
                "properties": {
                    "id": {
                        "type": "integer",
                        "title": "id [primarykey:1, autoincrement:195, type:integer]",
                        "description": "Identifiant interne"
                    },
                    "Pays": {
                        "type": "string",
                        "title": "Pays [type:text]",
                        "description": ""
                    },
                    "Francophone": {
                        "type": "string",
                        "title": "Francophone [type:text]",
                        "description": ""
                    }
                },
                "required": [
                    "id",
                    "Pays",
                    "Francophone"
                ]
            }
        }
    },
    "required": [
        "Situation_Familiale",
        "Enfants",
        "Domicile",
        "Situation_Professionnelle",
        "Commun",
        "Autres_Ressources",
        "Pays_Francophone"
    ]
}