{
    "$schema": "http:\/\/json-schema.org\/draft-04\/schema#",
    "type": "object",
    "title": "pension-alimentaire",
    "description": "Données de références pour le calcul de la pension alimentaire",
    "properties": {
        "tauxPA": {
            "type": "array",
            "title": "Taux pension alimentaire",
            "description": "Taux de la pension alimentaire en fonction du droit de visite et d'hébergement et du nombre d'enfants",
            "items": {
                "type": "object",
                "properties": {
                    "id": {
                        "type": "integer",
                        "title": "id [primarykey:1, autoincrement:18, type:integer]",
                        "description": "Identifiant interne"
                    },
                    "droitVH": {
                        "type": "integer",
                        "title": "Droit de visite et d'hébergement [type:choice]",
                        "description": "Droit de visite et d'hébergement (1: réduit, 2: classique, 3: alterné)",
                        "oneOf": [
                            {
                                "title": "réduit",
                                "enum": [
                                    1
                                ]
                            },
                            {
                                "title": "classique",
                                "enum": [
                                    2
                                ]
                            },
                            {
                                "title": "alterné",
                                "enum": [
                                    3
                                ]
                            }
                        ],
                        "default": 0
                    },
                    "nbEnfant": {
                        "type": "integer",
                        "title": "Nombre d'enfants [type:integer]",
                        "description": "Nombre d'enfants",
                        "default": 0
                    },
                    "taux": {
                        "type": "number",
                        "title": "Taux [type:percent]",
                        "description": "Taux de la pension alimentaire"
                    }
                },
                "required": [
                    "id",
                    "droitVH",
                    "nbEnfant",
                    "taux"
                ]
            }
        }
    },
    "required": [
        "tauxPA"
    ]
}