<?xml version="1.0" encoding="UTF-8" standalone="no"?>
<!-- Created with Inkscape (http://www.inkscape.org/) -->

<svg
   xmlns:dc="http://purl.org/dc/elements/1.1/"
   xmlns:cc="http://creativecommons.org/ns#"
   xmlns:rdf="http://www.w3.org/1999/02/22-rdf-syntax-ns#"
   xmlns:svg="http://www.w3.org/2000/svg"
   xmlns="http://www.w3.org/2000/svg"
   xmlns:sodipodi="http://sodipodi.sourceforge.net/DTD/sodipodi-0.dtd"
   xmlns:inkscape="http://www.inkscape.org/namespaces/inkscape"
   width="210mm"
   height="297mm"
   id="svg2"
   version="1.1"
   inkscape:version="0.91 r13725"
   inkscape:export-filename="D:\git\jmpy3\jmpy\levels\levels9.png"
   inkscape:export-xdpi="90"
   inkscape:export-ydpi="90"
   sodipodi:docname="_9_level wall jump1.svg">
  <defs
     id="defs4" />
  <sodipodi:namedview
     id="base"
     pagecolor="#ffffff"
     bordercolor="#666666"
     borderopacity="1.0"
     inkscape:pageopacity="0.0"
     inkscape:pageshadow="2"
     inkscape:zoom="0.7071068"
     inkscape:cx="569.5028"
     inkscape:cy="243.30408"
     inkscape:document-units="px"
     inkscape:current-layer="layer1"
     showgrid="false"
     showguides="true"
     inkscape:guide-bbox="true"
     inkscape:window-width="1440"
     inkscape:window-height="848"
     inkscape:window-x="-8"
     inkscape:window-y="-8"
     inkscape:window-maximized="1" />
  <metadata
     id="metadata7">
    <rdf:RDF>
      <cc:Work
         rdf:about="">
        <dc:format>image/svg+xml</dc:format>
        <dc:type
           rdf:resource="http://purl.org/dc/dcmitype/StillImage" />
        <dc:title />
      </cc:Work>
    </rdf:RDF>
  </metadata>
  <g
     inkscape:label="Calque 1"
     inkscape:groupmode="layer"
     id="layer1"
     style="display:inline">
    <rect
       id="rect3103"
       width="22"
       height="644.19598"
       x="3"
       y="468.86218"
       style="fill:#000000;fill-opacity:0.69803922"
       inkscape:export-xdpi="90"
       inkscape:export-ydpi="90" />
    <rect
       style="fill:#000000;fill-opacity:0.69803922"
       id="rect3873"
       width="1484"
       height="26"
       x="0"
       y="464.36218"
       inkscape:export-filename="/home/pierre-ubuntu/git/jmpy/rect3103.png"
       inkscape:export-xdpi="90"
       inkscape:export-ydpi="90" />
    <rect
       style="fill:#000000;fill-opacity:0.69803922"
       id="rect3875"
       width="14"
       height="594"
       x="1453.058"
       y="461.00433"
       inkscape:export-filename="/home/pierre-ubuntu/git/jmpy/rect3103.png"
       inkscape:export-xdpi="90"
       inkscape:export-ydpi="90" />
    <rect
       style="fill:#000000;fill-opacity:0.69803922"
       id="rect3877"
       width="1597"
       height="20"
       x="7"
       y="1129.3622"
       inkscape:export-filename="/home/pierre-ubuntu/git/jmpy/rect3103.png"
       inkscape:export-xdpi="90"
       inkscape:export-ydpi="90" />
    <rect
       style="fill:#000000;fill-opacity:0.69803922"
       id="rect3929"
       width="498.5"
       height="20"
       x="14"
       y="1038.8622"
       inkscape:export-filename="/home/pierre-ubuntu/git/jmpy/rect3103.png"
       inkscape:export-xdpi="90"
       inkscape:export-ydpi="90" />
    <rect
       style="fill:#2aff00;fill-opacity:0.69803922"
       id="rect3937"
       width="22"
       height="26"
       x="1263.7029"
       y="760.60779"
       inkscape:export-filename="/home/pierre-ubuntu/git/jmpy/rect3103.png"
       inkscape:export-xdpi="90"
       inkscape:export-ydpi="90" />
    <path
       sodipodi:type="arc"
       style="fill:#2aff00;fill-opacity:0.69803922"
       id="path3960"
       sodipodi:cx="5"
       sodipodi:cy="715.36218"
       sodipodi:rx="11"
       sodipodi:ry="9"
       d="m 16,715.36218 a 11,9 0 1 1 -22,0 11,9 0 1 1 22,0 z"
       transform="translate(176,312)"
       inkscape:export-filename="/home/pierre-ubuntu/git/jmpy/rect3103.png"
       inkscape:export-xdpi="90"
       inkscape:export-ydpi="90" />
    <rect
       style="fill:#000000;fill-opacity:0.69803922"
       id="rect3514"
       width="219.20309"
       height="206.47519"
       x="460.61942"
       y="795.15192"
       inkscape:export-filename="/home/pierre-ubuntu/git/jmpy/rect3103.png"
       inkscape:export-xdpi="90"
       inkscape:export-ydpi="90" />
    <rect
       style="fill:#000000;fill-opacity:0.69803922"
       id="rect3516"
       width="10"
       height="148.5"
       x="277"
       y="1175.3622" />
    <rect
       style="fill:#000000;fill-opacity:0.69803922"
       id="rect3534"
       width="11"
       height="75.5"
       x="455.5"
       y="1191.8622" />
    <rect
       style="fill:#000000;fill-opacity:0.69803922"
       id="rect3590"
       width="12.5"
       height="297.5"
       x="1166.0491"
       y="-906.33093"
       transform="matrix(0,1,-1,0,0,0)" />
    <rect
       style="fill:#000000;fill-opacity:0.69803922"
       id="rect3684"
       width="670.55341"
       height="75.585785"
       x="249.44662"
       y="787.77637"
       inkscape:export-filename="/home/pierre-ubuntu/git/jmpy/rect3103.png"
       inkscape:export-xdpi="90"
       inkscape:export-ydpi="90" />
    <rect
       style="fill:#808000;fill-opacity:0.69803922;display:inline"
       id="rect3686-8"
       width="22"
       height="461.39697"
       x="11"
       y="535.96521"
       inkscape:export-filename="/home/pierre-ubuntu/git/jmpy/rect3103.png"
       inkscape:export-xdpi="90"
       inkscape:export-ydpi="90" />
    <rect
       style="fill:#ff0000;fill-opacity:0.69803922"
       id="rect3708"
       width="936"
       height="84"
       x="516"
       y="1044.3622"
       inkscape:export-filename="/home/pierre-ubuntu/git/jmpy/rect3103.png"
       inkscape:export-xdpi="90"
       inkscape:export-ydpi="90" />
    <rect
       style="fill:#000000;fill-opacity:0.69803922"
       id="rect3712"
       width="122"
       height="52"
       x="1168"
       y="788.36218"
       inkscape:export-filename="/home/pierre-ubuntu/git/jmpy/rect3103.png"
       inkscape:export-xdpi="90"
       inkscape:export-ydpi="90" />
    <path
       sodipodi:type="arc"
       style="fill:#ff0000;fill-opacity:0.69803922"
       id="path3876"
       sodipodi:cx="534.57269"
       sodipodi:cy="697.39459"
       sodipodi:rx="43.840618"
       sodipodi:ry="43.840618"
       d="m 578.41331,697.39459 a 43.840618,43.840618 0 1 1 -87.68124,0 43.840618,43.840618 0 1 1 87.68124,0 z"
       inkscape:export-filename="/home/pierre-ubuntu/git/jmpy/rect3103.png"
       inkscape:export-xdpi="90"
       inkscape:export-ydpi="90"
       transform="translate(240,102)" />
    <rect
       style="fill:#000000;fill-opacity:0.69803922;display:inline"
       id="rect3590-1"
       width="11.086266"
       height="421.95053"
       x="1276.6218"
       y="-1028.615"
       transform="matrix(0,1,-1,0,0,0)" />
  </g>
</svg>
