<?xml version="1.0" encoding="UTF-8" standalone="no"?>
<!-- Created with Inkscape (http://www.inkscape.org/) -->

<svg
   xmlns:dc="http://purl.org/dc/elements/1.1/"
   xmlns:cc="http://creativecommons.org/ns#"
   xmlns:rdf="http://www.w3.org/1999/02/22-rdf-syntax-ns#"
   xmlns:svg="http://www.w3.org/2000/svg"
   xmlns="http://www.w3.org/2000/svg"
   xmlns:sodipodi="http://sodipodi.sourceforge.net/DTD/sodipodi-0.dtd"
   xmlns:inkscape="http://www.inkscape.org/namespaces/inkscape"
   width="210mm"
   height="297mm"
   id="svg2"
   version="1.1"
   inkscape:version="0.91 r13725"
   inkscape:export-filename="D:\git\jmpy3\jmpy\levels\level5.png"
   inkscape:export-xdpi="90"
   inkscape:export-ydpi="90"
   sodipodi:docname="_5_simple.svg">
  <defs
     id="defs4" />
  <sodipodi:namedview
     id="base"
     pagecolor="#ffffff"
     bordercolor="#666666"
     borderopacity="1.0"
     inkscape:pageopacity="0.0"
     inkscape:pageshadow="2"
     inkscape:zoom="0.35355339"
     inkscape:cx="292.52406"
     inkscape:cy="849.44988"
     inkscape:document-units="px"
     inkscape:current-layer="layer1"
     showgrid="false"
     showguides="true"
     inkscape:guide-bbox="true"
     inkscape:window-width="1440"
     inkscape:window-height="848"
     inkscape:window-x="-8"
     inkscape:window-y="-8"
     inkscape:window-maximized="1"
     inkscape:snap-grids="false" />
  <metadata
     id="metadata7">
    <rdf:RDF>
      <cc:Work
         rdf:about="">
        <dc:format>image/svg+xml</dc:format>
        <dc:type
           rdf:resource="http://purl.org/dc/dcmitype/StillImage" />
        <dc:title />
      </cc:Work>
    </rdf:RDF>
  </metadata>
  <g
     inkscape:label="Calque 1"
     inkscape:groupmode="layer"
     id="layer1"
     style="display:inline">
    <rect
       id="rect3103"
       width="22"
       height="512.5249"
       x="0.098266602"
       y="0.69512939"
       style="fill:#000000;fill-opacity:0.69803922"
       inkscape:export-xdpi="90"
       inkscape:export-ydpi="90"
       inkscape:export-filename="C:\Users\pc\git\jmpy\tuto1.png" />
    <rect
       style="fill:#000000;fill-opacity:0.69803922"
       id="rect3875"
       width="14"
       height="331.58768"
       x="2761.4509"
       y="63.159321"
       inkscape:export-filename="C:\Users\pc\git\jmpy\tuto1.png"
       inkscape:export-xdpi="90"
       inkscape:export-ydpi="90" />
    <rect
       style="fill:#000000;fill-opacity:0.69803922"
       id="rect3877"
       width="959.0575"
       height="82.225395"
       x="0"
       y="511.71979"
       inkscape:export-filename="C:\Users\pc\git\jmpy\tuto1.png"
       inkscape:export-xdpi="90"
       inkscape:export-ydpi="90" />
    <rect
       style="fill:#000000;fill-opacity:0.69803922;display:inline"
       id="rect3929-7"
       width="959.53363"
       height="34.120525"
       x="6.5904994"
       y="2.3403988"
       inkscape:export-filename="C:\Users\pc\git\jmpy\tuto1.png"
       inkscape:export-xdpi="90"
       inkscape:export-ydpi="90" />
    <rect
       style="fill:#008000;fill-opacity:0.69803921999999996;display:inline"
       id="rect3937-0"
       width="22"
       height="26"
       x="40.056614"
       y="479.66623"
       inkscape:export-filename="C:\Users\pc\git\jmpy\tuto1.png"
       inkscape:export-xdpi="90"
       inkscape:export-ydpi="90" />
    <rect
       style="fill:#000000;fill-opacity:0.69803922;display:inline"
       id="rect3516"
       width="20.458574"
       height="148.5"
       x="-232.43774"
       y="561.86743"
       inkscape:export-filename="C:\Users\pc\git\jmpy\tuto1.png"
       inkscape:export-xdpi="90"
       inkscape:export-ydpi="90" />
    <rect
       style="fill:#000000;fill-opacity:0.69803922;display:inline"
       id="rect3534"
       width="19.485281"
       height="65.600502"
       x="-413.62067"
       y="519.49237"
       inkscape:export-filename="C:\Users\pc\git\jmpy\tuto1.png"
       inkscape:export-xdpi="90"
       inkscape:export-ydpi="90" />
    <rect
       style="fill:#000000;fill-opacity:0.69803922;display:inline"
       id="rect3929-7-7"
       width="412.23294"
       height="24.221027"
       x="367.76639"
       y="415.24182"
       inkscape:export-filename="C:\Users\pc\git\jmpy\tuto1.png"
       inkscape:export-xdpi="90"
       inkscape:export-ydpi="90" />
    <rect
       style="fill:#00ff00;fill-opacity:0.69803922;display:inline"
       id="rect3937-9"
       width="22"
       height="26"
       x="920.3363"
       y="200.03711"
       inkscape:export-filename="C:\Users\pc\git\jmpy\tuto1.png"
       inkscape:export-xdpi="90"
       inkscape:export-ydpi="90" />
    <rect
       id="rect3103-4-4"
       width="22"
       height="587.47821"
       x="949.25092"
       y="4.4553246"
       style="fill:#000000;fill-opacity:0.69803922;display:inline"
       inkscape:export-xdpi="90"
       inkscape:export-ydpi="90"
       inkscape:export-filename="C:\Users\pc\git\jmpy\tuto1.png" />
    <rect
       style="fill:#000000;fill-opacity:0.69803922;display:inline"
       id="rect3590-2"
       width="295.34271"
       height="11.82886"
       x="-502.45169"
       y="432.49176"
       inkscape:export-filename="C:\Users\pc\git\jmpy\tuto1.png"
       inkscape:export-xdpi="90"
       inkscape:export-ydpi="90" />
    <rect
       style="fill:#000000;fill-opacity:0.69803922;display:inline"
       id="rect3590-1-4"
       width="419.79401"
       height="11.828598"
       x="-643.1662"
       y="798.77325" />
    <rect
       style="fill:#000000;fill-opacity:0.69803922;display:inline"
       id="rect3929-7-7-1"
       width="217.07147"
       height="24.221027"
       x="17.672421"
       y="324.65961"
       inkscape:export-filename="C:\Users\pc\git\jmpy\tuto1.png"
       inkscape:export-xdpi="90"
       inkscape:export-ydpi="90" />
    <rect
       style="fill:#000000;fill-opacity:0.69803922;display:inline"
       id="rect3929-7-7-1-7"
       width="471.62988"
       height="24.221027"
       x="484.36292"
       y="236.29207"
       inkscape:export-filename="C:\Users\pc\git\jmpy\tuto1.png"
       inkscape:export-xdpi="90"
       inkscape:export-ydpi="90" />
  </g>
</svg>
