<?xml version="1.0" encoding="UTF-8" standalone="no"?>
<!-- Created with Inkscape (http://www.inkscape.org/) -->

<svg
   xmlns:dc="http://purl.org/dc/elements/1.1/"
   xmlns:cc="http://creativecommons.org/ns#"
   xmlns:rdf="http://www.w3.org/1999/02/22-rdf-syntax-ns#"
   xmlns:svg="http://www.w3.org/2000/svg"
   xmlns="http://www.w3.org/2000/svg"
   xmlns:sodipodi="http://sodipodi.sourceforge.net/DTD/sodipodi-0.dtd"
   xmlns:inkscape="http://www.inkscape.org/namespaces/inkscape"
   width="210mm"
   height="297mm"
   id="svg2"
   version="1.1"
   inkscape:version="0.91 r13725"
   inkscape:export-filename="D:\git\jmpy3\jmpy\levels\level21.png"
   inkscape:export-xdpi="90"
   inkscape:export-ydpi="90"
   sodipodi:docname="21_level gravity 3.svg">
  <defs
     id="defs4">
    <inkscape:path-effect
       effect="spiro"
       id="path-effect3025"
       is_visible="true" />
    <inkscape:path-effect
       effect="spiro"
       id="path-effect3021"
       is_visible="true" />
  </defs>
  <sodipodi:namedview
     id="base"
     pagecolor="#ffffff"
     bordercolor="#666666"
     borderopacity="1.0"
     inkscape:pageopacity="0.0"
     inkscape:pageshadow="2"
     inkscape:zoom="0.35355339"
     inkscape:cx="706.52905"
     inkscape:cy="477.01834"
     inkscape:document-units="px"
     inkscape:current-layer="layer1"
     showgrid="false"
     showguides="true"
     inkscape:guide-bbox="true"
     inkscape:window-width="1440"
     inkscape:window-height="848"
     inkscape:window-x="-8"
     inkscape:window-y="-8"
     inkscape:window-maximized="1"
     showborder="false">
    <sodipodi:guide
       orientation="0,1"
       position="698,80"
       id="guide3299" />
  </sodipodi:namedview>
  <metadata
     id="metadata7">
    <rdf:RDF>
      <cc:Work
         rdf:about="">
        <dc:format>image/svg+xml</dc:format>
        <dc:type
           rdf:resource="http://purl.org/dc/dcmitype/StillImage" />
        <dc:title />
      </cc:Work>
    </rdf:RDF>
  </metadata>
  <g
     inkscape:label="Calque 1"
     inkscape:groupmode="layer"
     id="layer1"
     style="display:inline">
    <rect
       id="rect3103"
       width="22"
       height="1053.4062"
       x="2.9999995"
       y="2.8621829"
       style="fill:#000000;fill-opacity:0.69803922"
       inkscape:export-filename="C:\Users\pc\git\jmpy\levels\walljump2.png"
       inkscape:export-xdpi="90"
       inkscape:export-ydpi="90" />
    <rect
       style="fill:#000000;fill-opacity:0.69803922"
       id="rect3873"
       width="2596.4365"
       height="26"
       x="-7.7034855e-008"
       y="0.36218262"
       inkscape:export-filename="C:\Users\pc\git\jmpy\levels\walljump2.png"
       inkscape:export-xdpi="90"
       inkscape:export-ydpi="90" />
    <rect
       style="fill:#000000;fill-opacity:0.69803922"
       id="rect3534"
       width="11"
       height="75.5"
       x="-591.10632"
       y="733.83362" />
    <rect
       style="fill:#ffff00;fill-opacity:0.69803922"
       id="rect3131"
       width="24"
       height="18"
       x="-688.83765"
       y="997.99969" />
    <rect
       style="fill:#808000;fill-opacity:0.69803922"
       id="rect3194"
       width="27"
       height="20"
       x="-593.83765"
       y="1018.9997" />
    <path
       sodipodi:type="arc"
       style="fill:#00ff00;fill-opacity:0.69803922;display:inline"
       id="path3034-1"
       sodipodi:cx="-162"
       sodipodi:cy="1156.3622"
       sodipodi:rx="15"
       sodipodi:ry="15"
       d="m -147,1156.3622 a 15,15 0 1 1 -30,0 15,15 0 1 1 30,0 z"
       transform="translate(-446.83766,-68.362482)" />
    <rect
       style="fill:#000000;fill-opacity:0.69803922;display:inline"
       id="rect3516-9"
       width="10"
       height="148.5"
       x="-924.14545"
       y="962.11804" />
    <path
       sodipodi:type="arc"
       style="fill:#008000;fill-opacity:0.69803922;display:inline"
       id="path3034-1-3-2"
       sodipodi:cx="-162"
       sodipodi:cy="1156.3622"
       sodipodi:rx="15"
       sodipodi:ry="15"
       d="m -147,1156.3622 a 15,15 0 1 1 -30,0 15,15 0 1 1 30,0 z"
       transform="translate(-508.83766,-84.362482)" />
    <path
       transform="translate(-1056.4104,438.60511)"
       sodipodi:type="arc"
       style="fill:#ff0000;fill-opacity:0.69803922;display:inline"
       id="path3876"
       sodipodi:cx="534.57269"
       sodipodi:cy="697.39459"
       sodipodi:rx="43.840618"
       sodipodi:ry="43.840618"
       d="m 578.41331,697.39459 a 43.840618,43.840618 0 1 1 -87.68124,0 43.840618,43.840618 0 1 1 87.68124,0 z"
       inkscape:export-filename="/home/pierre-ubuntu/git/jmpy/rect3103.png"
       inkscape:export-xdpi="90"
       inkscape:export-ydpi="90" />
    <path
       sodipodi:type="arc"
       style="fill:#00ff00;fill-opacity:0.69803922;display:inline"
       id="path3034-1-8"
       sodipodi:cx="-162"
       sodipodi:cy="1156.3622"
       sodipodi:rx="15"
       sodipodi:ry="15"
       d="m -147,1156.3622 a 15,15 0 1 1 -30,0 15,15 0 1 1 30,0 z"
       transform="translate(623.41127,-595.24891)"
       inkscape:export-filename="C:\Users\pc\git\jmpy\levels\walljump2.png"
       inkscape:export-xdpi="90"
       inkscape:export-ydpi="90" />
    <path
       sodipodi:type="arc"
       style="fill:#008000;fill-opacity:0.69803922;display:inline"
       id="path3034-1-3-2-6"
       sodipodi:cx="-162"
       sodipodi:cy="1156.3622"
       sodipodi:rx="15"
       sodipodi:ry="15"
       d="m -147,1156.3622 a 15,15 0 1 1 -30,0 15,15 0 1 1 30,0 z"
       transform="translate(234.62325,-209.59207)"
       inkscape:export-filename="C:\Users\pc\git\jmpy\levels\walljump2.png"
       inkscape:export-xdpi="90"
       inkscape:export-ydpi="90" />
    <rect
       style="fill:#ff0000;fill-opacity:0.69803922;display:inline"
       id="rect3091-3"
       width="22"
       height="18"
       x="-647.39612"
       y="1003.7642" />
    <rect
       style="fill:#000000;fill-opacity:0.69803922;fill-rule:nonzero;stroke:none"
       id="rect3014"
       width="305.47012"
       height="19.79899"
       x="-789.13116"
       y="427.27979" />
    <rect
       style="fill:#000000;fill-opacity:0.69803922;fill-rule:nonzero;stroke:none;display:inline"
       id="rect3014-1"
       width="149.90663"
       height="91.798988"
       x="14.142139"
       y="968.92358" />
    <rect
       style="fill:#000000;fill-opacity:0.69803922;fill-rule:nonzero;stroke:none;display:inline"
       id="rect3014-8"
       width="1879.579"
       height="254.39192"
       x="10.149279"
       y="581.63" />
    <path
       transform="translate(218.4395,141.10973)"
       sodipodi:type="arc"
       style="fill:#ff0000;fill-opacity:0.69803922;display:inline"
       id="path3876-1"
       sodipodi:cx="534.57269"
       sodipodi:cy="697.39459"
       sodipodi:rx="43.840618"
       sodipodi:ry="43.840618"
       d="m 578.41331,697.39459 a 43.840618,43.840618 0 1 1 -87.68124,0 43.840618,43.840618 0 1 1 87.68124,0 z"
       inkscape:export-filename="/home/pierre-ubuntu/git/jmpy/rect3103.png"
       inkscape:export-xdpi="90"
       inkscape:export-ydpi="90" />
    <path
       transform="translate(775.78474,141.35236)"
       sodipodi:type="arc"
       style="fill:#ff0000;fill-opacity:0.69803922;display:inline"
       id="path3876-19"
       sodipodi:cx="534.57269"
       sodipodi:cy="697.39459"
       sodipodi:rx="43.840618"
       sodipodi:ry="43.840618"
       d="m 578.41331,697.39459 a 43.840618,43.840618 0 1 1 -87.68124,0 43.840618,43.840618 0 1 1 87.68124,0 z"
       inkscape:export-filename="/home/pierre-ubuntu/git/jmpy/rect3103.png"
       inkscape:export-xdpi="90"
       inkscape:export-ydpi="90" />
    <rect
       style="fill:#ff0000;fill-opacity:0.69803922;fill-rule:nonzero;stroke:none;display:inline"
       id="rect3014-7"
       width="433.47012"
       height="87.798988"
       x="162.77251"
       y="972.11957" />
    <rect
       style="fill:#000000;fill-opacity:0.69803922;fill-rule:nonzero;stroke:none;display:inline"
       id="rect3014-1-6"
       width="860.06012"
       height="91.798988"
       x="595.94409"
       y="972.46271" />
    <rect
       style="fill:#ffff00;fill-opacity:0.69803922;display:inline"
       id="rect3131-2"
       width="856.93311"
       height="18"
       x="596.09338"
       y="965.36218" />
    <rect
       style="fill:#0000ff;fill-opacity:0.69803922;display:inline"
       id="rect3194-0-9"
       width="755.95929"
       height="38.201012"
       x="16.343578"
       y="822.36218" />
    <rect
       style="fill:#ff0000;fill-opacity:0.69803922;fill-rule:nonzero;stroke:none;display:inline"
       id="rect3014-7-0"
       width="350.03152"
       height="87.798988"
       x="1440.6763"
       y="977.29114" />
    <rect
       style="fill:#000000;fill-opacity:0.69803922;fill-rule:nonzero;stroke:none;display:inline"
       id="rect3014-1-6-0"
       width="415.70566"
       height="91.798988"
       x="1782.5392"
       y="970.46271" />
    <rect
       style="fill:#ff0000;fill-opacity:0.69803922;fill-rule:nonzero;stroke:none;display:inline"
       id="rect3014-7-0-9"
       width="356.85995"
       height="79.313705"
       x="2191.875"
       y="974.948" />
    <rect
       style="fill:#000000;fill-opacity:0.69803922;fill-rule:nonzero;stroke:none;display:inline"
       id="rect3014-8-1"
       width="283.46002"
       height="269.39194"
       x="2105.9929"
       y="569.1662" />
    <rect
       style="fill:#000000;fill-opacity:0.69803922;fill-rule:nonzero;stroke:none;display:inline"
       id="rect3014-1-6-0-1"
       width="551.47015"
       height="91.798988"
       x="2554.2649"
       y="962.46265" />
    <rect
       style="fill:#000000;fill-opacity:0.69803922;fill-rule:nonzero;stroke:none;display:inline"
       id="rect3014-1-6-0-1-9"
       width="47.470154"
       height="1053.799"
       x="2658.2649"
       y="0.46270582" />
    <rect
       style="fill:#0000ff;fill-opacity:0.69803922;display:inline"
       id="rect3194-0-9-5-8-5"
       width="281"
       height="314.24979"
       x="2386.5"
       y="530.11237" />
    <rect
       style="fill:#000000;fill-opacity:0.69803922;display:inline"
       id="rect3516-9-2-3"
       width="188"
       height="50.5"
       x="637"
       y="550.11206" />
    <rect
       style="fill:#ffff00;fill-opacity:0.69803922;display:inline"
       id="rect3131-2-5"
       width="278.51978"
       height="18"
       x="2106.3899"
       y="562.1864" />
    <rect
       style="fill:#0000ff;fill-opacity:0.69803922;display:inline"
       id="rect3194-0-9-2"
       width="1371.1422"
       height="49.514721"
       x="1298.5706"
       y="828.20074" />
    <rect
       style="fill:#1a1a1a;fill-opacity:0.69803922;fill-rule:nonzero;stroke:none;display:inline"
       id="rect4560"
       width="764.61615"
       height="28"
       x="4.5298724"
       y="810.948" />
    <rect
       style="fill:#1a1a1a;fill-opacity:0.69803922;fill-rule:nonzero;stroke:none;display:inline"
       id="rect4560-2"
       width="275.38269"
       height="28"
       x="2107.6174"
       y="819.36218" />
    <rect
       style="fill:#1a1a1a;fill-opacity:0.69803922;fill-rule:nonzero;stroke:none;display:inline"
       id="rect4560-5"
       width="583.5968"
       height="28"
       x="1297.0706"
       y="814.91644" />
    <path
       sodipodi:type="arc"
       style="fill:#00ff00;fill-opacity:0.69803922;display:inline"
       id="path3034-1-8-1"
       sodipodi:cx="-162"
       sodipodi:cy="1156.3622"
       sodipodi:rx="15"
       sodipodi:ry="15"
       d="m -147,1156.3622 a 15,15 0 1 1 -30,0 15,15 0 1 1 30,0 z"
       transform="translate(2159.9995,-429.35952)"
       inkscape:export-filename="C:\Users\pc\git\jmpy\levels\walljump2.png"
       inkscape:export-xdpi="90"
       inkscape:export-ydpi="90" />
    <rect
       style="fill:#000000;fill-opacity:0.69803922;display:inline"
       id="rect3516-9-2-3-1"
       width="1050.6703"
       height="310.7153"
       x="830.89563"
       y="286.06427" />
    <rect
       style="fill:#ffff00;fill-opacity:0.69803922;display:inline"
       id="rect3131-2-5-7"
       width="781.9798"
       height="18"
       x="1083.9099"
       y="264.45642" />
    <path
       transform="translate(1006.9201,-422.84987)"
       sodipodi:type="arc"
       style="fill:#ff0000;fill-opacity:0.69803922;display:inline"
       id="path3876-1-4"
       sodipodi:cx="534.57269"
       sodipodi:cy="697.39459"
       sodipodi:rx="43.840618"
       sodipodi:ry="43.840618"
       d="m 578.41331,697.39459 a 43.840618,43.840618 0 1 1 -87.68124,0 43.840618,43.840618 0 1 1 87.68124,0 z"
       inkscape:export-filename="/home/pierre-ubuntu/git/jmpy/rect3103.png"
       inkscape:export-xdpi="90"
       inkscape:export-ydpi="90" />
    <path
       transform="translate(565.68546,-425.67829)"
       sodipodi:type="arc"
       style="fill:#ff0000;fill-opacity:0.69803922;display:inline"
       id="path3876-1-4-0"
       sodipodi:cx="534.57269"
       sodipodi:cy="697.39459"
       sodipodi:rx="43.840618"
       sodipodi:ry="43.840618"
       d="m 578.41331,697.39459 a 43.840618,43.840618 0 1 1 -87.68124,0 43.840618,43.840618 0 1 1 87.68124,0 z"
       inkscape:export-filename="/home/pierre-ubuntu/git/jmpy/rect3103.png"
       inkscape:export-xdpi="90"
       inkscape:export-ydpi="90" />
    <path
       transform="translate(265.87218,-400.22245)"
       sodipodi:type="arc"
       style="fill:#ff0000;fill-opacity:0.69803922;display:inline"
       id="path3876-1-4-0-9"
       sodipodi:cx="534.57269"
       sodipodi:cy="697.39459"
       sodipodi:rx="43.840618"
       sodipodi:ry="43.840618"
       d="m 578.41331,697.39459 a 43.840618,43.840618 0 1 1 -87.68124,0 43.840618,43.840618 0 1 1 87.68124,0 z"
       inkscape:export-filename="/home/pierre-ubuntu/git/jmpy/rect3103.png"
       inkscape:export-xdpi="90"
       inkscape:export-ydpi="90" />
    <path
       transform="translate(56.568575,-360.62448)"
       sodipodi:type="arc"
       style="fill:#ff0000;fill-opacity:0.69803922;display:inline"
       id="path3876-1-4-0-9-8"
       sodipodi:cx="534.57269"
       sodipodi:cy="697.39459"
       sodipodi:rx="43.840618"
       sodipodi:ry="43.840618"
       d="m 578.41331,697.39459 a 43.840618,43.840618 0 1 1 -87.68124,0 43.840618,43.840618 0 1 1 87.68124,0 z"
       inkscape:export-filename="/home/pierre-ubuntu/git/jmpy/rect3103.png"
       inkscape:export-xdpi="90"
       inkscape:export-ydpi="90" />
    <path
       transform="translate(-79.19593,-487.9037)"
       sodipodi:type="arc"
       style="fill:#ff0000;fill-opacity:0.69803922;display:inline"
       id="path3876-1-4-0-4-8"
       sodipodi:cx="534.57269"
       sodipodi:cy="697.39459"
       sodipodi:rx="43.840618"
       sodipodi:ry="43.840618"
       d="m 578.41331,697.39459 a 43.840618,43.840618 0 1 1 -87.68124,0 43.840618,43.840618 0 1 1 87.68124,0 z"
       inkscape:export-filename="/home/pierre-ubuntu/git/jmpy/rect3103.png"
       inkscape:export-xdpi="90"
       inkscape:export-ydpi="90" />
    <path
       transform="translate(158.39195,-411.53616)"
       sodipodi:type="arc"
       style="fill:#ff0000;fill-opacity:0.69803922;display:inline"
       id="path3876-1-4-0-4-8-2"
       sodipodi:cx="534.57269"
       sodipodi:cy="697.39459"
       sodipodi:rx="43.840618"
       sodipodi:ry="43.840618"
       d="m 578.41331,697.39459 a 43.840618,43.840618 0 1 1 -87.68124,0 43.840618,43.840618 0 1 1 87.68124,0 z"
       inkscape:export-filename="/home/pierre-ubuntu/git/jmpy/rect3103.png"
       inkscape:export-xdpi="90"
       inkscape:export-ydpi="90" />
    <path
       transform="translate(121.6224,-598.21235)"
       sodipodi:type="arc"
       style="fill:#ff0000;fill-opacity:0.69803922;display:inline"
       id="path3876-1-4-0-4-8-4"
       sodipodi:cx="534.57269"
       sodipodi:cy="697.39459"
       sodipodi:rx="43.840618"
       sodipodi:ry="43.840618"
       d="m 578.41331,697.39459 a 43.840618,43.840618 0 1 1 -87.68124,0 43.840618,43.840618 0 1 1 87.68124,0 z"
       inkscape:export-filename="/home/pierre-ubuntu/git/jmpy/rect3103.png"
       inkscape:export-xdpi="90"
       inkscape:export-ydpi="90" />
    <path
       transform="translate(-172.53402,-346.48234)"
       sodipodi:type="arc"
       style="fill:#ff0000;fill-opacity:0.69803922;display:inline"
       id="path3876-1-4-0-4-8-4-5"
       sodipodi:cx="534.57269"
       sodipodi:cy="697.39459"
       sodipodi:rx="43.840618"
       sodipodi:ry="43.840618"
       d="m 578.41331,697.39459 a 43.840618,43.840618 0 1 1 -87.68124,0 43.840618,43.840618 0 1 1 87.68124,0 z"
       inkscape:export-filename="/home/pierre-ubuntu/git/jmpy/rect3103.png"
       inkscape:export-xdpi="90"
       inkscape:export-ydpi="90" />
    <rect
       style="fill:#ff0000;fill-opacity:0.69803922;fill-rule:nonzero;stroke:none;display:inline"
       id="rect3014-7-0-3"
       width="201.47012"
       height="389.79901"
       x="1897.2649"
       y="577.46265" />
  </g>
</svg>
