<?xml version="1.0" encoding="UTF-8" standalone="no"?>
<!-- Created with Inkscape (http://www.inkscape.org/) -->

<svg
   xmlns:dc="http://purl.org/dc/elements/1.1/"
   xmlns:cc="http://creativecommons.org/ns#"
   xmlns:rdf="http://www.w3.org/1999/02/22-rdf-syntax-ns#"
   xmlns:svg="http://www.w3.org/2000/svg"
   xmlns="http://www.w3.org/2000/svg"
   xmlns:sodipodi="http://sodipodi.sourceforge.net/DTD/sodipodi-0.dtd"
   xmlns:inkscape="http://www.inkscape.org/namespaces/inkscape"
   width="210mm"
   height="297mm"
   id="svg2"
   version="1.1"
   inkscape:version="0.91 r13725"
   inkscape:export-filename="D:\git\jmpy3\jmpy\levels\level17.png"
   inkscape:export-xdpi="90"
   inkscape:export-ydpi="90"
   sodipodi:docname="17_niveau 11.svg">
  <defs
     id="defs4" />
  <sodipodi:namedview
     id="base"
     pagecolor="#ffffff"
     bordercolor="#666666"
     borderopacity="1.0"
     inkscape:pageopacity="0.0"
     inkscape:pageshadow="2"
     inkscape:zoom="0.70710678"
     inkscape:cx="896.43202"
     inkscape:cy="862.30554"
     inkscape:document-units="px"
     inkscape:current-layer="layer1"
     showgrid="false"
     showguides="true"
     inkscape:guide-bbox="true"
     inkscape:window-width="1440"
     inkscape:window-height="848"
     inkscape:window-x="-8"
     inkscape:window-y="-8"
     inkscape:window-maximized="1"
     inkscape:snap-grids="false">
    <sodipodi:guide
       orientation="0,1"
       position="872.56977,552.9575"
       id="guide2992" />
    <sodipodi:guide
       orientation="0,1"
       position="377.59502,1053.5891"
       id="guide3924" />
  </sodipodi:namedview>
  <metadata
     id="metadata7">
    <rdf:RDF>
      <cc:Work
         rdf:about="">
        <dc:format>image/svg+xml</dc:format>
        <dc:type
           rdf:resource="http://purl.org/dc/dcmitype/StillImage" />
        <dc:title />
      </cc:Work>
    </rdf:RDF>
  </metadata>
  <g
     inkscape:label="Calque 1"
     inkscape:groupmode="layer"
     id="layer1"
     style="display:inline">
    <rect
       id="rect3103"
       width="22"
       height="829.30872"
       x="1.4090195"
       y="0.49707031"
       style="fill:#000000;fill-opacity:0.69803922"
       inkscape:export-xdpi="90"
       inkscape:export-ydpi="90"
       inkscape:export-filename="C:\Users\pc\git\jmpy\tuto1.png" />
    <rect
       style="fill:#000000;fill-opacity:0.69803922"
       id="rect3875"
       width="14"
       height="331.58768"
       x="3110.7617"
       y="61.745106"
       inkscape:export-filename="C:\Users\pc\git\jmpy\tuto1.png"
       inkscape:export-xdpi="90"
       inkscape:export-ydpi="90" />
    <rect
       style="fill:#000000;fill-opacity:0.69803922"
       id="rect3877"
       width="1390.3925"
       height="20"
       x="1.5819473"
       y="828.30554"
       inkscape:export-filename="C:\Users\pc\git\jmpy\tuto1.png"
       inkscape:export-xdpi="90"
       inkscape:export-ydpi="90" />
    <rect
       style="fill:#00ff00;fill-opacity:0.69803922;display:inline"
       id="rect3937"
       width="22"
       height="26"
       x="55.240601"
       y="133.91333"
       inkscape:export-filename="C:\Users\pc\git\jmpy\tuto1.png"
       inkscape:export-xdpi="90"
       inkscape:export-ydpi="90" />
    <rect
       style="fill:#008000;fill-opacity:0.69803921999999996;display:inline"
       id="rect3937-0"
       width="30"
       height="30"
       x="30.66803"
       y="722.95557"
       inkscape:export-filename="C:\Users\pc\git\jmpy\tuto1.png"
       inkscape:export-xdpi="90"
       inkscape:export-ydpi="90" />
    <rect
       style="fill:#000000;fill-opacity:0.69803922;display:inline"
       id="rect3534"
       width="19.485281"
       height="65.600502"
       x="-650.97894"
       y="738.6955"
       inkscape:export-filename="C:\Users\pc\git\jmpy\tuto1.png"
       inkscape:export-xdpi="90"
       inkscape:export-ydpi="90" />
    <rect
       style="fill:#000000;fill-opacity:0.69803922;display:inline"
       id="rect3929-7-1"
       width="188.7872"
       height="73.718506"
       x="6.8904419"
       y="757.52612"
       inkscape:export-filename="C:\Users\pc\git\jmpy\tuto1.png"
       inkscape:export-xdpi="90"
       inkscape:export-ydpi="90" />
    <rect
       id="rect3103-4"
       width="22"
       height="842.03662"
       x="1372.8601"
       y="4.6813431"
       style="fill:#000000;fill-opacity:0.69803922;display:inline"
       inkscape:export-xdpi="90"
       inkscape:export-ydpi="90"
       inkscape:export-filename="C:\Users\pc\git\jmpy\tuto1.png" />
    <rect
       style="fill:#000000;fill-opacity:0.69803922;display:inline"
       id="rect3590-2"
       width="295.34271"
       height="11.82886"
       x="-739.80994"
       y="651.69489"
       inkscape:export-filename="C:\Users\pc\git\jmpy\tuto1.png"
       inkscape:export-xdpi="90"
       inkscape:export-ydpi="90" />
    <rect
       style="fill:#000000;fill-opacity:0.69803922;display:inline"
       id="rect3590-1-4"
       width="419.79401"
       height="11.828598"
       x="-497.27258"
       y="838.17316" />
    <rect
       style="fill:#000000;fill-opacity:0.69803922;display:inline"
       id="rect3929-7-1-7"
       width="230.11929"
       height="62.404797"
       x="692.34625"
       y="766.40332"
       inkscape:export-filename="C:\Users\pc\git\jmpy\tuto1.png"
       inkscape:export-xdpi="90"
       inkscape:export-ydpi="90" />
    <path
       sodipodi:type="arc"
       style="fill:#ff0000;fill-opacity:0.19607843;fill-rule:nonzero;stroke:none"
       id="path3083"
       sodipodi:cx="879.64081"
       sodipodi:cy="390.51022"
       sodipodi:rx="38.183765"
       sodipodi:ry="38.183765"
       d="m 917.82457,390.51022 a 38.183765,38.183765 0 1 1 -76.36753,0 38.183765,38.183765 0 1 1 76.36753,0 z"
       transform="translate(-1199.2001,12.318758)"
       inkscape:transform-center-x="-323.85491"
       inkscape:transform-center-y="12.727922" />
    <rect
       style="fill:#ff0000;fill-opacity:0.69803922;display:inline"
       id="rect3929-7-1-7-1"
       width="515.79041"
       height="62.404797"
       x="188.99628"
       y="783.3739"
       inkscape:export-filename="C:\Users\pc\git\jmpy\tuto1.png"
       inkscape:export-xdpi="90"
       inkscape:export-ydpi="90" />
    <rect
       style="fill:#808000;fill-opacity:0.69803923;fill-rule:nonzero;stroke:none"
       id="rect3257"
       width="63.639606"
       height="59.396973"
       x="422.84985"
       y="719.82397" />
    <rect
       style="fill:#ff0000;fill-opacity:0.69803922;display:inline"
       id="rect3929-7-1-7-1-7"
       width="515.79041"
       height="62.404797"
       x="879.13251"
       y="781.95966"
       inkscape:export-filename="C:\Users\pc\git\jmpy\tuto1.png"
       inkscape:export-xdpi="90"
       inkscape:export-ydpi="90" />
    <rect
       style="fill:#808000;fill-opacity:0.69803923;fill-rule:nonzero;stroke:none;display:inline"
       id="rect3257-1"
       width="63.639606"
       height="59.396973"
       x="996.31348"
       y="613.75787" />
    <rect
       style="fill:#808000;fill-opacity:0.69803923;fill-rule:nonzero;stroke:none;display:inline"
       id="rect3257-1-5"
       width="63.639606"
       height="59.396973"
       x="228.56201"
       y="211.97911" />
    <rect
       style="fill:#808000;fill-opacity:0.69803923;fill-rule:nonzero;stroke:none;display:inline"
       id="rect3257-1-5-2"
       width="63.639606"
       height="59.396973"
       x="828.74988"
       y="479.10614" />
    <rect
       style="fill:#808000;fill-opacity:0.69803923;fill-rule:nonzero;stroke:none;display:inline"
       id="rect3257-1-5-2-7"
       width="63.639606"
       height="59.396973"
       x="654.23309"
       y="346.93964" />
    <rect
       style="fill:#000000;fill-opacity:0.69803922;display:inline"
       id="rect3929-7-1-7-6"
       width="619.02802"
       height="22.806816"
       x="754.6817"
       y="306.06311"
       inkscape:export-filename="C:\Users\pc\git\jmpy\tuto1.png"
       inkscape:export-xdpi="90"
       inkscape:export-ydpi="90" />
    <path
       sodipodi:type="arc"
       style="fill:#ff0000;fill-opacity:0.19607843;fill-rule:nonzero;stroke:none;display:inline"
       id="path3083-1"
       sodipodi:cx="879.64081"
       sodipodi:cy="390.51022"
       sodipodi:rx="38.183765"
       sodipodi:ry="38.183765"
       d="m 917.82457,390.51022 a 38.183765,38.183765 0 1 1 -76.36753,0 38.183765,38.183765 0 1 1 76.36753,0 z"
       transform="translate(265.85494,-77.36961)"
       inkscape:transform-center-x="-323.85491"
       inkscape:transform-center-y="12.727922" />
    <path
       sodipodi:type="arc"
       style="fill:#ff0000;fill-opacity:0.19607843;fill-rule:nonzero;stroke:none;display:inline"
       id="path3083-1-4"
       sodipodi:cx="879.64081"
       sodipodi:cy="390.51022"
       sodipodi:rx="38.183765"
       sodipodi:ry="38.183765"
       d="m 917.82457,390.51022 a 38.183765,38.183765 0 1 1 -76.36753,0 38.183765,38.183765 0 1 1 76.36753,0 z"
       transform="translate(43.20314,-73.71276)"
       inkscape:transform-center-x="-323.85491"
       inkscape:transform-center-y="12.727922" />
    <path
       sodipodi:type="arc"
       style="fill:#ff0000;fill-opacity:0.19607843;fill-rule:nonzero;stroke:none;display:inline"
       id="path3083-1-4-2"
       sodipodi:cx="879.64081"
       sodipodi:cy="390.51022"
       sodipodi:rx="38.183765"
       sodipodi:ry="38.183765"
       d="m 917.82457,390.51022 a 38.183765,38.183765 0 1 1 -76.36753,0 38.183765,38.183765 0 1 1 76.36753,0 z"
       transform="translate(163.44578,-199.19299)"
       inkscape:transform-center-x="-323.85491"
       inkscape:transform-center-y="12.727922" />
    <rect
       style="fill:#00ff00;fill-opacity:0.69803921999999996;display:inline"
       id="rect3937-1"
       width="22"
       height="26"
       x="1338.1598"
       y="273.27057"
       inkscape:export-filename="C:\Users\pc\git\jmpy\tuto1.png"
       inkscape:export-xdpi="90"
       inkscape:export-ydpi="90" />
    <rect
       style="fill:#000000;fill-opacity:0.69803922;display:inline"
       id="rect3516-1"
       width="20.458574"
       height="148.5"
       x="761.91406"
       y="157.86832"
       inkscape:export-filename="C:\Users\pc\git\jmpy\tuto1.png"
       inkscape:export-xdpi="90"
       inkscape:export-ydpi="90" />
    <rect
       style="fill:#000000;fill-opacity:0.69803922;display:inline"
       id="rect3929-7-1-7-6-7"
       width="1391.1886"
       height="22.806816"
       x="0.19874102"
       y="0.097583845"
       inkscape:export-filename="C:\Users\pc\git\jmpy\tuto1.png"
       inkscape:export-xdpi="90"
       inkscape:export-ydpi="90" />
    <rect
       style="fill:#808000;fill-opacity:0.69803923;display:inline"
       id="rect3516-1-4"
       width="20.458574"
       height="148.5"
       x="753.42883"
       y="159.28255"
       inkscape:export-filename="C:\Users\pc\git\jmpy\tuto1.png"
       inkscape:export-xdpi="90"
       inkscape:export-ydpi="90" />
    <rect
       style="fill:#000000;fill-opacity:0.69803922;display:inline"
       id="rect3516-1-0"
       width="20.458574"
       height="148.5"
       x="275.24799"
       y="16.710392"
       inkscape:export-filename="C:\Users\pc\git\jmpy\tuto1.png"
       inkscape:export-xdpi="90"
       inkscape:export-ydpi="90" />
    <rect
       style="fill:#808000;fill-opacity:0.69803922;display:inline"
       id="rect3516-1-4-9"
       width="19.044361"
       height="148.5"
       x="282.17697"
       y="18.124638"
       inkscape:export-filename="C:\Users\pc\git\jmpy\tuto1.png"
       inkscape:export-xdpi="90"
       inkscape:export-ydpi="90" />
  </g>
</svg>
