{
  "profiles": {
    "menu.api": {
      "commandName": "Project",
      "launchBrowser": true,
      "environmentVariables": {
        "ASPNETCORE_ENVIRONMENT": "Development"
      },
      "applicationUrl": "https://localhost:52092;http://localhost:52097"
    }
  }
}