Rack := {R2}.
Frame := {F1, F2}.
Module := {M1}.
Element := {E2}.
module14 := {M1}.
typeOfR := {R2 -> RackSingle}.
typeOfM := {M1 -> ModuleI}.
typeOfE := {E2 -> ElementA}.
rackOfF := {F1 -> R2, F2 -> R2}.
frameOfM := {M1 -> F1}.
elementOfM := {M1 -> E2}.
mulRack_T := {R1 -> 0, R2 -> 1}.
mulFrame_T := {F1 -> 1, F2 -> 3}.
mulModule_T := {M1 -> 1, M2 -> 0}.
mulElement_T := {E1 -> 0, E2 -> 1}.

0.247 Expansion
-------------------
Rack_T := {1}.
Frame_T := {2, 3, 4, 5}.
Module_T := {6}.
Element_T := {7}.
Rack := {1}.
Frame := {2, 3, 4, 5}.
Module := {6}.
Element := {7}.
module14 := {6}.
typeOfR := {1 -> RackSingle}.
typeOfM := {6 -> ModuleI}.
typeOfE := {7 -> ElementA}.
rackOfF := {2 -> 1, 3 -> 1, 4 -> 1, 5 -> 1}.
frameOfM := {6 -> 2}.
elementOfM := {6 -> 7}.
-------------------
Elapsed time: 0.3754s (Parse: 0.1134s | Ground: 0s | Solve: 0s)
