Rack := {R1}.
Frame := {F2, F3, F4}.
Module := {M1, M2, M3, M4, M5}.
Element := {E1, E2, E5, E7}.
module14 := {M1, M2, M4, M5}.
typeOfR := {R1 -> RackSingle}.
typeOfM := {M1 -> ModuleIV, M2 -> ModuleI, M3 -> ModuleV, M4 -> ModuleII, M5 -> ModuleIII}.
typeOfE := {E1 -> ElementA, E2 -> ElementC, E5 -> ElementB, E7 -> ElementD}.
rackOfF := {F2 -> R1, F3 -> R1, F4 -> R1}.
frameOfM := {M1 -> F3, M2 -> F3, M3 -> F2, M4 -> F2, M5 -> F4}.
elementOfM := {M1 -> E7, M2 -> E1, M4 -> E5, M5 -> E2}.
mulRack_T := {R1 -> 5}.
mulFrame_T := {F1 -> 0, F2 -> 10, F3 -> 5, F4 -> 5}.
mulModule_T := {M1 -> 20, M2 -> 5, M3 -> 10, M4 -> 10, M5 -> 15}.
mulElement_T := {E1 -> 5, E2 -> 5, E3 -> 0, E4 -> 0, E5 -> 5, E6 -> 0, E7 -> 5}.

2.21 Expansion
-------------------
Rack_T := {1, 2, 3, 4, 5}.
Frame_T := {6, 7, 8, 9, 10, 11, 12, 13, 14, 15, 16, 17, 18, 19, 20, 21, 22, 23, 24, 25}.
Module_T := {26, 27, 28, 29, 30, 31, 32, 33, 34, 35, 36, 37, 38, 39, 40, 41, 42, 43, 44, 45, 46, 47, 48, 49, 50, 51, 52, 53, 54, 55, 56, 57, 58, 59, 60, 61, 62, 63, 64, 65, 66, 67, 68, 69, 70, 71, 72, 73, 74, 75, 76, 77, 78, 79, 80, 81, 82, 83, 84, 85}.
Element_T := {86, 87, 88, 89, 90, 91, 92, 93, 94, 95, 96, 97, 98, 99, 100, 101, 102, 103, 104, 105}.
Rack := {1, 2, 3, 4, 5}.
Frame := {6, 7, 8, 9, 10, 11, 12, 13, 14, 15, 16, 17, 18, 19, 20, 21, 22, 23, 24, 25}.
Module := {26, 27, 28, 29, 30, 31, 32, 33, 34, 35, 36, 37, 38, 39, 40, 41, 42, 43, 44, 45, 46, 47, 48, 49, 50, 51, 52, 53, 54, 55, 56, 57, 58, 59, 60, 61, 62, 63, 64, 65, 66, 67, 68, 69, 70, 71, 72, 73, 74, 75, 76, 77, 78, 79, 80, 81, 82, 83, 84, 85}.
Element := {86, 87, 88, 89, 90, 91, 92, 93, 94, 95, 96, 97, 98, 99, 100, 101, 102, 103, 104, 105}.
module14 := {26, 27, 28, 29, 30, 31, 32, 33, 34, 35, 36, 37, 38, 39, 40, 41, 42, 43, 44, 45, 46, 47, 48, 49, 50, 61, 62, 63, 64, 65, 66, 67, 68, 69, 70, 71, 72, 73, 74, 75, 76, 77, 78, 79, 80, 81, 82, 83, 84, 85}.
typeOfR := {1 -> RackSingle, 2 -> RackSingle, 3 -> RackSingle, 4 -> RackSingle, 5 -> RackSingle}.
typeOfM := {26 -> ModuleIV, 27 -> ModuleIV, 28 -> ModuleIV, 29 -> ModuleIV, 30 -> ModuleIV, 31 -> ModuleIV, 32 -> ModuleIV, 33 -> ModuleIV, 34 -> ModuleIV, 35 -> ModuleIV, 36 -> ModuleIV, 37 -> ModuleIV, 38 -> ModuleIV, 39 -> ModuleIV, 40 -> ModuleIV, 41 -> ModuleIV, 42 -> ModuleIV, 43 -> ModuleIV, 44 -> ModuleIV, 45 -> ModuleIV, 46 -> ModuleI, 47 -> ModuleI, 48 -> ModuleI, 49 -> ModuleI, 50 -> ModuleI, 51 -> ModuleV, 52 -> ModuleV, 53 -> ModuleV, 54 -> ModuleV, 55 -> ModuleV, 56 -> ModuleV, 57 -> ModuleV, 58 -> ModuleV, 59 -> ModuleV, 60 -> ModuleV, 61 -> ModuleII, 62 -> ModuleII, 63 -> ModuleII, 64 -> ModuleII, 65 -> ModuleII, 66 -> ModuleII, 67 -> ModuleII, 68 -> ModuleII, 69 -> ModuleII, 70 -> ModuleII, 71 -> ModuleIII, 72 -> ModuleIII, 73 -> ModuleIII, 74 -> ModuleIII, 75 -> ModuleIII, 76 -> ModuleIII, 77 -> ModuleIII, 78 -> ModuleIII, 79 -> ModuleIII, 80 -> ModuleIII, 81 -> ModuleIII, 82 -> ModuleIII, 83 -> ModuleIII, 84 -> ModuleIII, 85 -> ModuleIII}.
typeOfE := {86 -> ElementA, 87 -> ElementA, 88 -> ElementA, 89 -> ElementA, 90 -> ElementA, 91 -> ElementC, 92 -> ElementC, 93 -> ElementC, 94 -> ElementC, 95 -> ElementC, 96 -> ElementB, 97 -> ElementB, 98 -> ElementB, 99 -> ElementB, 100 -> ElementB, 101 -> ElementD, 102 -> ElementD, 103 -> ElementD, 104 -> ElementD, 105 -> ElementD}.
rackOfF := {6 -> 1, 7 -> 2, 8 -> 3, 9 -> 4, 10 -> 5, 11 -> 1, 12 -> 2, 13 -> 3, 14 -> 4, 15 -> 5, 16 -> 1, 17 -> 2, 18 -> 3, 19 -> 4, 20 -> 5, 21 -> 1, 22 -> 2, 23 -> 3, 24 -> 4, 25 -> 5}.
frameOfM := {26 -> 16, 27 -> 17, 28 -> 18, 29 -> 19, 30 -> 20, 31 -> 16, 32 -> 17, 33 -> 18, 34 -> 19, 35 -> 20, 36 -> 16, 37 -> 17, 38 -> 18, 39 -> 19, 40 -> 20, 41 -> 16, 42 -> 17, 43 -> 18, 44 -> 19, 45 -> 20, 46 -> 16, 47 -> 17, 48 -> 18, 49 -> 19, 50 -> 20, 51 -> 6, 52 -> 7, 53 -> 8, 54 -> 9, 55 -> 10, 56 -> 11, 57 -> 12, 58 -> 13, 59 -> 14, 60 -> 15, 61 -> 6, 62 -> 7, 63 -> 8, 64 -> 9, 65 -> 10, 66 -> 11, 67 -> 12, 68 -> 13, 69 -> 14, 70 -> 15, 71 -> 21, 72 -> 22, 73 -> 23, 74 -> 24, 75 -> 25, 76 -> 21, 77 -> 22, 78 -> 23, 79 -> 24, 80 -> 25, 81 -> 21, 82 -> 22, 83 -> 23, 84 -> 24, 85 -> 25}.
elementOfM := {26 -> 101, 27 -> 102, 28 -> 103, 29 -> 104, 30 -> 105, 31 -> 101, 32 -> 102, 33 -> 103, 34 -> 104, 35 -> 105, 36 -> 101, 37 -> 102, 38 -> 103, 39 -> 104, 40 -> 105, 41 -> 101, 42 -> 102, 43 -> 103, 44 -> 104, 45 -> 105, 46 -> 86, 47 -> 87, 48 -> 88, 49 -> 89, 50 -> 90, 61 -> 96, 62 -> 97, 63 -> 98, 64 -> 99, 65 -> 100, 66 -> 96, 67 -> 97, 68 -> 98, 69 -> 99, 70 -> 100, 71 -> 91, 72 -> 92, 73 -> 93, 74 -> 94, 75 -> 95, 76 -> 91, 77 -> 92, 78 -> 93, 79 -> 94, 80 -> 95, 81 -> 91, 82 -> 92, 83 -> 93, 84 -> 94, 85 -> 95}.
-------------------
Elapsed time: 2.3618s (Parse: 0.1397s | Ground: 0s | Solve: 0s)
