Rack := {R2}.
Frame := {F1, F2}.
Module := {M1, M2}.
Element := {E1, E2}.
module14 := {M1, M2}.
typeOfR := {R2 -> RackDouble}.
typeOfM := {M1 -> ModuleI, M2 -> ModuleI}.
typeOfE := {E1 -> ElementA, E2 -> ElementA}.
rackOfF := {F1 -> R2, F2 -> R2}.
frameOfM := {M1 -> F2, M2 -> F2}.
elementOfM := {M1 -> E1, M2 -> E2}.
mulRack_T := {R1 -> 0, R2 -> 1}.
mulFrame_T := {F1 -> 7, F2 -> 1}.
mulModule_T := {M1 -> 2, M2 -> 3}.
mulElement_T := {E1 -> 2, E2 -> 3}.

0.216 Expansion
-------------------
Rack_T := {1}.
Frame_T := {2, 3, 4, 5, 6, 7, 8, 9}.
Module_T := {10, 11, 12, 13, 14}.
Element_T := {15, 16, 17, 18, 19}.
Rack := {1}.
Frame := {2, 3, 4, 5, 6, 7, 8, 9}.
Module := {10, 11, 12, 13, 14}.
Element := {15, 16, 17, 18, 19}.
module14 := {10, 11, 12, 13, 14}.
typeOfR := {1 -> RackDouble}.
typeOfM := {10 -> ModuleI, 11 -> ModuleI, 12 -> ModuleI, 13 -> ModuleI, 14 -> ModuleI}.
typeOfE := {15 -> ElementA, 16 -> ElementA, 17 -> ElementA, 18 -> ElementA, 19 -> ElementA}.
rackOfF := {2 -> 1, 3 -> 1, 4 -> 1, 5 -> 1, 6 -> 1, 7 -> 1, 8 -> 1, 9 -> 1}.
frameOfM := {10 -> 9, 11 -> 9, 12 -> 9, 13 -> 9, 14 -> 9}.
elementOfM := {10 -> 15, 11 -> 16, 12 -> 17, 13 -> 18, 14 -> 19}.
-------------------
Elapsed time: 0.3758s (Parse: 0.144s | Ground: 0s | Solve: 0s)
