mulG := {1 -> 9, 2 -> 9, 3 -> 9, 4 -> 9, 5 -> 9, 6 -> 9, 7 -> 9, 8 -> 9, 9 -> 9, 10 -> 9, 11 -> 9, 12 -> 9, 13 -> 9, 14 -> 9, 15 -> 9, 16 -> 9}.
mulFS := {1 -> 9, 2 -> 9, 3 -> 9, 4 -> 9, 5 -> 9, 6 -> 9, 7 -> 9, 8 -> 9}.
G := {1, 2, 3, 4, 5, 6, 7, 8, 9, 10, 11, 12, 13, 14, 15, 16}.
FS := {1, 2, 3, 4, 5, 6, 7, 8}.
f := {1 -> 1, 2 -> 5, 3 -> 9, 4 -> 13, 5 -> 1, 6 -> 2, 7 -> 3, 8 -> 4}.
s := {1 -> 2, 2 -> 6, 3 -> 10, 4 -> 14, 5 -> 7, 6 -> 5, 7 -> 6, 8 -> 8}.
t := {1 -> 3, 2 -> 7, 3 -> 11, 4 -> 15, 5 -> 9, 6 -> 11, 7 -> 12, 8 -> 10}.
ff := {1 -> 4, 2 -> 8, 3 -> 12, 4 -> 16, 5 -> 13, 6 -> 15, 7 -> 16, 8 -> 14}.
week := {1 -> 1, 2 -> 1, 3 -> 1, 4 -> 1, 5 -> 2, 6 -> 2, 7 -> 2, 8 -> 2}.
