Thing := {T1, T2}.
Cabinet := {C1, C2}.
Room := {R1, R2}.
ownerOfT := {T1 -> P2, T2 -> P1}.
cabinetOfT := {T1 -> C1, T2 -> C2}.
roomOfC := {C1 -> R1, C2 -> R2}.
ownerOfR := {R1 -> P2, R2 -> P1}.
mulThing_T := {T1 -> 3, T2 -> 15, T3 -> 0}.
mulCabinet_T := {C1 -> 3, C2 -> 3}.
mulRoom_T := {R1 -> 1, R2 -> 1}.

0.112 Expansion
-------------------
Thing_T := {1, 2, 3, 4, 5, 6, 7, 8, 9, 10, 11, 12, 13, 14, 15, 16, 17, 18}.
Cabinet_T := {19, 20, 21, 22, 23, 24}.
Room_T := {25, 26}.
Thing := {1, 2, 3, 4, 5, 6, 7, 8, 9, 10, 11, 12, 13, 14, 15, 16, 17, 18}.
Cabinet := {19, 20, 21, 22, 23, 24}.
Room := {25, 26}.
ownerOfT := {1 -> P2, 2 -> P2, 3 -> P2, 4 -> P1, 5 -> P1, 6 -> P1, 7 -> P1, 8 -> P1, 9 -> P1, 10 -> P1, 11 -> P1, 12 -> P1, 13 -> P1, 14 -> P1, 15 -> P1, 16 -> P1, 17 -> P1, 18 -> P1}.
cabinetOfT := {1 -> 19, 2 -> 20, 3 -> 21, 4 -> 22, 5 -> 23, 6 -> 24, 7 -> 22, 8 -> 23, 9 -> 24, 10 -> 22, 11 -> 23, 12 -> 24, 13 -> 22, 14 -> 23, 15 -> 24, 16 -> 22, 17 -> 23, 18 -> 24}.
roomOfC := {19 -> 25, 20 -> 25, 21 -> 25, 22 -> 26, 23 -> 26, 24 -> 26}.
ownerOfR := {25 -> P2, 26 -> P1}.
-------------------
Elapsed time: 0.177s (Parse: 0.0568s | Ground: 0s | Solve: 0s)
