El := {1}.
A := {1}.
B := {1}.
C := {}.
mulEl_T := {1 -> 2}.

0.032 Expansion
-------------------
El_T := {1, 2}.
El := {1, 2}.
A := {1, 2}.
B := {1, 2}.
C := {}.
-------------------
Elapsed time: 0.0602s (Parse: 0.0209s | Ground: 0s | Solve: 0s)
