Monkey := {M1, M2}.
Banana := {B1, B2}.
Tree := {T1, T2}.
ownerOfB := {B1 -> M1, B2 -> M2}.
treeOfM := {M1 -> T1, M2 -> T2}.
partnerOfM := {M1 -> M2, M2 -> M1}.
mulMonkey_T := {M1 -> 3, M2 -> 3, M3 -> 0}.
mulBanana_T := {B1 -> 6, B2 -> 6}.
mulTree_T := {T1 -> 1, T2 -> 1, T3 -> 0}.

0.115 Expansion
-------------------
Monkey_T := {1, 2, 3, 4, 5, 6}.
Banana_T := {7, 8, 9, 10, 11, 12, 13, 14, 15, 16, 17, 18}.
Tree_T := {19, 20}.
Monkey := {1, 2, 3, 4, 5, 6}.
Banana := {7, 8, 9, 10, 11, 12, 13, 14, 15, 16, 17, 18}.
Tree := {19, 20}.
ownerOfB := {7 -> 1, 8 -> 2, 9 -> 3, 10 -> 1, 11 -> 2, 12 -> 3, 13 -> 4, 14 -> 5, 15 -> 6, 16 -> 4, 17 -> 5, 18 -> 6}.
treeOfM := {1 -> 19, 2 -> 19, 3 -> 19, 4 -> 20, 5 -> 20, 6 -> 20}.
partnerOfM := {1 -> 4, 2 -> 5, 3 -> 6, 4 -> 1, 5 -> 2, 6 -> 3}.
-------------------
Elapsed time: 0.1782s (Parse: 0.0539s | Ground: 0s | Solve: 0s)
