Section := {1, 2}.
Element := {3, 4, 5, 6, 7}.
Module := {8, 9, 10, 11, 12}.
slot := {13, 14, 15, 16, 17, 18, 19, 20, 21, 22}.
Rack := {23, 24}.
UNUSED := {25, 26, 27, 28}.
SofE := {3 -> 1, 4 -> 1, 5 -> 1, 6 -> 1, 7 -> 2}.
EofM := {8 -> 4, 9 -> 3, 10 -> 7, 11 -> 5, 12 -> 6}.
Mofs := {13 -> 11, 14 -> 8, 15 -> 8, 16 -> 9, 17 -> 10, 18 -> 10, 19 -> 12, 20 -> 9, 21 -> 12, 22 -> 11}.
Rofs := {13 -> 24, 14 -> 23, 15 -> 24, 16 -> 23, 17 -> 23, 18 -> 24, 19 -> 23, 20 -> 23, 21 -> 24, 22 -> 24}.
SofR := {23 -> 1, 24 -> 2}.
maxSection := 3.
maxElement := 8.
maxModule := 13.
maxslot := 23.
maxRack := 25.
maxUNUSED := 29.
typeConfigObject := {1 -> Section__, 2 -> Section__, 3 -> Element__, 4 -> Element__, 5 -> Element__, 6 -> Element__, 7 -> Element__, 8 -> Module__, 9 -> Module__, 10 -> Module__, 11 -> Module__, 12 -> Module__, 13 -> slot__, 14 -> slot__, 15 -> slot__, 16 -> slot__, 17 -> slot__, 18 -> slot__, 19 -> slot__, 20 -> slot__, 21 -> slot__, 22 -> slot__, 23 -> Rack__, 24 -> Rack__, 25 -> UNUSED__, 26 -> UNUSED__, 27 -> UNUSED__, 28 -> UNUSED__}.

9.85 Expansion
-------------------
ConfigObject := {}.
Section := {1, 2}.
Element := {3, 4, 5, 6, 7}.
Module := {8, 9, 10, 11, 12}.
slot := {13, 14, 15, 16, 17, 18, 19, 20, 21, 22}.
Rack := {23, 24}.
UNUSED := {25, 26, 27, 28}.
SofE := {3 -> 1, 4 -> 1, 5 -> 1, 6 -> 1, 7 -> 2}.
EofM := {8 -> 4, 9 -> 3, 10 -> 7, 11 -> 5, 12 -> 6}.
Mofs := {13 -> 11, 14 -> 8, 15 -> 8, 16 -> 9, 17 -> 10, 18 -> 10, 19 -> 12, 20 -> 9, 21 -> 12, 22 -> 11}.
Rofs := {13 -> 24, 14 -> 23, 15 -> 24, 16 -> 23, 17 -> 23, 18 -> 24, 19 -> 23, 20 -> 23, 21 -> 24, 22 -> 24}.
SofR := {23 -> 1, 24 -> 2}.
typeConfigObject := {1 -> Section__, 2 -> Section__, 3 -> Element__, 4 -> Element__, 5 -> Element__, 6 -> Element__, 7 -> Element__, 8 -> Module__, 9 -> Module__, 10 -> Module__, 11 -> Module__, 12 -> Module__, 13 -> slot__, 14 -> slot__, 15 -> slot__, 16 -> slot__, 17 -> slot__, 18 -> slot__, 19 -> slot__, 20 -> slot__, 21 -> slot__, 22 -> slot__, 23 -> Rack__, 24 -> Rack__, 25 -> UNUSED__, 26 -> UNUSED__, 27 -> UNUSED__, 28 -> UNUSED__}.
-------------------
Elapsed time: 9.9364s (Parse: 0.0708s | Ground: 0s | Solve: 0s)
