Rack := {R1}.
Frame := {F1, F2, F3}.
Module := {M1, M2, M3, M4, M6}.
Element := {E1, E3, E10, E12}.
module14 := {M1, M2, M4, M6}.
typeOfR := {R1 -> RackSingle}.
typeOfM := {M1 -> ModuleII, M2 -> ModuleIV, M3 -> ModuleV, M4 -> ModuleI, M6 -> ModuleIII}.
typeOfE := {E1 -> ElementA, E3 -> ElementC, E10 -> ElementB, E12 -> ElementD}.
rackOfF := {F1 -> R1, F2 -> R1, F3 -> R1}.
frameOfM := {M1 -> F3, M2 -> F3, M3 -> F3, M4 -> F1, M6 -> F2}.
elementOfM := {M1 -> E10, M2 -> E12, M4 -> E1, M6 -> E3}.
mulRack_T := {R1 -> 5}.
mulFrame_T := {F1 -> 5, F2 -> 5, F3 -> 10}.
mulModule_T := {M1 -> 10, M2 -> 20, M3 -> 10, M4 -> 5, M5 -> 0, M6 -> 15}.
mulElement_T := {E1 -> 5, E2 -> 0, E3 -> 5, E4 -> 0, E5 -> 0, E6 -> 0, E7 -> 0, E8 -> 0, E9 -> 0, E10 -> 5, E11 -> 0, E12 -> 5, E13 -> 0}.

9.538 Expansion
-------------------
Rack_T := {1, 2, 3, 4, 5}.
Frame_T := {6, 7, 8, 9, 10, 11, 12, 13, 14, 15, 16, 17, 18, 19, 20, 21, 22, 23, 24, 25}.
Module_T := {26, 27, 28, 29, 30, 31, 32, 33, 34, 35, 36, 37, 38, 39, 40, 41, 42, 43, 44, 45, 46, 47, 48, 49, 50, 51, 52, 53, 54, 55, 56, 57, 58, 59, 60, 61, 62, 63, 64, 65, 66, 67, 68, 69, 70, 71, 72, 73, 74, 75, 76, 77, 78, 79, 80, 81, 82, 83, 84, 85}.
Element_T := {86, 87, 88, 89, 90, 91, 92, 93, 94, 95, 96, 97, 98, 99, 100, 101, 102, 103, 104, 105}.
Rack := {1, 2, 3, 4, 5}.
Frame := {6, 7, 8, 9, 10, 11, 12, 13, 14, 15, 16, 17, 18, 19, 20, 21, 22, 23, 24, 25}.
Module := {26, 27, 28, 29, 30, 31, 32, 33, 34, 35, 36, 37, 38, 39, 40, 41, 42, 43, 44, 45, 46, 47, 48, 49, 50, 51, 52, 53, 54, 55, 56, 57, 58, 59, 60, 61, 62, 63, 64, 65, 66, 67, 68, 69, 70, 71, 72, 73, 74, 75, 76, 77, 78, 79, 80, 81, 82, 83, 84, 85}.
Element := {86, 87, 88, 89, 90, 91, 92, 93, 94, 95, 96, 97, 98, 99, 100, 101, 102, 103, 104, 105}.
module14 := {26, 27, 28, 29, 30, 31, 32, 33, 34, 35, 36, 37, 38, 39, 40, 41, 42, 43, 44, 45, 46, 47, 48, 49, 50, 51, 52, 53, 54, 55, 66, 67, 68, 69, 70, 71, 72, 73, 74, 75, 76, 77, 78, 79, 80, 81, 82, 83, 84, 85}.
typeOfR := {1 -> RackSingle, 2 -> RackSingle, 3 -> RackSingle, 4 -> RackSingle, 5 -> RackSingle}.
typeOfM := {26 -> ModuleII, 27 -> ModuleII, 28 -> ModuleII, 29 -> ModuleII, 30 -> ModuleII, 31 -> ModuleII, 32 -> ModuleII, 33 -> ModuleII, 34 -> ModuleII, 35 -> ModuleII, 36 -> ModuleIV, 37 -> ModuleIV, 38 -> ModuleIV, 39 -> ModuleIV, 40 -> ModuleIV, 41 -> ModuleIV, 42 -> ModuleIV, 43 -> ModuleIV, 44 -> ModuleIV, 45 -> ModuleIV, 46 -> ModuleIV, 47 -> ModuleIV, 48 -> ModuleIV, 49 -> ModuleIV, 50 -> ModuleIV, 51 -> ModuleIV, 52 -> ModuleIV, 53 -> ModuleIV, 54 -> ModuleIV, 55 -> ModuleIV, 56 -> ModuleV, 57 -> ModuleV, 58 -> ModuleV, 59 -> ModuleV, 60 -> ModuleV, 61 -> ModuleV, 62 -> ModuleV, 63 -> ModuleV, 64 -> ModuleV, 65 -> ModuleV, 66 -> ModuleI, 67 -> ModuleI, 68 -> ModuleI, 69 -> ModuleI, 70 -> ModuleI, 71 -> ModuleIII, 72 -> ModuleIII, 73 -> ModuleIII, 74 -> ModuleIII, 75 -> ModuleIII, 76 -> ModuleIII, 77 -> ModuleIII, 78 -> ModuleIII, 79 -> ModuleIII, 80 -> ModuleIII, 81 -> ModuleIII, 82 -> ModuleIII, 83 -> ModuleIII, 84 -> ModuleIII, 85 -> ModuleIII}.
typeOfE := {86 -> ElementA, 87 -> ElementA, 88 -> ElementA, 89 -> ElementA, 90 -> ElementA, 91 -> ElementC, 92 -> ElementC, 93 -> ElementC, 94 -> ElementC, 95 -> ElementC, 96 -> ElementB, 97 -> ElementB, 98 -> ElementB, 99 -> ElementB, 100 -> ElementB, 101 -> ElementD, 102 -> ElementD, 103 -> ElementD, 104 -> ElementD, 105 -> ElementD}.
rackOfF := {6 -> 1, 7 -> 2, 8 -> 3, 9 -> 4, 10 -> 5, 11 -> 1, 12 -> 2, 13 -> 3, 14 -> 4, 15 -> 5, 16 -> 1, 17 -> 2, 18 -> 3, 19 -> 4, 20 -> 5, 21 -> 1, 22 -> 2, 23 -> 3, 24 -> 4, 25 -> 5}.
frameOfM := {26 -> 16, 27 -> 17, 28 -> 18, 29 -> 19, 30 -> 20, 31 -> 21, 32 -> 22, 33 -> 23, 34 -> 24, 35 -> 25, 36 -> 16, 37 -> 17, 38 -> 18, 39 -> 19, 40 -> 20, 41 -> 21, 42 -> 22, 43 -> 23, 44 -> 24, 45 -> 25, 46 -> 16, 47 -> 17, 48 -> 18, 49 -> 19, 50 -> 20, 51 -> 21, 52 -> 22, 53 -> 23, 54 -> 24, 55 -> 25, 56 -> 16, 57 -> 17, 58 -> 18, 59 -> 19, 60 -> 20, 61 -> 21, 62 -> 22, 63 -> 23, 64 -> 24, 65 -> 25, 66 -> 6, 67 -> 7, 68 -> 8, 69 -> 9, 70 -> 10, 71 -> 11, 72 -> 12, 73 -> 13, 74 -> 14, 75 -> 15, 76 -> 11, 77 -> 12, 78 -> 13, 79 -> 14, 80 -> 15, 81 -> 11, 82 -> 12, 83 -> 13, 84 -> 14, 85 -> 15}.
elementOfM := {26 -> 96, 27 -> 97, 28 -> 98, 29 -> 99, 30 -> 100, 31 -> 96, 32 -> 97, 33 -> 98, 34 -> 99, 35 -> 100, 36 -> 101, 37 -> 102, 38 -> 103, 39 -> 104, 40 -> 105, 41 -> 101, 42 -> 102, 43 -> 103, 44 -> 104, 45 -> 105, 46 -> 101, 47 -> 102, 48 -> 103, 49 -> 104, 50 -> 105, 51 -> 101, 52 -> 102, 53 -> 103, 54 -> 104, 55 -> 105, 66 -> 86, 67 -> 87, 68 -> 88, 69 -> 89, 70 -> 90, 71 -> 91, 72 -> 92, 73 -> 93, 74 -> 94, 75 -> 95, 76 -> 91, 77 -> 92, 78 -> 93, 79 -> 94, 80 -> 95, 81 -> 91, 82 -> 92, 83 -> 93, 84 -> 94, 85 -> 95}.
-------------------
Elapsed time: 9.6993s (Parse: 0.1466s | Ground: 0s | Solve: 0s)
