mulG := {1 -> 11, 2 -> 11, 3 -> 11, 4 -> 11, 5 -> 11, 6 -> 11, 7 -> 11, 8 -> 11, 9 -> 11, 10 -> 11, 11 -> 11, 12 -> 11, 13 -> 11, 14 -> 11, 15 -> 11, 16 -> 11}.
mulFS := {1 -> 11, 2 -> 11, 3 -> 11, 4 -> 11, 5 -> 11, 6 -> 11, 7 -> 11, 8 -> 11, 9 -> 11, 10 -> 11, 11 -> 11, 12 -> 11}.
G := {1, 2, 3, 4, 5, 6, 7, 8, 9, 10, 11, 12, 13, 14, 15, 16}.
FS := {1, 2, 3, 4, 5, 6, 7, 8, 9, 10, 11, 12}.
f := {1 -> 1, 2 -> 5, 3 -> 9, 4 -> 13, 5 -> 1, 6 -> 2, 7 -> 3, 8 -> 4, 9 -> 1, 10 -> 2, 11 -> 3, 12 -> 4}.
s := {1 -> 2, 2 -> 6, 3 -> 10, 4 -> 14, 5 -> 8, 6 -> 5, 7 -> 7, 8 -> 6, 9 -> 6, 10 -> 8, 11 -> 5, 12 -> 7}.
t := {1 -> 3, 2 -> 7, 3 -> 11, 4 -> 15, 5 -> 11, 6 -> 9, 7 -> 10, 8 -> 12, 9 -> 9, 10 -> 10, 11 -> 12, 12 -> 11}.
ff := {1 -> 4, 2 -> 8, 3 -> 12, 4 -> 16, 5 -> 15, 6 -> 16, 7 -> 14, 8 -> 13, 9 -> 14, 10 -> 13, 11 -> 15, 12 -> 16}.
week := {1 -> 1, 2 -> 1, 3 -> 1, 4 -> 1, 5 -> 2, 6 -> 2, 7 -> 2, 8 -> 2, 9 -> 3, 10 -> 3, 11 -> 3, 12 -> 3}.
