Rack := {1}.
Frame := {2, 3, 4, 5}.
Module := {6, 7, 8, 9, 10, 11, 12, 13, 14, 15, 16}.
Element := {17, 18, 19, 20}.
module14 := {6, 7, 8, 9, 10, 11, 12, 13, 14, 15}.
typeOfR := {1 -> RackSingle}.
typeOfM := {6 -> ModuleIV, 7 -> ModuleIV, 8 -> ModuleIV, 9 -> ModuleIV, 10 -> ModuleIII, 11 -> ModuleIII, 12 -> ModuleII, 13 -> ModuleII, 14 -> ModuleIII, 15 -> ModuleI, 16 -> ModuleV}.
typeOfE := {17 -> ElementD, 18 -> ElementC, 19 -> ElementB, 20 -> ElementA}.
rackOfF := {2 -> 1, 3 -> 1, 4 -> 1, 5 -> 1}.
frameOfM := {6 -> 3, 7 -> 2, 8 -> 2, 9 -> 4, 10 -> 2, 11 -> 2, 12 -> 3, 13 -> 3, 14 -> 2, 15 -> 4, 16 -> 3}.
elementOfM := {6 -> 17, 7 -> 17, 8 -> 17, 9 -> 17, 10 -> 18, 11 -> 18, 12 -> 19, 13 -> 19, 14 -> 18, 15 -> 20}.
maxRack := 2.
maxFrame := 6.
maxModule := 17.
maxElement := 21.
typeConfigObject := {1 -> Rack__, 2 -> Frame__, 3 -> Frame__, 4 -> Frame__, 5 -> Frame__, 6 -> Module__, 7 -> Module__, 8 -> Module__, 9 -> Module__, 10 -> Module__, 11 -> Module__, 12 -> Module__, 13 -> Module__, 14 -> Module__, 15 -> Module__, 16 -> Module__, 17 -> Element__, 18 -> Element__, 19 -> Element__, 20 -> Element__}.

123.166 Expansion
-------------------
ConfigObject := {}.
Rack := {1}.
Frame := {2, 3, 4, 5}.
Module := {6, 7, 8, 9, 10, 11, 12, 13, 14, 15, 16}.
Element := {17, 18, 19, 20}.
module14 := {6, 7, 8, 9, 10, 11, 12, 13, 14, 15}.
typeOfR := {1 -> RackSingle}.
typeOfM := {6 -> ModuleIV, 7 -> ModuleIV, 8 -> ModuleIV, 9 -> ModuleIV, 10 -> ModuleIII, 11 -> ModuleIII, 12 -> ModuleII, 13 -> ModuleII, 14 -> ModuleIII, 15 -> ModuleI, 16 -> ModuleV}.
typeOfE := {17 -> ElementD, 18 -> ElementC, 19 -> ElementB, 20 -> ElementA}.
rackOfF := {2 -> 1, 3 -> 1, 4 -> 1, 5 -> 1}.
frameOfM := {6 -> 3, 7 -> 2, 8 -> 2, 9 -> 4, 10 -> 2, 11 -> 2, 12 -> 3, 13 -> 3, 14 -> 2, 15 -> 4, 16 -> 3}.
elementOfM := {6 -> 17, 7 -> 17, 8 -> 17, 9 -> 17, 10 -> 18, 11 -> 18, 12 -> 19, 13 -> 19, 14 -> 18, 15 -> 20}.
typeConfigObject := {1 -> Rack__, 2 -> Frame__, 3 -> Frame__, 4 -> Frame__, 5 -> Frame__, 6 -> Module__, 7 -> Module__, 8 -> Module__, 9 -> Module__, 10 -> Module__, 11 -> Module__, 12 -> Module__, 13 -> Module__, 14 -> Module__, 15 -> Module__, 16 -> Module__, 17 -> Element__, 18 -> Element__, 19 -> Element__, 20 -> Element__}.
-------------------
Elapsed time: 123.4466s (Parse: 0.1211s | Ground: 0s | Solve: 0s)
