mulG := {1 -> 2, 2 -> 2, 3 -> 2, 4 -> 2, 5 -> 2, 6 -> 2, 7 -> 2, 8 -> 2, 9 -> 2, 10 -> 2, 11 -> 2, 12 -> 2, 13 -> 2, 14 -> 2, 15 -> 2, 16 -> 2, 17 -> 2, 18 -> 2, 19 -> 2, 20 -> 2}.
mulGR := {1 -> 2, 2 -> 2, 3 -> 2, 4 -> 2, 5 -> 2}.
G := {1, 2, 3, 4, 5, 6, 7, 8, 9, 10, 11, 12, 13, 14, 15, 16, 17, 18, 19, 20}.
GR := {1, 2, 3, 4, 5}.
f := {(1, 1) -> 1, (1, 2) -> 5, (1, 3) -> 9, (1, 4) -> 13, (1, 5) -> 17, (2, 1) -> 1, (2, 2) -> 2, (2, 3) -> 3, (2, 4) -> 4, (2, 5) -> 8, (3, 1) -> 1, (3, 2) -> 2, (3, 3) -> 3, (3, 4) -> 4, (3, 5) -> 7}.
s := {(1, 1) -> 2, (1, 2) -> 6, (1, 3) -> 10, (1, 4) -> 14, (1, 5) -> 18, (2, 1) -> 6, (2, 2) -> 7, (2, 3) -> 5, (2, 4) -> 10, (2, 5) -> 9, (3, 1) -> 8, (3, 2) -> 6, (3, 3) -> 9, (3, 4) -> 5, (3, 5) -> 11}.
t := {(1, 1) -> 3, (1, 2) -> 7, (1, 3) -> 11, (1, 4) -> 15, (1, 5) -> 19, (2, 1) -> 11, (2, 2) -> 15, (2, 3) -> 12, (2, 4) -> 14, (2, 5) -> 16, (3, 1) -> 12, (3, 2) -> 10, (3, 3) -> 15, (3, 4) -> 16, (3, 5) -> 14}.
ff := {(1, 1) -> 4, (1, 2) -> 8, (1, 3) -> 12, (1, 4) -> 16, (1, 5) -> 20, (2, 1) -> 20, (2, 2) -> 17, (2, 3) -> 13, (2, 4) -> 18, (2, 5) -> 19, (3, 1) -> 18, (3, 2) -> 13, (3, 3) -> 20, (3, 4) -> 17, (3, 5) -> 19}.
