{
    "name": "GradientSensitivity_options",
    "required": [],
    "properties": {
        "iteration":{
            "type": "integer",
            "minimum":0
        },
        "scale_gradients": {
            "type": "boolean"
        }
    },
    "additionalProperties": false,
    "$schema": "http://json-schema.org/draft-04/schema",
    "type": "object"
}
