Division,WeightClassKg,Place,Name,Team,BodyweightKg,Best3SquatKg,Best3BenchKg,Best3DeadliftKg,TotalKg,Equipment,Event,Sex
Boys,51.71,1,Valentin Rocha,Friona,51.26,88.45,63.5,129.27,281.23,Single-ply,SBD,M
Boys,51.71,2,Cameron Wall,Bushland,51.26,102.06,56.7,120.2,278.96,Single-ply,SBD,M
Boys,51.71,3,Ever Trejo,Sunray,50.17,99.79,61.23,115.67,276.69,Single-ply,SBD,M
Boys,51.71,4,Lane Miller,Dalhart,46.72,92.99,38.56,102.06,233.6,Single-ply,SBD,M
Boys,51.71,5,Seth Simpson,Perryton,49.9,77.11,54.43,102.06,233.6,Single-ply,SBD,M
Boys,51.71,6,Devon Nolen,Stinnett West Texas,48.53,79.38,45.36,90.72,215.46,Single-ply,SBD,M
Boys,51.71,7,Andrew Yara,Perryton,51.71,68.04,43.09,88.45,199.58,Single-ply,SBD,M
Boys,55.79,1,Corey Barker,Clarendon,55.7,124.74,77.11,136.08,337.93,Single-ply,SBD,M
Boys,55.79,2,Joey Rios,Dumas,54.43,111.13,49.9,124.74,285.76,Single-ply,SBD,M
Boys,55.79,3,Ryan Bybee,Dumas,55.34,90.72,52.16,90.72,233.6,Single-ply,SBD,M
Boys,55.79,DQ,Sean Felker,Borger,55.79,90.72,70.31,,,Single-ply,SBD,M
Boys,55.79,DQ,Nolan Willingham,Canyon Randall,55.61,70.31,,,,Single-ply,SBD,M
Boys,59.87,1,Landen Hajje,Bushland,59.87,129.27,102.06,154.22,385.55,Single-ply,SBD,M
Boys,59.87,2,Michael Rivas,Dalhart,58.06,142.88,74.84,165.56,383.29,Single-ply,SBD,M
Boys,59.87,3,Kyle Stroud,Stinnett West Texas,59.87,120.2,72.57,147.42,340.19,Single-ply,SBD,M
Boys,59.87,4,Andrew Feese,Dumas,59.87,113.4,70.31,133.81,317.51,Single-ply,SBD,M
Boys,59.87,5,Cj Stillwell,Dalhart,58.97,92.99,65.77,124.74,283.5,Single-ply,SBD,M
Boys,59.87,6,Brady Miller,Clarendon,59.87,120.2,,,120.2,Single-ply,S,M
Boys,59.87,DQ,Brady Pitzer,Canyon Randall,59.78,,,,,Single-ply,S,M
Boys,59.87,DQ,Ernesto Muro,Perryton,58.97,142.88,,,,Single-ply,S,M
Boys,59.87,DQ,Jeremy Alaniz,Friona,58.97,124.74,,,,Single-ply,S,M
Boys,67.13,1,Jose Villalobos,Dalhart,62.6,158.76,83.91,172.37,415.04,Single-ply,SBD,M
Boys,67.13,2,Greg Carter #2,Dalhart,67.13,149.69,77.11,179.17,405.97,Single-ply,SBD,M
Boys,67.13,3,Dominic Baca,Dalhart,63.5,140.61,81.65,142.88,365.14,Single-ply,SBD,M
Boys,67.13,4,James Brown #6,Sunray,65.86,138.35,77.11,149.69,365.14,Single-ply,SBD,M
Boys,67.13,5,Kaleb Grant,Dalhart,62.6,129.27,79.38,142.88,351.53,Single-ply,SBD,M
Boys,67.13,6,Parker Owens,Canyon Randall,66.22,120.2,70.31,147.42,337.93,Single-ply,SBD,M
Boys,67.13,7,Cameron Barnes,Perryton,64.86,111.13,79.38,140.61,331.12,Single-ply,SBD,M
Boys,67.13,8,Omar Maldonado,Dumas,63.59,120.2,65.77,142.88,328.85,Single-ply,SBD,M
Boys,67.13,9,Miguel Carnero,Perryton,66.68,115.67,68.04,142.88,326.59,Single-ply,SBD,M
Boys,67.13,10,Jeff Hall,Perryton,67.13,108.86,70.31,142.88,322.05,Single-ply,SBD,M
Boys,67.13,11,Tyler Bybee,Dumas,61.69,102.06,70.31,147.42,319.78,Single-ply,SBD,M
Boys,67.13,12,Ernesto Uribe,Perryton,61.69,95.25,74.84,136.08,306.17,Single-ply,SBD,M
Boys,67.13,13,Graham Wilson,White Deer,63.5,113.4,72.57,113.4,299.37,Single-ply,SBD,M
Boys,67.13,14,Ryan West,Stinnett West Texas,60.78,102.06,68.04,120.2,290.3,Single-ply,SBD,M
Boys,67.13,15,Adrian Prieto,Friona,67.13,102.06,58.97,102.06,263.08,Single-ply,SBD,M
Boys,67.13,16,Cameron Wright,Clarendon,61.14,83.91,56.7,102.06,242.67,Single-ply,SBD,M
Boys,67.13,DQ,Ryan Baca,Canyon,66.32,158.76,,,,Single-ply,SBD,M
Boys,74.84,1,Tavish Lightner,Perryton,74.39,170.1,120.2,183.7,474,Single-ply,SBD,M
Boys,74.84,2,Serafin Vazquez,Friona,74.84,192.78,95.25,176.9,464.93,Single-ply,SBD,M
Boys,74.84,3,Adrian Ruiz,Dalhart,68.95,183.7,77.11,192.78,453.59,Single-ply,SBD,M
Boys,74.84,4,Nick Serna,Dumas,73.03,154.22,102.06,188.24,444.52,Single-ply,SBD,M
Boys,74.84,5,Logan Claborn,Dalhart,72.12,172.37,102.06,156.49,430.91,Single-ply,SBD,M
Boys,74.84,6,Landon Oelke,Dalhart,70.76,158.76,83.91,181.44,424.11,Single-ply,SBD,M
Boys,74.84,7,Adrian Pollares,Perryton,73.03,154.22,92.99,170.1,417.3,Single-ply,SBD,M
Boys,74.84,8,Jonathon Law,Dalhart,68.04,154.22,83.91,165.56,403.7,Single-ply,SBD,M
Boys,74.84,9,Tim Lott,Dalhart,74.84,149.69,77.11,165.56,392.36,Single-ply,SBD,M
Boys,74.84,10,Alberto Salgado,Dalhart,72.57,156.49,70.31,158.76,385.55,Single-ply,SBD,M
Boys,74.84,11,Andy Miller #1,Sunray,71.12,142.88,88.45,142.88,374.21,Single-ply,SBD,M
Boys,74.84,12,Nathan Ruiz,Dumas,73.03,140.61,83.91,149.69,374.21,Single-ply,SBD,M
Boys,74.84,13,Tony Dickey,Dumas,72.57,129.27,104.33,136.08,369.68,Single-ply,SBD,M
Boys,74.84,14,Clayton Topliff,Canyon Randall,72.12,138.35,77.11,142.88,358.34,Single-ply,SBD,M
Boys,74.84,15,Mackie Hall,White Deer,69.49,117.93,74.84,149.69,342.46,Single-ply,SBD,M
Boys,74.84,16,Victor Giron,Dumas,73.94,131.54,74.84,136.08,342.46,Single-ply,SBD,M
Boys,74.84,17,Eddy Romero,Perryton,68.04,108.86,74.84,147.42,331.12,Single-ply,SBD,M
Boys,74.84,18,Carrie Thompson,Canyon,70.58,136.08,63.5,124.74,324.32,Single-ply,SBD,M
Boys,74.84,19,Jesus Romero,Dumas,72.12,111.13,74.84,133.81,319.78,Single-ply,SBD,M
Boys,74.84,20,Jd Baxter,Clarendon,72.12,115.67,70.31,133.81,319.78,Single-ply,SBD,M
Boys,82.1,1,Josh Garcia #3,Perryton,78.02,183.7,127.01,204.12,514.83,Single-ply,SBD,M
Boys,82.1,2,Dylan Winkle,Borger,78.02,181.44,108.86,208.65,498.95,Single-ply,SBD,M
Boys,82.1,3,Steven Mendoza,Friona,82.1,204.12,99.79,190.51,494.42,Single-ply,SBD,M
Boys,82.1,4,Jansen Riddell,Canyon Randall,80.65,181.44,108.86,195.04,485.34,Single-ply,SBD,M
Boys,82.1,5,Shawn Lindsey,Sunray,79.83,183.7,113.4,176.9,474,Single-ply,SBD,M
Boys,82.1,6,John David Terry,Canyon,77.66,188.24,108.86,158.76,455.86,Single-ply,SBD,M
Boys,82.1,7,Tanner Arnold,Dumas,79.38,156.49,104.33,192.78,453.59,Single-ply,SBD,M
Boys,82.1,8,Pierce Browder,Canyon Randall,82.1,170.1,111.13,172.37,453.59,Single-ply,SBD,M
Boys,82.1,9,Isaac Moran,Dumas,77.56,163.29,92.99,185.97,442.25,Single-ply,SBD,M
Boys,82.1,10,Manuel Nanez,Sunray,78.02,165.56,104.33,149.69,419.57,Single-ply,SBD,M
Boys,82.1,11,Trent Daling,Dalhart,77.11,163.29,92.99,158.76,415.04,Single-ply,SBD,M
Boys,82.1,12,Josh Rich,Canyon Randall,80.74,133.81,92.99,149.69,376.48,Single-ply,SBD,M
Boys,82.1,13,Carson Moore,Canyon,78.47,120.2,88.45,158.76,367.41,Single-ply,SBD,M
Boys,82.1,14,Jacob McCary,Clarendon,78.38,127.01,83.91,147.42,358.34,Single-ply,SBD,M
Boys,82.1,15,Sabastian Santiago,Friona,79.83,129.27,79.38,138.35,347,Single-ply,SBD,M
Boys,82.1,16,Rowdy Speed,Clarendon,76.66,127.01,72.57,129.27,328.85,Single-ply,SBD,M
Boys,82.1,DQ,Clint Johnson,Canyon,82.1,120.2,,,,Single-ply,SBD,M
Boys,82.1,DQ,Jay Claxton,Bushland,76.66,,,,,Single-ply,SBD,M
Boys,82.1,DQ,JR Rodriguez,Bushland,81.65,113.4,,,,Single-ply,SBD,M
Boys,89.81,1,Duncan Welch,Friona,83.01,185.97,127.01,219.99,532.97,Single-ply,SBD,M
Boys,89.81,2,Adrian Merino,Friona,89.36,188.24,120.2,183.7,492.15,Single-ply,SBD,M
Boys,89.81,3,Cameron Litterell,Borger,84.82,167.83,129.27,176.9,474,Single-ply,SBD,M
Boys,89.81,4,Jake Reeves,Canyon Randall,86.18,170.1,106.59,183.7,460.4,Single-ply,SBD,M
Boys,89.81,5,Trenton Huseman,Canyon Randall,86.18,161.03,115.67,181.44,458.13,Single-ply,SBD,M
Boys,89.81,6,Jorge Lozoya,Sunray,82.64,181.44,95.25,179.17,455.86,Single-ply,SBD,M
Boys,89.81,7,Anthony Garcia,Canyon Randall,87.18,158.76,106.59,181.44,446.79,Single-ply,SBD,M
Boys,89.81,8,Brian Saavedra,Canyon Randall,86.64,161.03,92.99,183.7,437.72,Single-ply,SBD,M
Boys,89.81,9,Cory Carter,Stinnett West Texas,82.55,154.22,102.06,174.63,430.91,Single-ply,SBD,M
Boys,89.81,10,Kolby Ortiz,Dalhart,82.55,165.56,95.25,170.1,430.91,Single-ply,SBD,M
Boys,99.79,11,Jesus Rivero,Sunray,89.99,176.9,90.72,158.76,426.38,Single-ply,SBD,M
Boys,89.81,12,Dillon Johnson,Dumas,83.46,147.42,92.99,181.44,421.84,Single-ply,SBD,M
Boys,89.81,13,Josh Hull,Sunray,86.45,163.29,99.79,158.76,421.84,Single-ply,SBD,M
Boys,89.81,14,Keith Finley,Canyon,89.45,142.88,99.79,151.95,394.63,Single-ply,SBD,M
Boys,89.81,15,Zack Lewis,Stinnett West Texas,83.01,154.22,79.38,156.49,390.09,Single-ply,SBD,M
Boys,89.81,16,Teran Abeyta,Friona,87.72,140.61,65.77,147.42,353.8,Single-ply,SBD,M
Boys,89.81,DQ,Dylan Ewing,Stinnett West Texas,88.9,156.49,,,,Single-ply,SBD,M
Boys,89.81,DQ,Gerardo Uriquidiz,Sunray,85.46,165.56,,,,Single-ply,SBD,M
Boys,99.79,1,Homero Solano,Sunray,97.07,217.72,113.4,222.26,553.38,Single-ply,SBD,M
Boys,99.79,2,Hilario Hernandez,Friona,96.16,213.19,122.47,210.92,546.58,Single-ply,SBD,M
Boys,99.79,3,Brett Cummings,Stinnett West Texas,96.62,188.24,113.4,204.12,505.76,Single-ply,SBD,M
Boys,99.79,4,Trenton Merkel,Perryton,99.79,183.7,113.4,179.17,476.27,Single-ply,SBD,M
Boys,99.79,5,Shawn Garner,Borger,93.89,147.42,113.4,204.12,464.93,Single-ply,SBD,M
Boys,99.79,6,Blake Roberts,Canyon Randall,96.25,174.63,115.67,170.1,460.4,Single-ply,SBD,M
Boys,99.79,7,Caleb Lee,Canyon Randall,94.71,165.56,115.67,174.63,455.86,Single-ply,SBD,M
Boys,99.79,8,Colby McKinley,Perryton,93.89,167.83,111.13,174.63,453.59,Single-ply,SBD,M
Boys,99.79,9,Ashton Read,Dalhart,97.98,158.76,108.86,167.83,435.45,Single-ply,SBD,M
Boys,109.77,DQ,Steven Scott,Vega,99.97,,,,,Single-ply,SBD,M
Boys,99.79,DQ,Shane Atwood,Vega,96.16,,,,,Single-ply,SBD,M
Boys,99.79,DQ,Cameron Patterson,Dumas,97.98,,,,,Single-ply,SBD,M
Boys,109.77,1,Nivardo Miranda,Borger,100.7,192.78,108.86,181.44,483.08,Single-ply,SBD,M
Boys,109.77,2,Carlos García,Sunray,107.32,136.08,90.72,142.88,369.68,Single-ply,SBD,M
Boys,109.77,3,Kenny Childress,Canyon,108.77,124.74,92.99,147.42,365.14,Single-ply,SBD,M
Boys,109.77,4,Chris Shults,Clarendon,105.51,138.35,72.57,149.69,360.61,Single-ply,SBD,M
Boys,109.77,DQ,Manuel Garcia,Dumas,107.23,,,,,Single-ply,SBD,M
Boys,124.74,1,Ed Holguin,Dumas,111.95,249.48,142.88,226.8,619.15,Single-ply,SBD,M
Boys,124.74,2,O'Scotty Castro,Dalhart,116.12,242.67,117.93,229.06,589.67,Single-ply,SBD,M
Boys,124.74,3,Saul Barron,Dalhart,117.93,215.46,140.61,210.92,566.99,Single-ply,SBD,M
Boys,124.74,4,Bryan Flores,Friona,113.85,222.26,113.4,206.38,542.04,Single-ply,SBD,M
Boys,124.74,5,Sergio Mendez,Friona,110.31,204.12,120.2,208.65,532.97,Single-ply,SBD,M
Boys,124.74,6,Erasmo Mendoza,Dumas,112.04,206.38,124.74,195.04,526.17,Single-ply,SBD,M
Boys,124.74,7,Cesar Ruiz,Dumas,117.93,192.78,120.2,204.12,517.1,Single-ply,SBD,M
Boys,124.74,8,Cameron Ford,Dalhart,122.47,208.65,102.06,201.85,512.56,Single-ply,SBD,M
Boys,124.74,9,Cole Sieck,Canyon,120.84,136.08,102.06,158.76,396.89,Single-ply,SBD,M
Boys,124.74,10,Rj Trujillo,Dumas,116.57,142.88,95.25,136.08,374.21,Single-ply,SBD,M
Boys,124.74,11,Matt Abott,Canyon,121.29,142.88,61.23,136.08,340.19,Single-ply,SBD,M
Boys,124.74,12,Taylor Overton,Perryton,124.74,117.93,74.84,142.88,335.66,Single-ply,SBD,M
Boys,124.74,DQ,Bradley Boucher,Perryton,121.11,156.49,111.13,,,Single-ply,SBD,M
Boys,124.74,DQ,Brady Roye,White Deer,118.75,181.44,,,,Single-ply,SBD,M
Boys,124.74+,1,Clayton Smiley,Friona,141.97,278.96,131.54,222.26,632.76,Single-ply,SBD,M
Boys,124.74+,2,Gary Silacci,Dalhart,125.19,197.31,129.27,215.46,542.04,Single-ply,SBD,M
Boys,124.74+,3,Juan Delgado,Dalhart,125.19,192.78,111.13,204.12,508.02,Single-ply,SBD,M
Boys,124.74+,4,Sunny Bhakta,Perryton,126.1,174.63,113.4,188.24,476.27,Single-ply,SBD,M
Boys,124.74+,5,Jessie Enriquez,Perryton,125.19,161.03,108.86,165.56,435.45,Single-ply,SBD,M
Boys,124.74+,6,Brandon Grant,Bushland,133.36,156.49,83.91,149.69,390.09,Single-ply,SBD,M
Boys,124.74+,7,Kaleb Street,Dumas,135.17,136.08,79.38,158.76,374.21,Single-ply,SBD,M
Boys,124.74+,DQ,AJ Johnson #1,Canyon Randall,141.7,136.08,,,,Single-ply,SBD,M
