\addvspace {10\p@ }
\addvspace {10\p@ }
\addvspace {10\p@ }
\contentsline {figure}{\numberline {3.1}{\ignorespaces Visualization of blockchain}}{8}
\addvspace {10\p@ }
\addvspace {10\p@ }
\contentsline {figure}{\numberline {5.1}{\ignorespaces System components and their communication}}{17}
\addvspace {10\p@ }
\addvspace {10\p@ }
\addvspace {10\p@ }
\addvspace {10\p@ }
