module gitlab.com/pidrakin/go/slices

go 1.22

require (
	github.com/stretchr/testify v1.8.1
	golang.org/x/exp v0.0.0-20240222234643-814bf88cf225
)

require (
	github.com/davecgh/go-spew v1.1.1 // indirect
	github.com/pmezard/go-difflib v1.0.0 // indirect
	gopkg.in/yaml.v3 v3.0.1 // indirect
)
