module gitlab.com/picnic-app/backend/libs/golang/censorship

go 1.21

require (
	github.com/golang/mock v1.6.0
	github.com/stretchr/testify v1.8.4
	gitlab.com/picnic-app/backend/libs/golang/logger v0.3.1
	gitlab.com/picnic-app/backend/libs/golang/protobuf-registry v0.2.150
	go.uber.org/zap v1.26.0
	google.golang.org/grpc v1.59.0
)

require (
	github.com/beorn7/perks v1.0.1 // indirect
	github.com/cespare/xxhash/v2 v2.2.0 // indirect
	github.com/davecgh/go-spew v1.1.1 // indirect
	github.com/golang/protobuf v1.5.3 // indirect
	github.com/matttproud/golang_protobuf_extensions/v2 v2.0.0 // indirect
	github.com/pmezard/go-difflib v1.0.0 // indirect
	github.com/prometheus/client_golang v1.17.0 // indirect
	github.com/prometheus/client_model v0.5.0 // indirect
	github.com/prometheus/common v0.45.0 // indirect
	github.com/prometheus/procfs v0.12.0 // indirect
	go.opentelemetry.io/otel v1.20.0 // indirect
	go.opentelemetry.io/otel/trace v1.20.0 // indirect
	go.uber.org/multierr v1.11.0 // indirect
	golang.org/x/net v0.18.0 // indirect
	golang.org/x/sys v0.14.0 // indirect
	golang.org/x/text v0.14.0 // indirect
	google.golang.org/genproto/googleapis/rpc v0.0.0-20231106174013-bbf56f31fb17 // indirect
	google.golang.org/protobuf v1.31.0 // indirect
	gopkg.in/yaml.v3 v3.0.1 // indirect
)
