module gitlab.com/picnic-app/backend/classification-api

go 1.20

require (
	cloud.google.com/go/bigquery v1.51.2
	cloud.google.com/go/spanner v1.46.0
	github.com/forPelevin/gomoji v1.1.8
	github.com/google/uuid v1.3.0
	github.com/pkg/errors v0.9.1
	github.com/stretchr/testify v1.8.4
	gitlab.com/picnic-app/backend/libs/golang/config v0.3.1
	gitlab.com/picnic-app/backend/libs/golang/core v0.6.10
	gitlab.com/picnic-app/backend/libs/golang/cursor v0.2.0
	gitlab.com/picnic-app/backend/libs/golang/eventbus v0.6.10
	gitlab.com/picnic-app/backend/libs/golang/graceful v0.3.0
	gitlab.com/picnic-app/backend/libs/golang/logger v0.3.0
	gitlab.com/picnic-app/backend/libs/golang/monitoring v0.5.0
	gitlab.com/picnic-app/backend/libs/golang/protobuf-registry v0.2.45
	google.golang.org/grpc v1.56.0
)

require (
	cloud.google.com/go/vision/v2 v2.7.1 // indirect
	github.com/Masterminds/squirrel v1.5.4 // indirect
	github.com/andybalholm/brotli v1.0.4 // indirect
	github.com/apache/arrow/go/v12 v12.0.0 // indirect
	github.com/apache/thrift v0.16.0 // indirect
	github.com/goccy/go-json v0.9.11 // indirect
	github.com/golang/snappy v0.0.4 // indirect
	github.com/google/flatbuffers v2.0.8+incompatible // indirect
	github.com/klauspost/asmfmt v1.3.2 // indirect
	github.com/klauspost/compress v1.15.9 // indirect
	github.com/klauspost/cpuid/v2 v2.0.9 // indirect
	github.com/minio/asm2plan9s v0.0.0-20200509001527-cdd76441f9d8 // indirect
	github.com/minio/c2goasm v0.0.0-20190812172519-36a3d3bbc4f3 // indirect
	github.com/pierrec/lz4/v4 v4.1.15 // indirect
	github.com/zeebo/xxh3 v1.0.2 // indirect
	golang.org/x/mod v0.10.0 // indirect
	golang.org/x/tools v0.9.3 // indirect
	google.golang.org/genproto/googleapis/api v0.0.0-20230530153820-e85fd2cbaebc // indirect
	google.golang.org/genproto/googleapis/rpc v0.0.0-20230530153820-e85fd2cbaebc // indirect
)

require (
	cloud.google.com/go v0.110.2 // indirect
	cloud.google.com/go/compute v1.20.0 // indirect
	cloud.google.com/go/compute/metadata v0.2.3 // indirect
	cloud.google.com/go/iam v1.1.0 // indirect
	cloud.google.com/go/language v1.10.0
	cloud.google.com/go/longrunning v0.5.0 // indirect
	cloud.google.com/go/pubsub v1.31.0 // indirect
	cloud.google.com/go/videointelligence v1.11.0
	cloud.google.com/go/vision v1.2.0
	github.com/99designs/gqlgen v0.17.33 // indirect
	github.com/GoogleCloudPlatform/opentelemetry-operations-go/detectors/gcp v1.15.0 // indirect
	github.com/beorn7/perks v1.0.1 // indirect
	github.com/cenkalti/backoff/v4 v4.2.1 // indirect
	github.com/census-instrumentation/opencensus-proto v0.4.1 // indirect
	github.com/cespare/xxhash/v2 v2.2.0 // indirect
	github.com/cncf/udpa/go v0.0.0-20220112060539-c52dc94e7fbe // indirect
	github.com/cncf/xds/go v0.0.0-20230607035331-e9ce68804cb4 // indirect
	github.com/davecgh/go-spew v1.1.1 // indirect
	github.com/envoyproxy/go-control-plane v0.11.1 // indirect
	github.com/envoyproxy/protoc-gen-validate v1.0.1 // indirect
	github.com/felixge/httpsnoop v1.0.3 // indirect
	github.com/fsnotify/fsnotify v1.6.0 // indirect
	github.com/go-logr/logr v1.2.4 // indirect
	github.com/go-logr/stdr v1.2.2 // indirect
	github.com/golang/groupcache v0.0.0-20210331224755-41bb18bfe9da // indirect
	github.com/golang/protobuf v1.5.3 // indirect
	github.com/google/go-cmp v0.5.9 // indirect
	github.com/google/s2a-go v0.1.4 // indirect
	github.com/googleapis/enterprise-certificate-proxy v0.2.5 // indirect
	github.com/googleapis/gax-go/v2 v2.11.0 // indirect
	github.com/grpc-ecosystem/go-grpc-middleware v1.4.0 // indirect
	github.com/grpc-ecosystem/go-grpc-prometheus v1.2.0 // indirect
	github.com/grpc-ecosystem/grpc-gateway/v2 v2.16.0 // indirect
	github.com/hashicorp/hcl v1.0.0 // indirect
	github.com/lann/builder v0.0.0-20180802200727-47ae307949d0 // indirect
	github.com/lann/ps v0.0.0-20150810152359-62de8c46ede0 // indirect
	github.com/magiconair/properties v1.8.7 // indirect
	github.com/matttproud/golang_protobuf_extensions v1.0.4 // indirect
	github.com/mitchellh/mapstructure v1.5.0 // indirect
	github.com/opentracing/opentracing-go v1.2.0 // indirect
	github.com/pelletier/go-toml/v2 v2.0.8 // indirect
	github.com/pmezard/go-difflib v1.0.0 // indirect
	github.com/prometheus/client_golang v1.16.0 // indirect
	github.com/prometheus/client_model v0.4.0 // indirect
	github.com/prometheus/common v0.44.0 // indirect
	github.com/prometheus/procfs v0.11.0 // indirect
	github.com/rivo/uniseg v0.4.4 // indirect
	github.com/spf13/afero v1.9.5 // indirect
	github.com/spf13/cast v1.5.1 // indirect
	github.com/spf13/jwalterweatherman v1.1.0 // indirect
	github.com/spf13/pflag v1.0.5 // indirect
	github.com/spf13/viper v1.16.0 // indirect
	github.com/subosito/gotenv v1.4.2 // indirect
	github.com/vektah/gqlparser/v2 v2.5.3 // indirect
	go.opencensus.io v0.24.0 // indirect
	go.opentelemetry.io/contrib/detectors/gcp v1.17.0 // indirect
	go.opentelemetry.io/contrib/instrumentation/google.golang.org/grpc/otelgrpc v0.42.0 // indirect
	go.opentelemetry.io/contrib/instrumentation/net/http/otelhttp v0.42.0 // indirect
	go.opentelemetry.io/contrib/propagators/b3 v1.17.0 // indirect
	go.opentelemetry.io/contrib/propagators/opencensus v0.42.0 // indirect
	go.opentelemetry.io/otel v1.16.0 // indirect
	go.opentelemetry.io/otel/bridge/opencensus v0.39.0 // indirect
	go.opentelemetry.io/otel/exporters/otlp/internal/retry v1.16.0 // indirect
	go.opentelemetry.io/otel/exporters/otlp/otlptrace v1.16.0 // indirect
	go.opentelemetry.io/otel/exporters/otlp/otlptrace/otlptracegrpc v1.16.0 // indirect
	go.opentelemetry.io/otel/metric v1.16.0 // indirect
	go.opentelemetry.io/otel/sdk v1.16.0 // indirect
	go.opentelemetry.io/otel/sdk/metric v0.39.0 // indirect
	go.opentelemetry.io/otel/trace v1.16.0 // indirect
	go.opentelemetry.io/proto/otlp v0.20.0 // indirect
	go.uber.org/atomic v1.11.0 // indirect
	go.uber.org/multierr v1.11.0 // indirect
	go.uber.org/zap v1.24.0
	golang.org/x/crypto v0.10.0 // indirect
	golang.org/x/net v0.11.0 // indirect
	golang.org/x/oauth2 v0.9.0 // indirect
	golang.org/x/sync v0.3.0 // indirect
	golang.org/x/sys v0.9.0 // indirect
	golang.org/x/text v0.10.0 // indirect
	golang.org/x/xerrors v0.0.0-20220907171357-04be3eba64a2 // indirect
	google.golang.org/api v0.128.0
	google.golang.org/appengine v1.6.7 // indirect
	google.golang.org/genproto v0.0.0-20230530153820-e85fd2cbaebc // indirect
	google.golang.org/protobuf v1.30.0 // indirect
	gopkg.in/ini.v1 v1.67.0 // indirect
	gopkg.in/yaml.v3 v3.0.1 // indirect
)
