<mxfile host="app.diagrams.net" modified="2024-02-07T06:27:39.415Z" agent="Mozilla/5.0 (Windows NT 10.0; Win64; x64) AppleWebKit/537.36 (KHTML, like Gecko) Chrome/120.0.0.0 Safari/537.36" version="23.1.1" etag="t1cHG7MBBPXxV-PHp5oJ" type="gitlab">
  <diagram name="Страница — 1" id="m4zp-bVYzkUwf7ig_0Ev">
    <mxGraphModel>
      <root>
        <mxCell id="0" />
        <mxCell id="1" parent="0" />
      </root>
    </mxGraphModel>
  </diagram>
</mxfile>
