{
    "/api/auth/*": {
        "target": "http://localhost:3002",
        "secure": false,
        "logLevel": "debug"
    },

    "/api/user/*": {
        "target": "http://localhost:3002",
        "secure": false,
        "logLevel": "debug"
    },

    "/api/menu/*": {
        "target": "http://localhost:3002",
        "secure": false,
        "logLevel": "debug"
    }
}