{
  "file_generated_by": "FlutterFire CLI",
  "purpose": "FirebaseAppID & ProjectID for this Firebase app in this directory",
  "GOOGLE_APP_ID": "1:836658259919:ios:fe027ffe5fa191f624d4ba",
  "FIREBASE_PROJECT_ID": "rental-car-e7ce2",
  "GCM_SENDER_ID": "836658259919"
}