<?xml version="1.0" encoding="utf-8"?>
<!-- Generator: Adobe Illustrator 21.0.0, SVG Export Plug-In . SVG Version: 6.00 Build 0)  -->
<svg version="1.1" id="Calque_1" xmlns="http://www.w3.org/2000/svg" xmlns:xlink="http://www.w3.org/1999/xlink" x="0px" y="0px"
	 viewBox="0 0 60 60" style="enable-background:new 0 0 60 60;" xml:space="preserve">
<style type="text/css">
	.st0{fill:#FFFFFF;}
</style>
<title>ICONES BAS</title>
<g>
	<path class="st0" d="M45,17.5H15c-1.4,0-2.5,1.1-2.5,2.5v20c0,1.4,1.1,2.5,2.5,2.5h30c1.4,0,2.5-1.1,2.5-2.5V19.9
		C47.5,18.6,46.3,17.5,45,17.5z M46.7,40c0,1-0.8,1.7-1.7,1.7H15c-1,0-1.7-0.8-1.7-1.7V25.5h33.5L46.7,40L46.7,40z M46.7,21.9V22
		H13.3v-2.1c0-1,0.8-1.7,1.7-1.7h30c1,0,1.7,0.8,1.7,1.7V21.9z"/>
	<rect x="16.1" y="29.1" class="st0" width="19.3" height="1.7"/>
	<rect x="39.5" y="29.1" class="st0" width="4.2" height="1.7"/>
</g>
</svg>
