<?xml version="1.0" encoding="utf-8"?>
<!-- Generator: Adobe Illustrator 19.2.0, SVG Export Plug-In . SVG Version: 6.00 Build 0)  -->
<svg version="1.1" id="Calque_1" xmlns="http://www.w3.org/2000/svg" xmlns:xlink="http://www.w3.org/1999/xlink" x="0px" y="0px"
	 viewBox="0 0 24.8 20.2" style="enable-background:new 0 0 24.8 20.2;" xml:space="preserve">
<path d="M24.8,19.3l-1.7-5c-0.2-0.5-0.7-0.9-1.2-0.9h0l-7.6,0v-1.7l8.4,0l0-0.2c0,0,0-1.2-0.4-2.5c-0.8-2.3-2.4-3.3-3.6-3.7
	c-2.1-0.8-4.5-0.8-5.2-0.8c-0.1,0-0.2,0-0.2,0h0l0-1.5C13.6,2.7,14,2.1,14,1.5C14,0.7,13.3,0,12.5,0C11.6,0,11,0.7,11,1.5
	c0,0.6,0.4,1.2,0.9,1.4l0,1.5h0c0,0-0.1,0-0.2,0c-0.7,0-3.2,0.1-5.3,0.8C4.3,6.1,3.3,7.8,2.8,9c-0.5,1.3-0.4,2.5-0.4,2.5l0,0.2
	l8.4,0l0,1.7l-7.6,0c-0.5,0-1.1,0.4-1.2,0.9l-1.8,5c-0.2,0.5,0.1,0.9,0.6,0.9h0l23.5,0C24.6,20.2,24.9,19.8,24.8,19.3z M24.4,19.7
	c0,0-0.1,0.1-0.2,0.1l-23.5,0c-0.1,0-0.2,0-0.2-0.1c0,0,0-0.1,0-0.2l1.8-5c0.1-0.3,0.5-0.6,0.8-0.6l7.6,0v0l3.4,0v0l7.6,0h0
	c0.3,0,0.7,0.3,0.8,0.6l1.7,5C24.4,19.5,24.4,19.6,24.4,19.7z"/>
</svg>
