<?xml version="1.0" encoding="utf-8"?>
<!-- Generator: Adobe Illustrator 19.2.0, SVG Export Plug-In . SVG Version: 6.00 Build 0)  -->
<svg version="1.1" id="Calque_1" xmlns="http://www.w3.org/2000/svg" xmlns:xlink="http://www.w3.org/1999/xlink" x="0px" y="0px"
	 viewBox="0 0 18.9 26.5" style="enable-background:new 0 0 18.9 26.5;" xml:space="preserve">
<g>
	<path d="M11.4,11.2l-0.2,2.4c0,0.1,0.1,0.2,0.2,0.3c0.1,0,0.2,0,0.3,0l7.1-6.2c0.1,0,0.1-0.1,0.1-0.2c0-0.1,0-0.1-0.1-0.2l-6.2-7.1
		C12.5,0,12.4,0,12.3,0c-0.1,0-0.2,0.1-0.2,0.2L12,2.4c-0.5-0.1-1-0.1-1.6-0.1C4.7,2.2,0,6.9,0,12.7c0,0.3,0,0.8,0.1,1.2
		c0.1,0.8,0.1,0.9,0.2,0.9c0.1,0.1,0.1,0.1,0.2,0.1c0.1,0,0.1,0,0.2-0.1c3.2-3.2,6.4-3.9,8.6-3.9C10.3,10.9,11.1,11.1,11.4,11.2z"/>
	<path d="M18.9,12.7c-0.1-0.8-0.1-0.9-0.2-0.9c-0.1-0.1-0.1-0.1-0.2-0.1s-0.1,0-0.2,0.1c-3.2,3.2-6.4,3.9-8.6,3.9h0
		c-1.1,0-1.9-0.2-2.2-0.3L7.6,13c0-0.1-0.1-0.2-0.2-0.3c-0.1,0-0.2,0-0.3,0L0.1,19c-0.1,0.1-0.1,0.3,0,0.4l6.2,7.1
		c0.1,0.1,0.1,0.1,0.2,0.1c0,0,0.1,0,0.1,0c0.1,0,0.2-0.1,0.2-0.2l0.1-2.1c0.5,0.1,1,0.1,1.6,0.1h0c2.8,0,5.4-1.1,7.4-3
		c2-2,3.1-4.6,3.1-7.4C18.9,13.6,18.9,13.1,18.9,12.7z"/>
</g>
</svg>
