<?xml version="1.0" encoding="utf-8"?>
<!-- Generator: Adobe Illustrator 19.2.0, SVG Export Plug-In . SVG Version: 6.00 Build 0)  -->
<svg version="1.1" id="Calque_1" xmlns="http://www.w3.org/2000/svg" xmlns:xlink="http://www.w3.org/1999/xlink" x="0px" y="0px"
	 viewBox="0 0 22.4 20.3" style="enable-background:new 0 0 22.4 20.3;" xml:space="preserve">
<path d="M20.6,14.1c2.2-2.7,2.5-6.4,0.4-9.4c-3-4.4-9.8-5.9-15.2-3.5c-5.4,2.5-7.3,8-4.3,12.4c2.7,3.9,8.4,5.6,13.5,4.1
	c1.3,0.8,3.5,1.8,7.5,2.6C22.4,20.3,20.6,17.1,20.6,14.1z M11.7,14h-1.3v-1.3h1.3V14z M13.6,7.7c-0.3,1.1-1,1.6-1.4,1.9
	c-0.1,0.1-0.2,0.2-0.3,0.2c-0.3,0.2-0.4,0.7-0.4,1.4V12h-1l0-0.3l0-0.2c-0.1-1.2,0.2-2,0.7-2.5c0.1-0.1,0.3-0.2,0.4-0.3
	c0.4-0.3,0.8-0.6,1-1.3c0-0.1,0.1-0.5,0.1-0.6c0-0.9-0.7-1.6-1.6-1.6c-0.8,0-1.5,0.7-1.6,1.5l0,0.2h-1l0-0.3c0-1.4,1.2-2.5,2.5-2.5
	c1.4,0,2.6,1.1,2.6,2.6C13.7,7.1,13.7,7.5,13.6,7.7z"/>
</svg>
