<?xml version="1.0" encoding="UTF-8"?>
<svg width="47px" height="55px" viewBox="0 0 47 55" version="1.1" xmlns="http://www.w3.org/2000/svg" xmlns:xlink="http://www.w3.org/1999/xlink">
    <!-- Generator: Sketch 43 (38999) - http://www.bohemiancoding.com/sketch -->
    <title>Light</title>
    <desc>Created with Sketch.</desc>
    <defs></defs>
    <g id="WIREFRAME" stroke="none" stroke-width="1" fill="none" fill-rule="evenodd">
        <g id="RECYCLING-Desktop" transform="translate(-702.000000, -2937.000000)" fill="#FFFFFF">
            <g id="P1-COFFEE-QUALITY" transform="translate(0.000000, 2522.000000)">
                <g id="CONTENT">
                    <g id="MOISTURE" transform="translate(677.000000, 409.000000)">
                        <g id="Moisture" transform="translate(14.000000, 0.000000)">
                            <path d="M23.4705862,21.7536633 C23.298,21.7536633 23.1203563,21.8003798 22.9572529,21.9056477 C18.8328851,24.5473119 9.36845977,31.8400739 11.2428851,42.1706562 C12.1311034,47.06468 16.5538621,50.7758413 21.9198391,50.7758413 L21.947023,50.7758413 C28.3080575,50.7615149 32.183977,46.5775823 32.183977,40.6900536 C32.183977,32.6012419 22.820069,32.1178815 24.3682874,22.7191383 C24.4580575,22.174735 23.9870805,21.7536633 23.4705862,21.7536633 M21.7156437,25.8528832 C22.0816782,29.9035179 24.4017931,32.3651677 26.3451264,34.426301 C28.1942644,36.3890183 29.6552414,37.9381384 29.6552414,40.6900536 C29.6552414,45.3635754 26.6991494,48.2737039 21.9198391,48.2842929 C17.8643793,48.2842929 14.4208736,45.5286405 13.7317931,41.7327666 C12.4402414,34.6125443 17.6791494,29.0121665 21.7156437,25.8528832" id="Fill-1"></path>
                            <path d="M41.4767011,6.89712111 C41.4602644,6.89712111 41.4444598,6.90148132 41.4286552,6.91082463 C39.465092,8.08621256 33.9562414,12.9005068 34.5321609,19.0546313 C34.8400345,22.3509497 37.6342874,24.9041639 41.0632529,24.9041639 C41.3989425,24.9041639 41.7403218,24.8798713 42.0861264,24.8294174 C45.1762414,24.3772014 47.0171609,22.0669132 47.0171609,18.9474947 C47.0171609,14.0229494 40.5151494,13.8666047 41.8642299,7.81338802 C41.9116437,7.59911486 41.6815287,6.89712111 41.4767011,6.89712111 M39.5883678,11.9169681 C40.2654368,13.7862523 41.5980805,15.0494673 42.6177931,16.016188 C43.975092,17.3036957 44.4884253,17.8892095 44.4884253,18.9474947 C44.4884253,20.0718059 44.1280805,22.0120991 41.7150345,22.3646532 C41.4975632,22.3964205 41.2781954,22.4126155 41.0632529,22.4126155 C38.966931,22.4126155 37.241069,20.87097 37.0501494,18.8260317 C36.8585977,16.7792247 37.5413563,14.6751122 39.0794598,12.5728682 C39.2463563,12.3448916 39.4164138,12.1262582 39.5883678,11.9169681" id="Fill-3"></path>
                            <path d="M47.0632471,36.0803777 C46.8217529,36.0803777 46.6068103,36.2890449 46.6630747,36.5431828 C48.4913506,44.8450219 40.4316379,45.6921483 40.4316379,52.4629309 C40.4316379,56.7577374 42.9660632,59.9388218 47.2200287,60.561086 C47.6777299,60.6277349 48.1316379,60.660125 48.578592,60.660125 C53.2042816,60.660125 57.124454,57.1999872 57.6023851,52.7899467 C58.5297989,44.2482961 50.0357759,37.794563 47.2832471,36.1420435 C47.2118103,36.0990643 47.1359483,36.0803777 47.0632471,36.0803777 M49.2948563,40.8037305 C52.1175575,43.3245545 55.6306034,47.5302881 55.0881897,52.5252197 C54.7449138,55.6894861 51.885546,58.1685767 48.578592,58.1685767 C48.2511207,58.1685767 47.9192241,58.1442841 47.5904885,58.0963218 C44.6483046,57.6659068 42.9603736,55.6122481 42.9603736,52.4629309 C42.9603736,50.460349 43.9042241,49.2806008 45.5725575,47.3689604 C47.0417529,45.6852966 48.7556034,43.7213336 49.2948563,40.8037305" id="Fill-5"></path>
                        </g>
                    </g>
                </g>
            </g>
        </g>
    </g>
</svg>