<svg xmlns="http://www.w3.org/2000/svg" viewBox="0 0 100 100">
	<g class="icon-stroke" stroke-linejoin="bevel">
		<line x1="69" y1="70" x2="26.9" y2="70"/>
		<path d="M10.7,70H4V23h59.1c5.3,0,10.2,3.1,12.5,7.9L80,42.8l16,5.8V70H85"/>
		<path d="M26.9,69.4c0,4.5-3.7,8.1-8.1,8.1c-4.5,0-8.1-3.7-8.1-8.1c0-4.5,3.6-8.1,8.1-8.1S26.9,64.9,26.9,69.4z"/>
		<path d="M85,69.4v0.3c0,3.2-1.9,6.1-4.8,7.3c-7,2.8-13.6-3.7-10.9-10.6c0.8-2,2.4-3.7,4.4-4.4C79.5,59.7,85,63.9,85,69.4z"/>
		<path d="M44,43h27.2L68,33.8c-1.1-3.4-4.4-5.8-8-5.8H44V43z"/>
	</g>
</svg>
