<?xml version="1.0" encoding="utf-8"?>
<!-- Generator: Adobe Illustrator 18.1.1, SVG Export Plug-In . SVG Version: 6.00 Build 0)  -->
<svg version="1.1" id="Layer_1" xmlns="http://www.w3.org/2000/svg" xmlns:xlink="http://www.w3.org/1999/xlink" x="0px" y="0px"
	 viewBox="0 0 50 50" enable-background="new 0 0 50 50" xml:space="preserve">
<line fill="none" stroke="#000000" stroke-width="1" stroke-miterlimit="10" x1="14" y1="25" x2="36" y2="25"/>
<line fill="none" stroke="#000000" stroke-width="1" stroke-miterlimit="10" x1="25" y1="14" x2="25" y2="36"/>
<path fill="none" stroke="#000000" stroke-width="1" stroke-linecap="round" stroke-miterlimit="10" d="M25,37.7"/>
<path fill="none" stroke="#000000" stroke-width="1" stroke-linecap="round" stroke-miterlimit="10" d="M25,12.3"/>
<circle fill="none" stroke="#000000" stroke-width="1" stroke-miterlimit="10" cx="25" cy="25" r="21"/>
</svg>
