<?xml version="1.0" encoding="utf-8"?>
<!-- Generator: Adobe Illustrator 19.2.1, SVG Export Plug-In . SVG Version: 6.00 Build 0)  -->
<svg version="1.1" id="Calque_1" xmlns="http://www.w3.org/2000/svg" xmlns:xlink="http://www.w3.org/1999/xlink" x="0px" y="0px"
	 viewBox="-250 345.4 90 77.3" style="enable-background:new -250 345.4 90 77.3;" xml:space="preserve">
<path d="M-160,398.6l-25.3-53.2l-50.7,47.2l8,17.6l6.2-1.1l6.2,13.6l25.7-11.7l-3.1-6.8L-160,398.6z M-194.5,409.2l-19.4,8.8
	l-4.3-9.6l21.7-3.7L-194.5,409.2z M-241.2,394.8l7.9,17.6l-8.8,4l-7.9-17.6L-241.2,394.8z"/>
</svg>
