<?xml version="1.0" standalone="no"?>
<!DOCTYPE svg PUBLIC "-//W3C//DTD SVG 1.1//EN" "http://www.w3.org/Graphics/SVG/1.1/DTD/svg11.dtd" >
<!--
2016-12-15: Created.
-->
<svg xmlns="http://www.w3.org/2000/svg">
<metadata>
Created by FontForge 20120731 at Thu Dec 15 07:50:27 2016
 By Apache
Created by Apache with FontForge 2.0 (http://fontforge.sf.net)
</metadata>
<defs>
<font id="Flaticon" horiz-adv-x="512" >
  <font-face 
    font-family="Flaticon"
    font-weight="500"
    font-stretch="normal"
    units-per-em="512"
    panose-1="2 0 6 3 0 0 0 0 0 0"
    ascent="448"
    descent="-64"
    bbox="-3.05176e-05 -64 512 448"
    underline-thickness="25.6"
    underline-position="-51.2"
    unicode-range="U+0020-F10B"
  />
    <missing-glyph />
    <glyph glyph-name="space" unicode=" " horiz-adv-x="200" 
 />
    <glyph glyph-name="uniF109" unicode="&#xf109;" 
d="M363.757 172.07c19.04 0 34.5234 -15.4834 34.5234 -34.5234v-53.3555c0 -19.041 -15.4834 -34.5244 -34.5234 -34.5244h-69.5713c-19.04 0 -34.5234 15.4834 -34.5234 34.5244v53.3555c0 19.04 15.4834 34.5234 34.5234 34.5234h69.5713zM373.172 84.1914v53.3555
c0 5.12598 -4.18457 9.41504 -9.41504 9.41504h-69.5713c-5.12598 0 -9.41602 -4.18457 -9.41602 -9.41504v-53.3555c0 -5.12598 4.18555 -9.41602 9.41602 -9.41602h69.5713c5.12598 0 9.41504 4.18457 9.41504 9.41602zM512 269.051
c0 -30.1299 -18.2031 -55.9707 -44.1484 -67.374c0.104492 -0.417969 0.104492 -0.836914 0.104492 -1.35938v-219.279c0 -6.90527 -5.64941 -12.5537 -12.5547 -12.5537h-231.624h-0.313477h-97.2949h-0.313477h-69.3613c-6.90527 0 -12.5547 5.64844 -12.5547 12.5537
v220.849c-25.8408 11.4033 -43.9395 37.1387 -43.9395 67.1641c0 2.19727 0.62793 4.29004 1.67383 6.17285l76.0576 133.911c2.19629 3.97559 6.38086 6.38184 10.8799 6.38184h334.673c4.49805 0 8.68262 -2.51172 10.8799 -6.38184l76.1621 -133.911
c1.15039 -1.88281 1.67383 -3.97559 1.67383 -6.17285zM95.9346 390.303l-59.4229 -104.722h438.977l-59.5273 104.722h-320.026zM364.384 260.577h-94.9932c3.97559 -22.5977 23.749 -39.7549 47.4971 -39.7549s43.5205 17.1572 47.4961 39.7549zM242.714 260.577h-95.0977
c4.08008 -22.5977 23.8525 -39.7549 47.6006 -39.7549s43.5215 17.1572 47.4971 39.7549zM25.9453 260.577c3.97559 -22.5977 23.748 -39.8594 47.4961 -39.7549c23.749 0 43.626 17.1572 47.6016 39.7549h-95.0977zM210.91 -6.4082h0.104492v135.48
c0 9.93848 -8.05566 17.8896 -17.8896 17.8896h-36.5117c-9.93945 0 -17.8896 -8.05566 -17.8896 -17.8896v-135.48h72.1865zM442.848 -6.4082v0v202.122c-1.46484 0 -2.8252 -0.104492 -4.28906 -0.104492c-25.3184 0 -47.7061 12.8682 -60.8877 32.4316
c-13.1826 -19.5635 -35.4658 -32.4316 -60.7832 -32.4316c-25.2129 0 -47.6016 12.8682 -60.7832 32.4316c-13.2861 -19.5635 -35.5703 -32.4316 -60.8877 -32.4316s-47.7051 12.8682 -60.8877 32.4316c-13.1816 -19.5635 -35.5693 -32.4316 -60.8877 -32.4316
c-1.46387 0 -2.92871 0 -4.39355 0.104492v-202.227h44.4629v135.585c0 23.748 19.3535 42.998 42.998 42.998h36.5107c23.749 0 42.998 -19.3545 42.998 -42.998v-135.48h206.83zM438.559 220.718c23.748 0 43.5205 17.2617 47.6006 39.7549h-95.0977
c3.97559 -22.5977 23.748 -39.7549 47.4971 -39.7549z" />
    <glyph glyph-name="uniF100" unicode="&#xf100;" 
d="M484.775 273.987c17.0156 -16.166 27.2246 -39.1367 27.2236 -62.957c-0.850586 -130.17 -108.899 -244.175 -240.771 -254.384l-13.6123 -2.55273h-3.40332c-22.1201 0 -42.5391 8.50781 -58.7031 23.8213c-17.1631 16.3447 -27.2549 38.9727 -28.0234 62.5996
c-3.6123 0.927734 -7.10059 2.18066 -10.2617 3.76172c-119.96 48.4941 -185.471 190.575 -145.483 315.64l4.25391 11.0605c7.2832 21.8496 22.2773 39.0664 42.7607 49.4834c1.54297 1.96094 3.97754 3.03516 6.51074 3.05859
c20.4883 8.68359 43.7568 8.27344 64.7334 0.205078c75.3428 -26.7344 131.398 -88.9561 151.274 -167.564c36.6348 23.457 80.0049 37.9209 126.931 39.9482l11.9111 0.850586c24.6729 1.70215 46.793 -6.80664 64.6592 -22.9707zM124.044 408.41
c-9.3584 3.40332 -17.8662 5.10449 -27.2246 5.10352c-2.76758 0 -5.61133 -0.152344 -8.48438 -0.472656c74.8887 -41.6104 98.6875 -106.344 68.0391 -184.146c-21.46 -52.8799 -15.9814 -99.541 15.1641 -133.153c11.583 60.7441 46.3408 114.104 95.3564 150.491
c-17.9404 75.5684 -70.6377 135.841 -142.851 162.178zM27.9062 354.811c-36.584 -117.408 24.6719 -250.13 136.125 -295.222c0.847656 -0.847656 2.54102 -0.850586 3.39453 -1.69434c0.15625 5.51855 0.485352 11 1.01465 16.4297
c-44.0283 39.0693 -53.96 95.7383 -27.3809 160.526c29.3887 74.7305 3.24707 133.715 -75.958 171.229c-15.6191 -8.65527 -27.3643 -22.5312 -33.793 -40.21zM184.366 46.4219c0.0273438 -0.999023 0.0429688 -1.99512 0.0849609 -2.99707
c0 -11.7529 2.83301 -23.2158 7.9834 -33.2695c11.4346 84.7305 62.7783 131.11 146.008 131.11h0.850586c81.8789 0 127.651 42.668 130.882 120.746c-12.5361 10.8887 -28.7793 17.0801 -45.8037 17.0801h-4.25488l-11.9111 -0.850586
c-95.2637 -3.81055 -175.82 -63.5693 -208.425 -145.29c-0.555664 -1.41211 -1.11133 -2.82422 -1.63867 -4.24707c-0.0732422 -0.192383 -0.146484 -0.383789 -0.21875 -0.577148c-9.37988 -25.5068 -14.1104 -52.7383 -13.4736 -80.4482
c0 -0.420898 -0.0332031 -0.839844 -0.0830078 -1.25684zM269.527 -27.1895c121.662 8.50781 222.905 114.855 223.754 236.518c0 11.6318 -2.72461 22.6533 -7.77832 32.5459c-10.2256 -75.8115 -62.1328 -118.475 -146.213 -118.475h-0.850586
c-79.5918 0 -125.356 -46.2031 -130.795 -132.922c13.585 -12.6289 31.3555 -19.3643 49.9717 -18.5176z" />
    <glyph glyph-name="uniF10A" unicode="&#xf10a;" 
d="M256 448c141.168 0 256 -114.842 256 -256c0 -141.147 -114.853 -256 -256 -256c-141.158 0 -256 114.853 -256 256c0 141.158 114.842 256 256 256zM370.203 250.592c11.5176 8.28027 21.5098 18.6641 29.3672 30.4609
c-10.5273 -4.69238 -21.9121 -7.84766 -33.8428 -9.27051c12.1992 7.30078 21.5107 18.8398 25.9443 32.6055c-11.415 -6.77441 -23.9951 -11.6621 -37.4316 -14.3018c-10.7656 11.4453 -26.0576 18.6016 -43.0107 18.6016c-32.5332 0 -58.9111 -26.3877 -58.9111 -58.9209
c0 -4.62988 0.505859 -9.11523 1.5166 -13.4365c-48.9609 2.47461 -92.3936 25.9238 -121.442 61.582c-5.07324 -8.70312 -7.9707 -18.8291 -7.9707 -29.6357c0 -20.4385 10.4043 -38.4834 26.2021 -49.0322c-9.65137 0.298828 -18.7363 2.95898 -26.6768 7.3623
c-0.00976562 -0.237305 -0.00976562 -0.495117 -0.00976562 -0.742188c0 -28.5645 20.3037 -52.374 47.2588 -57.7773c-4.93945 -1.35059 -10.1572 -2.05176 -15.5303 -2.05176c-3.78418 0 -7.48633 0.380859 -11.0742 1.06152
c7.49609 -23.418 29.2646 -40.4531 55.0439 -40.9268c-20.1699 -15.7979 -45.5674 -25.2227 -73.1826 -25.2227c-4.75391 0 -9.44531 0.27832 -14.0547 0.825195c26.0684 -16.7266 57.0449 -26.4502 90.3203 -26.4502c108.408 0 167.659 89.7539 167.659 167.618
c0 2.55664 -0.0615234 5.11426 -0.174805 7.65137z" />
    <glyph glyph-name="uniF105" unicode="&#xf105;" 
d="M247.691 241.036c0 -6.54004 -0.720703 -18.1768 -9.07617 -26.5771c-5.8418 -5.81934 -15.6631 -10.1943 -24.7627 -10.1943c-31.3008 0 -45.4971 40.4023 -45.4971 64.7676c0 9.47363 1.81543 19.2939 8.00488 26.9268c5.8418 7.30859 16.0352 12.0322 25.4844 12.0322
c30.208 0 45.8467 -40.7744 45.8467 -66.9551zM512 192c0 -141.382 -114.618 -256 -256 -256s-256 114.618 -256 256s114.618 256 256 256s256 -114.618 256 -256zM334.777 241.222v-39.377h-39.377v-19.6895h39.377v-39.3779h19.6895v39.3779h39.3779v19.6895h-39.3779
v39.377h-19.6895zM118.155 94.7432c0 -26.9268 25.4844 -52.0381 78.2207 -52.0146c62.5811 0 95.6973 34.584 95.6973 68.7715c0 25.1338 -14.5449 37.5156 -30.5566 50.9668l-13.1025 10.1934c-3.98047 3.25781 -9.44922 7.63281 -9.44922 15.6396
c0 8.00586 5.46875 13.1025 10.1934 17.8271c15.2676 12.0088 30.5566 24.7383 30.5566 51.665c0 27.6484 -17.4775 42.2168 -25.832 49.1289v0h22.5508l23.2969 13.0791h-74.9629c-19.6426 0 -44.3809 -2.91016 -65.1396 -20.0146
c-15.6621 -13.4521 -23.2959 -32.0234 -23.2959 -48.7568c0 -28.3701 21.8291 -57.1348 60.3926 -57.1348c3.6543 0 7.65625 0.373047 11.6592 0.722656c-1.81543 -4.37695 -3.63086 -8.00684 -3.63086 -14.1973c0 -11.2646 5.81836 -18.1758 10.915 -24.7383
c-16.3604 -1.09473 -46.9404 -2.91016 -69.4922 -16.7334c-21.4805 -12.7539 -28.0205 -31.3018 -28.0205 -44.4043zM228.049 145.339c27.6719 -19.666 39.6572 -29.4873 39.6572 -48.0576c0 -22.5518 -18.5488 -39.2852 -53.4805 -39.2852
c-38.9355 0 -64.0469 18.5488 -64.0469 44.3809c0 25.833 23.2969 34.5605 31.3018 37.4697c15.29 5.11914 34.9326 5.84082 38.2139 5.84082c3.63086 0 5.44629 0 8.35449 -0.348633z" />
    <glyph glyph-name="uniF103" unicode="&#xf103;" 
d="M499.732 135.419c0.015625 -0.202148 0.0234375 -0.405273 0.0234375 -0.611328c0 -4.5127 -3.6582 -8.1709 -8.19238 -8.1709h-32.6807c-4.51367 0 -8.16992 3.6582 -8.16992 8.1709c0 58.9238 -21.4531 115.305 -60.4893 159.177h-60.0752
c50.0342 -37.4951 79.7129 -96.4902 79.7129 -159.176c0 -109.624 -89.1846 -198.809 -198.809 -198.809c-109.623 0 -198.809 89.1846 -198.809 198.809c0 63.5088 30.4697 123.222 81.7021 160.634v48.9072l-32.2285 92.7988
c-0.96875 2.79004 -0.356445 5.8877 1.60352 8.09863c1.95898 2.21191 4.95703 3.19336 7.84668 2.56641l263.395 -57.1182c2.28418 -0.496094 4.24707 -1.94727 5.39258 -3.98535c1.14453 -2.03809 1.36035 -4.4707 0.59375 -6.67871l-12.3896 -35.6807v-1.3457h79.6738
c2.21387 0 4.33203 -0.897461 5.87207 -2.48828l4.81641 -4.97656c52.2295 -53.9717 81.0566 -125.02 81.2109 -200.121zM322.088 376.681l-240.158 52.0801l25.999 -74.8633h146.698c4.51367 0 8.1709 -3.6582 8.1709 -8.16992
c0 -4.5127 -3.65723 -8.16992 -8.1709 -8.16992h-144.34v-38.1279h201.531v38.1279h-24.5098c-4.51367 0 -8.1709 3.65723 -8.1709 8.16992c0 4.51172 3.65723 8.16992 8.1709 8.16992h26.8691zM393.521 134.809c0 58.7695 -28.4346 113.999 -76.167 148.281h-212.602
c-47.7324 -34.2822 -76.167 -89.5117 -76.167 -148.281c0 -100.613 81.8555 -182.468 182.468 -182.468s182.468 81.8545 182.468 182.468zM466.924 142.979h16.3496c-2.00195 68.0352 -28.9844 132.104 -76.4941 181.198l-2.4082 2.48926h-76.2119v-16.3408h65.6943
c2.28906 0 4.47461 -0.960938 6.02148 -2.64941c41.4795 -45.2529 65.1172 -103.46 67.0488 -164.697zM290.029 121.191c17.6416 0 25.9375 4.57617 35.5439 9.87695c10.1191 5.58203 21.5869 11.9102 43.4375 11.9102c4.5127 0 8.16992 -3.6582 8.16992 -8.16992
c0 -91.6035 -74.5244 -166.128 -166.128 -166.128c-37.9775 0 -75.1387 13.21 -104.64 37.1943c-3.50098 2.84668 -4.03125 7.99219 -1.18555 11.4941c2.84668 3.5 7.99219 4.0332 11.4941 1.18457c26.5957 -21.623 60.0957 -33.5322 94.3311 -33.5322
c79.7197 0 145.094 62.5967 149.546 141.222c-12.1553 -1.21973 -19.1963 -5.10352 -27.1318 -9.48242c-10.1191 -5.58203 -21.5869 -11.9102 -43.4375 -11.9102s-33.3184 6.32715 -43.4375 11.9102c-9.60547 5.2998 -17.9033 9.87793 -35.543 9.87793
c-17.6406 0 -25.9365 -4.57812 -35.543 -9.87793c-10.1182 -5.58203 -21.5869 -11.9102 -43.4346 -11.9102c-21.8486 0 -33.3174 6.32715 -43.4355 11.9092c-7.93359 4.37793 -14.9727 8.26172 -27.1221 9.48242c1.8125 -31.2197 13.4707 -61.3926 33.2861 -85.7646
c2.84668 -3.50098 2.31543 -8.64746 -1.18555 -11.4941c-3.50195 -2.84766 -8.64746 -2.31445 -11.4941 1.18555c-23.9854 29.501 -37.1953 66.6621 -37.1953 104.64c0 4.51172 3.65723 8.16992 8.1709 8.16992c21.8477 0 33.3154 -6.32812 43.4336 -11.9102
c9.60547 -5.2998 17.9023 -9.87695 35.542 -9.87695c17.6387 0 25.9355 4.57715 35.541 9.87695c10.1182 5.58203 21.5869 11.9102 43.4365 11.9102c21.8506 0 33.3184 -6.32812 43.4365 -11.9102c9.60645 -5.2998 17.9043 -9.87695 35.5439 -9.87695z" />
    <glyph glyph-name="uniF106" unicode="&#xf106;" 
d="M255.989 140.751c-28.2539 0 -51.2598 22.9951 -51.2285 51.2598c0.0107422 11.1572 3.62988 21.458 9.69336 29.873c9.33203 12.9102 24.459 21.3652 41.5664 21.3652c17.0967 0 32.2344 -8.46582 41.5459 -21.376c6.04297 -8.41406 9.69336 -18.7158 9.69336 -29.873
c0 -28.2646 -23.0264 -51.249 -51.2705 -51.249zM367.903 254.695l-49.1973 -0.165039l-0.165039 49.3623l42.9385 0.134766l6.42383 0.0205078v-6.39355v-42.959zM256 448c141.168 0 256 -114.842 256 -256c0 -141.147 -114.853 -256 -256 -256
c-141.158 0 -256 114.853 -256 256c0 141.158 114.842 256 256 256zM401.592 221.873v59.4375c0 31.0381 -25.2432 56.2715 -56.2812 56.2715h-178.631c-31.0391 0 -56.2715 -25.2334 -56.2715 -56.2715v-59.4375v-119.204c0 -31.0488 25.2324 -56.2812 56.2715 -56.2812
h178.641c31.0283 0 56.2715 25.2324 56.2715 56.2812v119.204zM335.638 192c0 10.5596 -2.13477 20.6543 -5.91895 29.873h43.4844v-119.204c0 -15.4053 -12.5283 -27.8828 -27.9033 -27.8828h-178.631c-15.3955 0 -27.9033 12.4775 -27.9033 27.8828v119.204h43.4639
c-3.75293 -9.21875 -5.85742 -19.3135 -5.85742 -29.873c0 -43.8975 35.71 -79.6377 79.6279 -79.6377s79.6377 35.7402 79.6377 79.6377z" />
    <glyph glyph-name="uniF104" unicode="&#xf104;" 
d="M445.539 177.366c36.6455 0 66.4609 -29.8145 66.4609 -66.4609c0 -36.6455 -29.8154 -66.46 -66.4609 -66.46h-43.9668c-7.5957 -28.2227 -27.6045 -51.1367 -53.7383 -62.7471h71.6748c8.98633 0 16.2754 -7.28906 16.2754 -16.2764
s-7.28906 -16.2764 -16.2754 -16.2764h-403.232c-8.9873 0 -16.2764 7.28906 -16.2764 16.2764s7.28906 16.2764 16.2764 16.2764h69.3818c-32.2402 14.3203 -55.1865 45.8408 -56.9717 83.3037l-7.22656 151.596c-0.211914 4.44531 1.4082 8.7832 4.47852 12.0059
c3.07129 3.21973 7.32715 5.04297 11.7783 5.04297h358.056c4.44824 0 8.70801 -1.82324 11.7783 -5.04297s4.69043 -7.56055 4.47852 -12.0059l-1.86914 -39.2314h35.3789zM308.761 5.97656c34.0059 0 61.9111 26.6084 63.5303 60.5771l6.41016 134.546h-323.913
l6.41309 -134.546c1.61914 -33.9688 29.5244 -60.5771 63.5303 -60.5771h184.029zM445.539 76.9971c18.6992 0 33.9092 15.21 33.9092 33.9082c0 18.6992 -15.21 33.9092 -33.9092 33.9092h-36.2031c-0.244141 0 -0.483398 0.0244141 -0.724609 0.0351562l-3.2334 -67.8525
h40.1611zM168.919 260.326c-17.4561 10.3184 -29.3975 28.5664 -32.7559 50.0674c-3.41016 21.791 2.70215 43.9922 16.3496 59.4219c1.7959 2.09375 3.5918 4.1582 5.37402 6.20312c13.2188 15.1807 24.6357 28.291 27.5635 45.3154
c1.52148 8.86035 9.93848 14.8037 18.7988 13.2812c8.85645 -1.52148 14.8057 -9.93848 13.2812 -18.7988c-4.4707 -26.0146 -20.041 -43.8887 -35.0967 -61.1787c-1.75488 -2.01562 -3.52637 -4.04785 -5.29785 -6.11426
c-0.0625 -0.0761719 -0.12793 -0.149414 -0.192383 -0.222656c-7.32715 -8.24414 -10.5527 -20.5381 -8.62109 -32.8809c1.85547 -11.8545 8.11035 -21.7227 17.1602 -27.0723c7.73926 -4.57324 10.3057 -14.5537 5.72949 -22.293
c-3.03809 -5.1377 -8.46094 -7.99707 -14.0273 -7.99707c-2.81641 0 -5.66699 0.732422 -8.26562 2.26855zM219.432 297.08c-16.4629 42.3965 16.0127 77.0781 26.6875 88.4736c10.1729 10.8643 16.3604 22.8359 18.3916 35.583
c1.41602 8.87793 9.76074 14.9277 18.6367 13.5117c8.87793 -1.41602 14.9248 -9.76074 13.5117 -18.6367c-3.03027 -19.0098 -12.291 -37.2344 -26.7793 -52.707c-20.4375 -21.8232 -26.4492 -38.1055 -20.1045 -54.4434
c3.18555 -8.20605 9.1582 -16.0703 16.3848 -21.5801c7.15039 -5.44922 8.5293 -15.6631 3.0791 -22.8105c-3.20117 -4.20215 -8.05078 -6.41016 -12.9561 -6.41016c-3.44238 0 -6.90918 1.08789 -9.85449 3.33398c-12.0361 9.17383 -21.623 21.8477 -26.9971 35.6855z" />
    <glyph glyph-name="uniF10B" unicode="&#xf10b;" 
d="M134.487 173.107v17.9912h60.1719v-17.9912h-20.6738v-109.854h-19.2012v109.854h-20.2969zM296.85 159.677c6.8623 0 11.4922 -3.61328 13.792 -10.7578c1.15723 -3.8291 1.74902 -10.125 1.74902 -19.1445v-37.9326c0 -8.81543 -0.591797 -15.1582 -1.74902 -19.1963
c-2.30469 -7.09277 -6.9248 -10.707 -13.792 -10.707c-6.14355 0 -12.0625 3.41504 -17.8398 10.5439v-9.22852h-17.2588v127.851h17.2588v-41.7559c5.56836 6.86133 11.4922 10.3281 17.8398 10.3281zM295.121 90.4902v40.6562c0 8.58984 -2.5293 13.001 -7.51074 13.001
c-2.83398 0 -5.71973 -1.35156 -8.60547 -4.20605v-58.0566c2.88574 -2.8916 5.77148 -4.24805 8.60547 -4.24805c4.98633 0 7.51074 4.24316 7.51074 12.8535zM229.544 85.7139v72.8008h17.2744v-95.2666h-17.2744v10.3926
c-6.8623 -7.86719 -13.3779 -11.7021 -19.7314 -11.7021c-5.55176 0 -9.38574 2.26367 -11.1201 7.09277c-0.942383 2.89062 -1.52441 7.4375 -1.52441 14.168v75.3154h17.2646v-70.1348c0 -4.04395 0 -6.14941 0.157227 -6.70508
c0.418945 -2.68164 1.7334 -4.03809 4.03809 -4.03809c3.46777 0 7.08691 2.66602 10.916 8.07715zM244.361 246.521c-5.625 0 -8.32812 4.45215 -8.32812 13.3623v40.4932c0 8.90527 2.70312 13.3467 8.32812 13.3467c5.62012 0 8.31836 -4.43652 8.31836 -13.3467
v-40.4932c0 -8.9043 -2.69824 -13.3623 -8.31836 -13.3623zM256 448c141.386 0 256 -114.614 256 -256s-114.614 -256 -256 -256s-256 114.614 -256 256s114.614 256 256 256zM284.473 328.263v0v-76.127c0 -6.79297 0.582031 -11.3975 1.5459 -14.3154
c1.74902 -4.87109 5.625 -7.14941 11.2402 -7.14941c6.36328 0 12.9844 3.86035 19.9297 11.8223v-10.4971h17.4424v96.2666h-17.4424v-73.5811c-3.87109 -5.46289 -7.53223 -8.16602 -11.0205 -8.16602c-2.33594 0 -3.70801 1.38281 -4.09082 4.08594
c-0.208984 0.570312 -0.208984 2.69141 -0.208984 6.78223v70.8789h-17.3955zM218.591 296.872v-33.7109c0 -10.2295 1.75 -17.8242 5.45801 -22.6377c4.82422 -6.56836 11.6182 -9.85254 20.3125 -9.85254c8.7373 0 15.5254 3.28418 20.3496 9.85254
c3.65527 4.81348 5.40527 12.4033 5.40527 22.6377v33.7109c0 10.293 -1.75 17.8193 -5.40527 22.6797c-4.82422 6.58398 -11.6123 9.87402 -20.3496 9.87402c-8.69434 0 -15.4883 -3.29004 -20.3125 -9.87402c-3.70801 -4.86523 -5.45801 -12.3867 -5.45801 -22.6797z
M171.943 361.178h-20.3496c4.0752 -11.9795 8.32324 -24.0059 12.3984 -35.9951c6.20703 -18.0176 10.0771 -31.5996 11.832 -40.8711v-52.3203h19.3379v52.3203l23.2725 76.8662h-19.5635l-13.1943 -50.7285zM393.813 54.8418
c4.98047 21.627 5.00195 45.2441 5.00195 67.5156s0.03125 45.8838 -4.93457 67.5156c-3.50391 15.1904 -15.9277 26.3936 -30.8818 28.0645c-35.4189 3.95508 -71.2666 3.97559 -106.952 3.95508c-35.6953 0.0205078 -71.5439 0 -106.962 -3.95508
c-14.9541 -1.66504 -27.3682 -12.874 -30.8613 -28.0645c-4.97559 -21.6318 -5.03906 -45.2441 -5.03906 -67.5156s0 -45.8887 4.98145 -67.5156c3.48828 -15.1895 15.9121 -26.3936 30.8662 -28.0645c35.4131 -3.95508 71.2666 -3.97559 106.952 -3.95508
c35.7012 -0.0205078 71.5332 0 106.957 3.95508c14.9541 1.6709 27.373 12.8799 30.8721 28.0645zM351.826 159.677c8.66406 0 15.5303 -3.24707 20.3545 -9.75293c3.61914 -4.81836 5.34277 -12.2666 5.34277 -22.4434v-19.7314h-34.5283v-16.8975
c0 -8.80957 2.90234 -13.21 8.83105 -13.21c4.24805 0 6.73047 2.30469 7.71582 6.91992c0.151367 0.9375 0.376953 4.77637 0.376953 11.6904h17.6045v-2.50879c0 -5.56836 -0.204102 -9.39648 -0.367188 -11.125c-0.575195 -3.82422 -1.9375 -7.28613 -4.03223 -10.3447
c-4.77734 -6.91992 -11.8535 -10.3291 -20.8682 -10.3291c-9.03027 0 -15.9072 3.25293 -20.8887 9.75781c-3.67676 4.77148 -5.54688 12.2725 -5.54688 22.3975v33.3701c0 10.1768 1.6709 17.625 5.33203 22.4443c4.98633 6.52051 11.8428 9.7627 20.6738 9.7627z
M360.27 122.111v8.81543c0 8.80469 -2.89062 13.2148 -8.60059 13.2148c-5.7666 0 -8.66309 -4.40527 -8.66309 -13.2148v-8.81543h17.2637z" />
    <glyph glyph-name="uniF107" unicode="&#xf107;" 
d="M256 448c141.382 0 256 -114.618 256 -256s-114.618 -256 -256 -256s-256 114.618 -256 256s114.618 256 256 256zM279.552 114.479c56.3662 0 94.6035 52.457 94.5801 122.717c0 53.084 -44.0547 102.539 -110.987 102.539c-83.293 0 -125.3 -60.9746 -125.3 -111.826
c0 -30.7656 11.4033 -58.1572 35.9092 -68.375c4.00293 -1.67578 7.61035 -0.0693359 8.77441 4.46875c0.791016 3.1416 2.72266 11.0547 3.56055 14.3594c1.18652 4.49219 0.72168 6.07422 -2.51367 9.98438c-7.0752 8.49512 -11.5664 19.5029 -11.5664 35.0957
c0 45.2188 33.1396 85.7129 86.3184 85.7129c47.0801 0 72.96 -29.3467 72.96 -68.585c0 -51.5957 -22.3887 -95.1621 -55.5986 -95.1621c-18.3389 0 -32.0703 15.4766 -27.6709 34.4668c5.25977 22.668 15.4756 47.1514 15.4756 63.5117
c0 14.6377 -7.70312 26.8799 -23.6445 26.8799c-18.7578 0 -33.8154 -19.8047 -33.8154 -46.3359c0 -16.8955 5.6084 -28.3232 5.6084 -28.3232s-19.1768 -83.0137 -22.5518 -97.5361c-3.04785 -13.2412 -3.49023 -27.7861 -3.07129 -40.0742
c1.2793 -11.0322 11.9619 -20.0156 21.2246 -7.91406c6.49316 10.6357 13.498 24.0654 17.1289 37.5166c2.16406 7.95996 12.335 49.1992 12.335 49.1992c6.12109 -11.8701 23.9248 -22.3193 42.8447 -22.3193z" />
    <glyph glyph-name="uniF102" unicode="&#xf102;" 
d="M512 192c0 -141.382 -114.618 -256 -256 -256s-256 114.618 -256 256s114.618 256 256 256s256 -114.618 256 -256zM187.252 192h30.0215v-147.758h48.5713v147.758h48.7559l7.70215 48.9893h-56.459v24.5293c0 12.7764 4.16602 24.9717 22.5283 24.9717h36.6309v48.873
h-52.0371c-43.7529 0 -55.6924 -28.7881 -55.6924 -68.748v-29.626h-30.0215v-48.9893z" />
    <glyph glyph-name="uniF101" unicode="&#xf101;" 
d="M465.067 294.4c14.5059 0 25.5996 -11.0938 25.5996 -25.6006s-11.0928 -25.5996 -25.5996 -25.5996h-42.667v-221.866h17.0664c5.12012 0 8.5332 -3.41309 8.5332 -8.5332c0 -42.667 -34.1328 -76.7998 -76.7998 -76.7998h-273.066
c-42.667 0 -76.7998 34.1328 -76.7998 76.7998c0 5.12012 3.41309 8.5332 8.5332 8.5332h17.0654v290.133h-17.0664c-5.12012 0 -8.5332 3.41309 -8.5332 8.5332c0 70.8271 57.1729 128 128 128h170.667c70.8271 0 128 -57.1729 128 -128
c0 -5.12012 -3.41309 -8.5332 -8.5332 -8.5332h-17.0664v-17.0664h42.667zM405.333 294.4v17.0654h-85.333v-34.1328h9.90918c3.39062 10.1045 12.7324 17.0674 24.2236 17.0674h51.2002zM260.267 226.133v-12.7998c0 -2.55957 1.70703 -4.2666 4.26758 -4.2666h8.5332
c2.55957 0 4.2666 1.70703 4.2666 4.2666v12.7998h-17.0674zM277.333 243.2c13.6543 0 24.7471 11.0928 24.7471 24.7471v43.5195h-135.68v-43.5195c0 -13.6543 11.0938 -24.7471 24.7471 -24.7471h26.4521h34.1338h25.5996zM192 226.133v-12.7998
c0 -2.55957 1.70703 -4.2666 4.2666 -4.2666h8.5332c2.56055 0 4.26758 1.70703 4.26758 4.2666v12.7998h-17.0674zM149.333 430.933c-58.0264 0 -105.813 -45.2256 -110.933 -102.399h17.0654h102.4h153.6h102.4h17.0664
c-5.12012 57.1729 -52.9053 102.399 -110.933 102.399h-170.667zM371.2 -46.9326c29.8672 0 54.6123 22.1855 58.8789 51.1992h-16.2129h-358.4h-16.2129c4.2666 -29.0127 29.0127 -51.1992 58.8799 -51.1992h273.067zM352.427 131.413
c-3.41406 -23.8936 -10.2393 -45.2256 -21.334 -64.8535c17.9199 7.68066 40.1074 30.7207 40.1074 48.6406c0 4.2666 0 12.7998 -18.7734 16.2129zM336.741 144.167c0.128906 1.71387 0.243164 3.43359 0.327148 5.16602h-204.801
c3.41309 -71.6797 47.7871 -128 102.4 -128c28.125 0 53.5342 14.9375 72.0322 39.2178c0.148438 0.304688 0.310547 0.604492 0.500977 0.889648c16.2129 21.333 26.4531 49.4922 29.0127 80.2129c0 0.882812 0.191406 1.72656 0.527344 2.51367zM405.333 21.333
l-0.000976562 221.867h-51.2002c-11.4902 0 -20.833 6.96387 -24.2236 17.0664h-10.6299c-2.60254 -13.9326 -12.1377 -25.4688 -24.8789 -30.8555v-16.0781c0 -11.9463 -9.38672 -21.333 -21.333 -21.333h-8.5332c-11.9463 0 -21.333 9.38574 -21.333 21.333v12.7998
h-17.0684v-12.7998c0 -11.9463 -9.38574 -21.333 -21.333 -21.333h-8.5332c-11.9453 0 -21.333 9.38574 -21.333 21.333v16.0781c-15.0205 6.35059 -25.5996 21.2412 -25.5996 38.5361v43.5195h-85.333v-290.134h116.109
c-38.4629 25.5918 -64.9092 77.2832 -64.9092 136.533c0 5.12012 3.41309 8.5332 8.5332 8.5332h221.867c5.12012 0 8.5332 -3.41309 8.5332 -8.5332c0 -3.11914 -0.0820312 -6.21484 -0.226562 -9.29004c28.5996 -3.90625 34.3594 -20.0713 34.3594 -33.376
c0 -31.5742 -40.96 -68.2676 -68.2666 -68.2676c-0.958984 0 -1.91895 0 -2.87793 0.0449219c-8.26562 -10.165 -17.6562 -18.8291 -27.8984 -25.6445h116.109zM465.067 260.267c5.12012 0 8.53223 3.41309 8.53223 8.5332s-3.41309 8.5332 -8.53223 8.5332h-51.2002
h-59.7334c-5.12012 0 -8.5332 -3.41309 -8.5332 -8.5332s3.41309 -8.5332 8.5332 -8.5332h59.7334h51.2002zM354.133 -12.7998c5.12012 0 8.5332 -3.41309 8.5332 -8.5332s-3.41309 -8.5332 -8.5332 -8.5332h-238.933c-5.12012 0 -8.5332 3.41309 -8.5332 8.5332
s3.41309 8.5332 8.5332 8.5332h238.933zM157.867 345.6c-5.12012 0 -8.53418 3.41309 -8.5332 8.5332v51.2002c0 5.12012 3.41309 8.5332 8.5332 8.5332h153.6c5.12012 0 8.5332 -3.41309 8.5332 -8.5332v-51.2002c0 -5.12012 -3.41309 -8.5332 -8.5332 -8.5332h-153.6z
M166.4 396.8v-34.1328h136.532v34.1328h-136.532z" />
    <glyph glyph-name="uniF108" unicode="&#xf108;" 
d="M256.55 19.0439c22.8955 0 41.5225 -18.627 41.5225 -41.5215c0 -22.8955 -18.627 -41.5225 -41.5225 -41.5225c-22.8945 0 -41.5215 18.627 -41.5215 41.5225c0 22.8945 18.627 41.5215 41.5215 41.5215zM256.55 -43.6016c11.6475 0 21.124 9.47559 21.124 21.124
c0 11.6475 -9.47559 21.125 -21.124 21.125c-11.6475 0 -21.124 -9.47754 -21.124 -21.124c0 -11.6484 9.47754 -21.125 21.124 -21.125zM256 448c86.8311 0 157.473 -70.6416 157.472 -157.472c0 -36.1064 -12.5791 -71.4092 -35.4199 -99.4043
c-20.7559 -25.4404 -49.085 -43.8672 -80.458 -52.4893v-61.0244c0 -22.9365 -18.6592 -41.5947 -41.5938 -41.5947s-41.5938 18.6592 -41.5938 41.5947v97.041c0 22.9346 18.6592 41.5938 41.5938 41.5938c40.96 0 74.2832 33.3223 74.2832 74.2832
s-33.3242 74.2822 -74.2842 74.2822s-74.2842 -33.3223 -74.2842 -74.2832c0 -22.9355 -18.6592 -41.5947 -41.5938 -41.5947c-22.9355 0 -41.5938 18.6592 -41.5938 41.5947c0 86.8311 70.6416 157.473 157.473 157.473zM285.224 156.588
c62.4922 13.6201 107.851 69.9512 107.851 133.941c0 75.582 -61.4912 137.072 -137.074 137.072s-137.074 -61.4902 -137.074 -137.073c0 -11.6875 9.50879 -21.1963 21.1963 -21.1963c11.6865 0 21.1963 9.50879 21.1963 21.1963
c0 52.207 42.4736 94.6816 94.6816 94.6816s94.6816 -42.4756 94.6816 -94.6826s-42.4736 -94.6816 -94.6816 -94.6816c-11.6875 0 -21.1963 -9.50879 -21.1963 -21.1953v-97.042c0 -11.6875 9.50879 -21.1963 21.1963 -21.1963c11.6865 0 21.1963 9.50879 21.1963 21.1963
v69.0137c0 4.7959 3.34082 8.94434 8.02734 9.96582zM256 148.143c5.63281 0 10.1992 -4.56543 10.1992 -10.1982v-59.1553c0 -5.63281 -4.56641 -10.1992 -10.1992 -10.1992s-10.1992 4.56641 -10.1992 10.1992v59.1553c0 5.63281 4.56641 10.1982 10.1992 10.1982z
M256 184.861c5.63281 0 10.1992 -4.56738 10.1992 -10.1992v-9.17871c0 -5.63379 -4.56641 -10.1992 -10.1992 -10.1992s-10.1992 4.56543 -10.1992 10.1992v9.17871c0 5.63281 4.56641 10.1992 10.1992 10.1992z" />
  </font>
</defs></svg>
