<?xml version="1.0" encoding="UTF-8"?>
<svg width="120px" height="120px" viewBox="0 0 120 120" version="1.1" xmlns="http://www.w3.org/2000/svg" xmlns:xlink="http://www.w3.org/1999/xlink">
    <!-- Generator: Sketch 41.2 (35397) - http://www.bohemiancoding.com/sketch -->
    <title>icn-eco</title>
    <desc>Created with Sketch.</desc>
    <defs></defs>
    <g id="Media" stroke="none" stroke-width="1" fill="none" fill-rule="evenodd">
        <g id="icn-eco">
            <g transform="translate(20.000000, 20.000000)">
                <path d="M40,78 C60.9868205,78 78,60.9868205 78,40 C78,19.0131795 60.9868205,2 40,2 C19.0131795,2 2,19.0131795 2,40 C2,60.9868205 19.0131795,78 40,78 Z M40,80 C17.90861,80 0,62.09139 0,40 C0,17.90861 17.90861,0 40,0 C62.09139,0 80,17.90861 80,40 C80,62.09139 62.09139,80 40,80 Z" id="Oval" fill="#FFFFFF"></path>
                <path d="M57.938149,48.816 L21.505051,48.816 C21.0183059,48.816 20.6270902,48.416 20.6270902,47.9291429 C20.6270902,47.44 21.0183059,47.0445714 21.505051,47.0445714 L57.938149,47.0445714 C58.4226196,47.0445714 58.8206588,47.44 58.8206588,47.9291429 C58.8206588,48.416 58.4226196,48.816 57.938149,48.816" id="Fill-4" fill="#FEFEFE"></path>
                <polygon id="Fill-6" fill="#FEFEFE" points="21.3883686 34.6150857 22.3595843 34.6150857 25.4597412 39.2802286 28.555349 34.6150857 29.5265647 34.6150857 29.5265647 43.1590857 28.5689961 43.1590857 28.5689961 36.2402286 25.4711137 40.8162286 25.4210745 40.8162286 22.3254667 36.2493714 22.3254667 43.1590857 21.3883686 43.1590857"></polygon>
                <path d="M39.2400863,38.912 L39.2400863,38.8891429 C39.2400863,36.9462857 37.8298902,35.36 35.8874588,35.36 C33.9427529,35.36 32.559851,36.9234286 32.559851,38.8617143 L32.559851,38.8891429 C32.559851,40.8297143 33.9700471,42.416 35.9124784,42.416 C37.8594588,42.416 39.2400863,40.8525714 39.2400863,38.912 M31.5613412,38.912 L31.5613412,38.8891429 C31.5613412,36.5325714 33.3240863,34.4685714 35.9124784,34.4685714 C38.5031451,34.4685714 40.2363216,36.5051429 40.2363216,38.8617143 L40.2363216,38.8891429 C40.2363216,41.2434286 38.4735765,43.3074286 35.8874588,43.3074286 C33.3013412,43.3074286 31.5613412,41.2685714 31.5613412,38.912" id="Fill-8" fill="#FEFEFE"></path>
                <path d="M45.2240941,42.2690286 C47.3735059,42.2690286 48.7495843,40.8016 48.7495843,38.9113143 L48.7495843,38.8884571 C48.7495843,36.9958857 47.3735059,35.5056 45.2240941,35.5056 L43.2316235,35.5056 L43.2316235,42.2690286 L45.2240941,42.2690286 Z M42.2717804,34.6141714 L45.2240941,34.6141714 C47.8989176,34.6141714 49.7435451,36.4587429 49.7435451,38.8610286 L49.7435451,38.8884571 C49.7435451,41.2930286 47.8989176,43.1604571 45.2240941,43.1604571 L42.2717804,43.1604571 L42.2717804,34.6141714 Z" id="Fill-10" fill="#FEFEFE"></path>
                <polygon id="Fill-12" fill="#FEFEFE" points="51.776502 34.6150857 57.924502 34.6150857 57.924502 35.4950857 52.7408941 35.4950857 52.7408941 38.4093714 57.3786196 38.4093714 57.3786196 39.2916571 52.7408941 39.2916571 52.7408941 42.2813714 57.9836392 42.2813714 57.9836392 43.1590857 51.776502 43.1590857"></polygon>
                <path d="M21.4550118,60.6976 L22.3557176,59.8884571 C23.2086588,60.9376 24.2367373,61.5387429 25.5923451,61.5387429 C26.9365804,61.5387429 28.010149,60.6838857 28.010149,59.3810286 L28.010149,59.3490286 C28.010149,57.9684571 26.7296,57.2096 24.9145412,57.2096 L24.2026196,57.2096 L23.9524235,56.4598857 L27.4415216,52.5078857 L22.0395608,52.5078857 L22.0395608,51.3810286 L29.1019137,51.3810286 L29.1019137,52.3021714 L25.6241882,56.1741714 C27.5552471,56.3341714 29.2747765,57.2690286 29.2747765,59.3033143 L29.2747765,59.3330286 C29.2747765,61.3170286 27.6325804,62.6838857 25.578698,62.6838857 C23.7295216,62.6838857 22.3557176,61.8747429 21.4550118,60.6976" id="Fill-14" fill="#FEFEFE"></path>
                <path d="M31.7057725,54.2868571 L32.9226353,54.2868571 L32.9226353,55.6674286 C33.4594196,54.856 34.1895373,54.1108571 35.5610667,54.1108571 C36.8848314,54.1108571 37.7400471,54.8262857 38.185851,55.7451429 C38.765851,54.84 39.6347137,54.1108571 41.0562824,54.1108571 C42.937302,54.1108571 44.0882039,55.3817143 44.0882039,57.4114286 L44.0882039,62.4925714 L42.8736157,62.4925714 L42.8736157,57.6994286 C42.8736157,56.1108571 42.0843608,55.2217143 40.7560471,55.2217143 C39.5255373,55.2217143 38.4974588,56.1428571 38.4974588,57.7634286 L38.4974588,62.4925714 L37.2965176,62.4925714 L37.2965176,57.6674286 C37.2965176,56.1291429 36.4913412,55.2217143 35.1971451,55.2217143 C33.902949,55.2217143 32.9226353,56.3028571 32.9226353,57.8091429 L32.9226353,62.4925714 L31.7057725,62.4925714 L31.7057725,54.2868571 Z" id="Fill-16" fill="#FEFEFE"></path>
                <path d="M46.8417255,62.4937143 L48.0563137,62.4937143 L48.0563137,54.288 L46.8417255,54.288 L46.8417255,62.4937143 Z M46.7621176,52.4937143 L48.1518431,52.4937143 L48.1518431,51.1451429 L46.7621176,51.1451429 L46.7621176,52.4937143 Z" id="Fill-18" fill="#FEFEFE"></path>
                <path d="M50.8835294,54.2868571 L52.1003922,54.2868571 L52.1003922,55.7131429 C52.6371765,54.8262857 53.4901176,54.1108571 54.8934902,54.1108571 C56.8700392,54.1108571 58.0232157,55.4434286 58.0232157,57.3977143 L58.0232157,62.4925714 L56.8063529,62.4925714 L56.8063529,57.6994286 C56.8063529,56.1748571 55.9829804,55.2217143 54.5454902,55.2217143 C53.1398431,55.2217143 52.1003922,56.2548571 52.1003922,57.7931429 L52.1003922,62.4925714 L50.8835294,62.4925714 L50.8835294,54.2868571 Z" id="Fill-20" fill="#FEFEFE"></path>
                <polygon id="Fill-21" fill="#FEFEFE" points="21.3883686 18.1954286 31.0322902 18.1954286 31.0322902 21.0342857 24.6795843 21.0342857 24.6795843 22.8605714 30.4363686 22.8605714 30.4363686 25.4937143 24.6795843 25.4937143 24.6795843 27.4045714 31.1187216 27.4045714 31.1187216 30.2457143 21.3883686 30.2457143"></polygon>
                <path d="M32.4586353,24.2557714 L32.4586353,24.2214857 C32.4586353,20.7083429 35.1448314,17.9540571 38.7772235,17.9540571 C41.2291451,17.9540571 42.8053804,18.9826286 43.8675765,20.4660571 L41.3656157,22.4112 C40.6787137,21.5494857 39.8917333,21.0009143 38.7453804,21.0009143 C37.0622431,21.0009143 35.8840471,22.4272 35.8840471,24.1849143 L35.8840471,24.2214857 C35.8840471,26.0272 37.0622431,27.4443429 38.7453804,27.4443429 C39.9963608,27.4443429 40.733302,26.8546286 41.4520471,25.9769143 L43.9540078,27.7689143 C42.821302,29.3323429 41.2996549,30.4866286 38.6430275,30.4866286 C35.2176157,30.4866286 32.4586353,27.8512 32.4586353,24.2557714" id="Fill-22" fill="#FEFEFE"></path>
                <path d="M57.5428392,22.1618286 C57.3881725,21.7298286 56.921898,21.5012571 56.4851922,21.6544 C56.0575843,21.8075429 55.8301333,22.2829714 55.9825255,22.7149714 C56.1553882,23.2018286 56.2418196,23.7138286 56.2418196,24.2349714 C56.2418196,26.7584 54.1947608,28.8155429 51.6859765,28.8155429 C49.1703686,28.8155429 47.1301333,26.7584 47.1301333,24.2349714 C47.1301333,22.0909714 48.6085647,20.3035429 50.5896627,19.8052571 C50.987702,20.8589714 51.9862118,21.6178286 53.1712314,21.6178286 L53.4691922,21.5995429 L53.4691922,20.4909714 L55.6686431,20.4909714 L56.0075451,20.1458286 L55.6686431,19.8029714 L53.4691922,19.8029714 L53.4691922,17.8486857 L55.6686431,17.8486857 L56.0075451,17.5058286 L55.6686431,17.1629714 L53.4691922,17.1629714 L53.4691922,16.0498286 L53.1712314,16.0338286 C51.8906824,16.0338286 50.8603294,16.9252571 50.537349,18.1138286 C47.6600941,18.6555429 45.4742902,21.1881143 45.4742902,24.2349714 C45.4742902,27.6749714 48.2628392,30.4772571 51.6859765,30.4772571 C55.1091137,30.4772571 57.8931137,27.6749714 57.8931137,24.2349714 C57.8931137,23.5241143 57.7771137,22.8269714 57.5428392,22.1618286" id="Fill-23" fill="#FEFEFE"></path>
            </g>
        </g>
    </g>
</svg>