<?xml version="1.0" encoding="UTF-8"?>
<svg width="120px" height="120px" viewBox="0 0 120 120" version="1.1" xmlns="http://www.w3.org/2000/svg" xmlns:xlink="http://www.w3.org/1999/xlink">
    <!-- Generator: Sketch 41.2 (35397) - http://www.bohemiancoding.com/sketch -->
    <title>icn-2cups</title>
    <desc>Created with Sketch.</desc>
    <defs></defs>
    <g id="Media" stroke="none" stroke-width="1" fill="none" fill-rule="evenodd">
        <g id="icn-2cups">
            <g transform="translate(20.000000, 20.000000)">
                <path d="M40,78 C60.9868205,78 78,60.9868205 78,40 C78,19.0131795 60.9868205,2 40,2 C19.0131795,2 2,19.0131795 2,40 C2,60.9868205 19.0131795,78 40,78 Z M40,80 C17.90861,80 0,62.09139 0,40 C0,17.90861 17.90861,0 40,0 C62.09139,0 80,17.90861 80,40 C80,62.09139 62.09139,80 40,80 Z" id="Oval" fill="#FFFFFF"></path>
                <path d="M66.6162353,33.5782171 C65.6256471,35.4535695 61.0185882,39.038941 57.0538824,41.7952838 L59.2232941,27.3380648 C61.2562353,27.2601219 65.8821176,27.5152076 67.1668235,29.4944838 C67.7527059,30.4014552 67.5668235,31.7737219 66.6162353,33.5782171 L66.6162353,33.5782171 Z M41.1997647,41.8543314 C42.9574118,41.8354362 45.3221176,42.1968076 45.9432941,43.155741 C46.3291765,43.7533029 45.9338824,44.7736457 45.5362353,45.5318171 C44.9738824,46.5946743 42.4374118,48.6448076 39.9032941,50.4563886 L41.1997647,41.8543314 Z M35.0609412,61.9942933 C35.0468235,62.1737981 34.9103529,63.2980648 34.1244706,63.9782933 C33.7809412,64.2782552 33.3197647,64.5026362 32.6585882,64.5026362 L24.6162353,64.5026362 C22.6468235,64.5026362 22.1668235,62.1289219 22.1268235,61.8856457 L19.6327059,45.3003505 L26.9338824,45.3003505 L30.0491765,45.3003505 L30.0915294,45.3003505 L37.5668235,45.3003505 L35.2044706,61.0259124 L35.1338824,61.507741 L35.0609412,61.9942933 Z M47.5550588,61.1534552 L38.2985882,61.1534552 L39.2774118,54.6416838 C41.4774118,53.1938362 46.9691765,49.4077029 48.2585882,46.9773029 C49.6797647,44.2823695 49.188,42.4944076 48.5221176,41.4740648 C47.0656471,39.2326171 43.6115294,38.8216457 41.6609412,38.7720457 L42.1574118,35.4606552 L28.5715294,35.4606552 L27.7174118,29.7802743 L55.748,29.7802743 L51.6656471,56.9350933 C51.6303529,57.3625981 51.1856471,61.1534552 47.5550588,61.1534552 L47.5550588,61.1534552 Z M69.7503529,27.8128076 C67.6232941,24.5321219 62.1221176,24.2132648 59.6938824,24.2345219 L60.4044706,19.4918171 L23.0538824,19.4918171 L25.4562353,35.4606552 L15.0421176,35.4606552 L19.0844706,62.3698362 C19.3832941,64.1743314 20.9221176,67.5896457 24.6162353,67.5896457 L32.6585882,67.5896457 C35.4632941,67.5896457 36.9362353,65.870179 37.6232941,64.2404648 L47.5550588,64.2404648 C52.7997647,64.2404648 54.5456471,59.622941 54.7244706,57.291741 L56.4327059,45.9404267 C59.1127059,44.1784457 67.5150588,38.4744457 69.3338824,35.0237029 C70.8538824,32.1516267 70.9903529,29.7259505 69.7503529,27.8128076 L69.7503529,27.8128076 Z" id="Fill-4" fill="#FEFEFE"></path>
            </g>
        </g>
    </g>
</svg>