<svg  xmlns="http://www.w3.org/2000/svg" viewBox="0 0 100 100">
	<g class="icon-stroke" stroke-linejoin="bevel">
		<path d="M4,23.5c0.4-6,2.6-11.7,7.4-16.2c1.9-1.8,3.6-4,7.6-3c1.6,0.4,3,1.2,4.1,2.3c4.6,4.5,9.1,9.1,13.6,13.7c2.5,2.5,2.3,6.6-0.3,9.2c-2.4,2.4-4.8,4.8-7.2,7.1c-0.4,0.4-0.5,1-0.2,1.5c3.7,6.8,7.9,13.4,13.4,18.9c5.8,5.7,12.5,9.8,19.5,14c0.5,0.3,0.8,0.3,1.2-0.2c2.3-2.4,4.7-4.8,7.1-7.1c2.3-2.3,5.4-2.9,8.1-1.4c1.2,0.6,2.1,1.7,3.1,2.6c4.2,4.2,8.4,8.4,12.6,12.6c2.5,2.6,2.6,6.6,0.2,9.3c-2.6,2.9-5.4,5.4-9,6.9c-3.6,1.5-7.3,2.1-11.2,1.7c-8.5-0.9-16.2-4-23.6-8.1c-3.7-2.1-7.2-4.4-10.5-7.1c-7-5.6-13.4-11.7-19.1-18.6c-2.9-3.5-5.7-7-8.3-10.7C7.2,43.5,3.3,33.1,4,23.5z"/>
	</g>
</svg>
