<svg xmlns="http://www.w3.org/2000/svg" viewBox="0 0 100 100">
    <g class="icon-stroke">
        <rect x="21.4" y="3.1" width="57.1" height="93.8"/>
        <line x1="21.4" y1="77.5" x2="78.6" y2="77.5"/>
        <line class="icon-fill" x1="78.6" y1="20.4" x2="21.4" y2="20.4"/>
    </g>
    <g class="icon-fill">
        <path d="M69.4,63.4v0.2c-5.8,2-12.9,0.4-16.6-3.3c-0.6-0.5-2.6-2.8-3.5-3.7c-1.8-2.1-4.3-5.5-6.3-8v10.6h-3.1V38c3.4,2.6,6.7,8,9.2,11.2c0,0,4.9,6.4,6.9,8.8c1.5,1.9,4.3,4,6.2,4.7C64.8,63.6,67.3,63.8,69.4,63.4z"/>
        <path d="M30.6,34.4c5.8-2,12.8-0.4,16.6,3.3c0.6,0.5,2.6,2.8,3.5,3.7c1.8,2.2,4.3,5.5,6.3,8V38.8h3.1V60c-3.4-2.6-6.7-8-9.2-11.2c0,0-4.9-6.4-6.9-8.8c-1.5-1.9-4.3-4-6.2-4.7c-2.5-1-5.2-1.1-7.1-0.7L30.6,34.4L30.6,34.4z"/>
    </g>
</svg>
