<svg xmlns="http://www.w3.org/2000/svg" width="42" height="42" viewBox="0 0 42 42">
    <g fill="none" fill-rule="evenodd" transform="translate(1 1)">
        <g fill="#474B68" fill-rule="nonzero">
            <path d="M13 15h2.813v10.313H13zM24.033 15c-1.609 0-2.688.834-3.13 1.625h-.043V15.25h-3.172v10.063h3.304v-4.978c0-1.313.264-2.584 1.985-2.584 1.696 0 1.718 1.501 1.718 2.668v4.893H28v-5.519C28 17.084 27.382 15 24.033 15z"/>
        </g>
        <circle cx="20" cy="20" r="20" stroke="#EEE"/>
    </g>
</svg>
