<svg xmlns="http://www.w3.org/2000/svg" width="14" height="18" viewBox="0 0 14 18">
    <g fill="none" fill-rule="evenodd" stroke="#C1351F" transform="translate(1 1)">
        <path d="M8.772 12.135c-.958 1.18-1.973 2.431-2.763 3.865A.023.023 0 0 1 6 16c-.795-1.452-1.824-2.754-2.793-3.98a65.291 65.291 0 0 1-1.059-1.365C.915 9.005 0 7.435 0 5.637 0 2.47 2.79-.105 6.213.003c3.65.116 6.31 3.334 5.7 6.706-.298 1.64-1.25 3.047-2.408 4.514-.237.3-.483.604-.733.912z"/>
        <circle cx="6" cy="6" r="2"/>
    </g>
</svg>
