﻿ID,Họ và tên,Giờ,Ngày,Trạng thái
20194138,Trương Quang Phú,16:25:06,09-01-2022,Muộn
20194138,Trương Quang Phú,16:41:15,09-01-2022,Muộn
1111111,Lê Văn Nam,16:41:21,09-01-2022,Muộn
20194138,Trương Quang Phú,16:41:25,09-01-2022,Muộn
1111111,Lê Văn Nam,16:41:27,09-01-2022,Muộn
20194138,Trương Quang Phú,16:41:30,09-01-2022,Muộn
20194138,Trương Quang Phú,16:41:32,09-01-2022,Muộn
20194138,Trương Quang Phú,16:41:34,09-01-2022,Muộn
1111111,Lê Văn Nam,16:41:36,09-01-2022,Muộn
20194138,Trương Quang Phú,16:41:38,09-01-2022,Muộn
20194138,Trương Quang Phú,16:41:46,09-01-2022,Muộn
1111111,Lê Văn Nam,16:41:48,09-01-2022,Muộn
20194138,Trương Quang Phú,16:41:51,09-01-2022,Muộn
20194138,Trương Quang Phú,16:41:53,09-01-2022,Muộn
20194138,Trương Quang Phú,16:41:56,09-01-2022,Muộn
20194138,Trương Quang Phú,20:37:46,09-01-2022,Muộn
20194138,Trương Quang Phú,20:38:06,09-01-2022,Muộn
20194138,Trương Quang Phú,20:38:10,09-01-2022,Muộn
20194138,Trương Quang Phú,20:38:16,09-01-2022,Muộn
20194138,Trương Quang Phú,20:38:21,09-01-2022,Muộn
20194138,Trương Quang Phú,20:38:29,09-01-2022,Muộn
20194138,Trương Quang Phú,20:38:32,09-01-2022,Muộn
22222222,Lê Minh Vũ,21:28:03,09-01-2022,Muộn
