<svg width="147" height="24" viewBox="0 0 147 24" fill="none" xmlns="http://www.w3.org/2000/svg">
<path d="M0.83325 24C0.534583 24 0.38525 23.84 0.38525 23.52V0.703999C0.38525 0.405332 0.51325 0.255999 0.76925 0.255999H3.84125C4.01192 0.255999 4.12925 0.277332 4.19325 0.32C4.27858 0.362666 4.34258 0.458666 4.38525 0.608L11.4893 18.944C11.5746 19.136 11.6599 19.232 11.7453 19.232C11.8306 19.2107 11.9159 19.104 12.0013 18.912L19.1053 0.671999C19.1906 0.394665 19.3506 0.255999 19.5853 0.255999H22.8173C23.0519 0.255999 23.1693 0.394665 23.1693 0.671999V23.52C23.1693 23.84 23.0093 24 22.6893 24H20.5773C20.4066 24 20.2786 23.968 20.1933 23.904C20.1293 23.84 20.0973 23.7333 20.0973 23.584V5.28C20.0973 5.17333 20.0759 5.13067 20.0333 5.152C19.9906 5.152 19.9586 5.19467 19.9373 5.28L12.8973 23.584C12.7906 23.8613 12.5879 24 12.2893 24H10.7533C10.4119 24 10.1986 23.872 10.1133 23.616L3.16925 5.472C3.12658 5.36533 3.08392 5.32267 3.04125 5.344C3.01992 5.344 3.00925 5.38667 3.00925 5.472V23.584C3.00925 23.7333 2.97725 23.84 2.91325 23.904C2.84925 23.968 2.73192 24 2.56125 24H0.83325ZM32.0733 0.255999C32.3293 0.255999 32.4573 0.394665 32.4573 0.671999V23.456C32.4573 23.6693 32.4146 23.8187 32.3293 23.904C32.2439 23.968 32.0946 24 31.8813 24H29.8653C29.6733 24 29.5453 23.968 29.4813 23.904C29.4173 23.84 29.3853 23.7227 29.3853 23.552V0.703999C29.3853 0.405332 29.5133 0.255999 29.7693 0.255999H32.0733ZM56.3305 0.255999C56.5652 0.255999 56.6825 0.383999 56.6825 0.639999V23.616C56.6825 23.744 56.6398 23.84 56.5545 23.904C56.4905 23.968 56.3945 24 56.2665 24H54.6985C54.5705 24 54.4532 23.9893 54.3465 23.968C54.2398 23.9467 54.1332 23.872 54.0265 23.744L41.6745 5.792C41.5678 5.64267 41.4825 5.57867 41.4185 5.6C41.3545 5.62133 41.3225 5.696 41.3225 5.824V23.584C41.3225 23.8613 41.1732 24 40.8745 24H39.0825C38.8052 24 38.6665 23.8613 38.6665 23.584V0.703999C38.6665 0.405332 38.8052 0.255999 39.0825 0.255999H40.9065C41.0772 0.255999 41.2052 0.277332 41.2905 0.32C41.3758 0.341333 41.4718 0.426666 41.5785 0.575998L53.5785 18.144C53.7065 18.2933 53.8132 18.3467 53.8985 18.304C54.0052 18.2613 54.0585 18.176 54.0585 18.048V0.639999C54.0585 0.383999 54.1865 0.255999 54.4425 0.255999H56.3305ZM65.5733 0.255999C65.8293 0.255999 65.9573 0.394665 65.9573 0.671999V23.456C65.9573 23.6693 65.9146 23.8187 65.8293 23.904C65.7439 23.968 65.5946 24 65.3813 24H63.3653C63.1733 24 63.0453 23.968 62.9813 23.904C62.9173 23.84 62.8853 23.7227 62.8853 23.552V0.703999C62.8853 0.405332 63.0133 0.255999 63.2693 0.255999H65.5733ZM72.1665 0.703999C72.1665 0.405332 72.2945 0.255999 72.5505 0.255999H86.6305C86.8438 0.255999 86.9505 0.373332 86.9505 0.608V2.24C86.9505 2.496 86.8118 2.624 86.5345 2.624H75.6545C75.3772 2.624 75.2385 2.752 75.2385 3.008V10.88C75.2385 11.1147 75.3558 11.232 75.5905 11.232H84.1345C84.3692 11.232 84.4865 11.3387 84.4865 11.552V13.248C84.4865 13.44 84.3692 13.536 84.1345 13.536H75.5905C75.3558 13.536 75.2385 13.6533 75.2385 13.888V23.584C75.2385 23.8613 75.0892 24 74.7905 24H72.6145C72.4438 24 72.3265 23.968 72.2625 23.904C72.1985 23.84 72.1665 23.7227 72.1665 23.552V0.703999ZM91.3853 0.703999C91.3853 0.405332 91.5133 0.255999 91.7693 0.255999H106.137C106.351 0.255999 106.457 0.373332 106.457 0.608V2.24C106.457 2.496 106.319 2.624 106.041 2.624H94.8733C94.5959 2.624 94.4573 2.752 94.4573 3.008V10.496C94.4573 10.7307 94.5746 10.848 94.8093 10.848H103.097C103.332 10.848 103.449 10.9653 103.449 11.2V12.896C103.449 12.9813 103.428 13.056 103.385 13.12C103.343 13.1627 103.247 13.184 103.097 13.184H94.8093C94.5746 13.184 94.4573 13.3013 94.4573 13.536V21.312C94.4573 21.5253 94.5639 21.632 94.7773 21.632H106.521C106.756 21.632 106.873 21.7387 106.873 21.952V23.648C106.873 23.7547 106.841 23.84 106.777 23.904C106.735 23.968 106.649 24 106.521 24H91.8333C91.5346 24 91.3853 23.8507 91.3853 23.552V0.703999ZM111.479 0.703999C111.479 0.405332 111.607 0.255999 111.863 0.255999H126.231C126.444 0.255999 126.551 0.373332 126.551 0.608V2.24C126.551 2.496 126.412 2.624 126.135 2.624H114.967C114.69 2.624 114.551 2.752 114.551 3.008V10.496C114.551 10.7307 114.668 10.848 114.903 10.848H123.191C123.426 10.848 123.543 10.9653 123.543 11.2V12.896C123.543 12.9813 123.522 13.056 123.479 13.12C123.436 13.1627 123.34 13.184 123.191 13.184H114.903C114.668 13.184 114.551 13.3013 114.551 13.536V21.312C114.551 21.5253 114.658 21.632 114.871 21.632H126.615C126.85 21.632 126.967 21.7387 126.967 21.952V23.648C126.967 23.7547 126.935 23.84 126.871 23.904C126.828 23.968 126.743 24 126.615 24H111.927C111.628 24 111.479 23.8507 111.479 23.552V0.703999ZM131.573 0.703999C131.573 0.405332 131.701 0.255999 131.957 0.255999H134.261C134.517 0.255999 134.645 0.394665 134.645 0.671999V21.312C134.645 21.5253 134.751 21.632 134.965 21.632H146.037C146.293 21.632 146.421 21.7387 146.421 21.952V23.648C146.421 23.7547 146.389 23.84 146.325 23.904C146.261 23.968 146.165 24 146.037 24H132.021C131.85 24 131.733 23.968 131.669 23.904C131.605 23.8187 131.573 23.7013 131.573 23.552V0.703999Z" fill="#0C0C0C"/>
</svg>
