<svg width="11" height="10" viewBox="0 0 11 10" fill="none" xmlns="http://www.w3.org/2000/svg">
<path d="M10.0703 9.34744V9.34705H10.0726V5.92924C10.0726 4.25723 9.71131 2.96924 7.74936 2.96924C6.80619 2.96924 6.17325 3.4849 5.91485 3.97377H5.88757V3.12533H4.02734V9.34705H5.96435V6.26628C5.96435 5.45513 6.11869 4.67076 7.12694 4.67076C8.12039 4.67076 8.1352 5.59647 8.1352 6.31832V9.34744H10.0703Z" fill="#252525"/>
<path d="M0.873047 3.13647H2.81239V9.35819H0.873047V3.13647Z" fill="#252525"/>
<path d="M1.84784 0.0388184C1.22776 0.0388184 0.724609 0.540112 0.724609 1.1579C0.724609 1.77568 1.22776 2.28746 1.84784 2.28746C2.46791 2.28746 2.97107 1.77568 2.97107 1.1579C2.97068 0.540112 2.46752 0.0388184 1.84784 0.0388184V0.0388184Z" fill="#252525"/>
</svg>
