<svg width="11" height="19" viewBox="0 0 11 19" fill="none" xmlns="http://www.w3.org/2000/svg">
<path d="M10.2079 0.753797L7.8297 0.75C5.15784 0.75 3.43117 2.51274 3.43117 5.24106V7.31173H1.03997C0.833341 7.31173 0.666016 7.47842 0.666016 7.68403V10.6842C0.666016 10.8898 0.833532 11.0563 1.03997 11.0563H3.43117V18.6267C3.43117 18.8323 3.5985 18.9988 3.80512 18.9988H6.92496C7.13159 18.9988 7.29891 18.8321 7.29891 18.6267V11.0563H10.0948C10.3014 11.0563 10.4687 10.8898 10.4687 10.6842L10.4699 7.68403C10.4699 7.5853 10.4304 7.49076 10.3604 7.4209C10.2903 7.35103 10.195 7.31173 10.0957 7.31173H7.29891V5.55639C7.29891 4.71271 7.50096 4.28441 8.60546 4.28441L10.2075 4.28384C10.414 4.28384 10.5813 4.11715 10.5813 3.91174V1.1259C10.5813 0.920674 10.4142 0.754177 10.2079 0.753797Z" fill="white"/>
</svg>
