<svg width="19" height="18" viewBox="0 0 19 18" fill="none" xmlns="http://www.w3.org/2000/svg">
<path d="M12.6406 0.75H6.15484C3.17029 0.75 0.75 3.15831 0.75 6.12809V12.5818C0.75 15.5516 3.17029 17.9599 6.15484 17.9599H12.6406C15.6252 17.9599 18.0455 15.5516 18.0455 12.5818V6.12809C18.0455 3.15831 15.6252 0.75 12.6406 0.75ZM16.424 12.5818C16.424 14.6577 14.7269 16.3465 12.6406 16.3465H6.15484C4.06857 16.3465 2.37145 14.6577 2.37145 12.5818V6.12809C2.37145 4.05215 4.06857 2.36343 6.15484 2.36343H12.6406C14.7269 2.36343 16.424 4.05215 16.424 6.12809V12.5818Z" fill="white"/>
<path d="M9.4059 5.0625C7.01805 5.0625 5.08203 6.98893 5.08203 9.36497C5.08203 11.741 7.01805 13.6674 9.4059 13.6674C11.7938 13.6674 13.7298 11.741 13.7298 9.36497C13.7298 6.98893 11.7938 5.0625 9.4059 5.0625ZM9.4059 12.054C7.91633 12.054 6.70348 10.8472 6.70348 9.36497C6.70348 7.88169 7.91633 6.67593 9.4059 6.67593C10.8955 6.67593 12.1083 7.88169 12.1083 9.36497C12.1083 10.8472 10.8955 12.054 9.4059 12.054Z" fill="white"/>
<path d="M14.0327 5.31652C14.3517 5.31652 14.6103 5.05919 14.6103 4.74175C14.6103 4.42432 14.3517 4.16699 14.0327 4.16699C13.7137 4.16699 13.4551 4.42432 13.4551 4.74175C13.4551 5.05919 13.7137 5.31652 14.0327 5.31652Z" fill="white"/>
</svg>
