[   
    
    {
        "ProductNameTH": "ริบบิ้นคอตตอนครีม (ผ้าดิบ)/ คอตตอนขาว พิมพ์ชื่อร้าน Cottonica",
        "ProductNameEN": "Cream Cotton / White Cotton",
        "DescriptionTH": "ริบบิ้นคอตตอนครีม (ผ้าดิบ)/ คอตตอนขาว พิมพ์ชื่อร้าน Cottonica",
        "DescriptionEN": "Cream Cotton / White Cotton",
        "ImageUrl": "./assets/images/products/354435423_744235630875203_948116084219107893_n.jpeg",
        "ribbonType":"Cream_cotton",
        "ribbonColour":"Cream",
        "type":"Printing",
        "colour":"Brown"
    },
    {
        "ProductNameTH": "ริบบิ้นคอตตอนครีม (ผ้าดิบ)/ คอตตอนขาว พิมพ์ชื่อร้าน BanVila",
        "ProductNameEN": "Cream Cotton / White Cotton",
        "DescriptionTH": "ริบบิ้นคอตตอนครีม (ผ้าดิบ)/ คอตตอนขาว พิมพ์ชื่อร้าน BanVila",
        "DescriptionEN": "Cream Cotton / White Cotton",
        "ImageUrl": "./assets/images/products/354186111_744235484208551_8391401654754099366_n.jpeg",
        "ribbonType":"Cream_cotton",
        "ribbonColour":"Cream",
        "type":"Printing",
        "colour":"Dark_Brown"
    },
    {
        "ProductNameTH": "ริบบิ้นคอตตอนครีม (ผ้าดิบ)/ คอตตอนขาว พิมพ์ชื่อร้าน Venita",
        "ProductNameEN": "Cream Cotton / White Cotton",
        "DescriptionTH": "ริบบิ้นคอตตอนครีม (ผ้าดิบ)/ คอตตอนขาว พิมพ์ชื่อร้าน Venita",
        "DescriptionEN": "Cream Cotton / White Cotton",
        "ImageUrl": "./assets/images/products/354076693_744235514208548_4041381385536461229_n.jpeg",
        "ribbonType":"Cream_cotton",
        "ribbonColour":"Cream",
        "type":"Printing",
        "colour":"Brown"
    },

    {
        "ProductNameTH": "ริบบิ้นคอตตอนครีม (ผ้าดิบ)/ คอตตอนขาว พิมพ์ชื่อร้าน Sonite decor",
        "ProductNameEN": "Cream Cotton / White Cotton",
        "DescriptionTH": "ริบบิ้นคอตตอนครีม (ผ้าดิบ)/ คอตตอนขาว พิมพ์ชื่อร้าน Sonite decor",
        "DescriptionEN": "Cream Cotton / White Cotton",
        "ImageUrl": "./assets/images/products/354183471_744235597541873_2577796303855027818_n.jpeg",
        "ribbonType":"Cream_cotton",
        "ribbonColour":"Cream",
        "type":"Printing",
        "colour":"Black"
    },
    {
        "ProductNameTH": "ริบบิ้นคอตตอนครีม (ผ้าดิบ)/ คอตตอนขาว พิมพ์ชื่อร้าน Wassa",
        "ProductNameEN": "Cream Cotton / White Cotton",
        "DescriptionTH": "ริบบิ้นคอตตอนครีม (ผ้าดิบ)/ คอตตอนขาว พิมพ์ชื่อร้าน Wassa",
        "DescriptionEN": "Cream Cotton / White Cotton",
        "ImageUrl": "./assets/images/products/353841479_744235494208550_5990172832701929606_n.jpeg",
        "ribbonType":"Cream_cotton",
        "ribbonColour":"Cream",
        "type":"Printing",
        "colour":"Dark_Blue"
    },
    {
        "ProductNameTH": "ริบบิ้นคอตตอนครีม (ผ้าดิบ)/ คอตตอนขาว พิมพ์ชื่อร้าน re leep",
        "ProductNameEN": "Cream Cotton / White Cotton",
        "DescriptionTH": "ริบบิ้นคอตตอนครีม (ผ้าดิบ)/ คอตตอนขาว พิมพ์ชื่อร้าน re leep",
        "DescriptionEN": "Cream Cotton / White Cotton",
        "ImageUrl": "./assets/images/products/354182344_744235457541887_1780687022266311303_n.jpeg",
        "ribbonType":"Cream_cotton",
        "ribbonColour":"Cream",
        "type":"Printing",
        "colour":"Blue"
    },
    {
        "ProductNameTH": "ริบบิ้นออกานดี้ แสตมป์ 1 สี",
        "ProductNameEN": "Organdy ribbon",
        "DescriptionTH": "ริบบิ้นออกานดี้ แสตมป์ 1 สี",
        "DescriptionEN": "Organdy ribbon",
        "ImageUrl": "./assets/images/products/250784359_2988942971354555_6220845918268155531_n.jpeg",
        "ribbonType":"Organdy_ribbon",
        "ribbonColour":"Red",
        "type":"Printing",
        "colour":"Gold"
    },
    {
        "ProductNameTH": "ริบบิ้นผ้าดิบ แสตมป์ 1 สี",
        "ProductNameEN": "Cream cotton ribbon",
        "DescriptionTH": "ริบบิ้นผ้าดิบ แสตมป์ 1 สี",
        "DescriptionEN": "Cream cotton ribbon",
        "ImageUrl": "./assets/images/products/120621905_2706203386295183_3268980165816123408_n.jpeg",
        "ribbonType":"Cream_cotton",
        "ribbonColour":"Cream",
        "type":"Printing",
        "colour":"Blue"
    },
    {
        "ProductNameTH": "ริบบิ้นต่วน พิมพ์เงิน",
        "ProductNameEN": "Tuan",
        "DescriptionTH": "ริบบิ้นต่วน พิมพ์เงิน",
        "DescriptionEN": "Tuan",
        "ImageUrl": "./assets/images/products/120733686_2706151439633711_7228859752253540329_n.jpeg",
        "ribbonType":"Tuan",
        "ribbonColour":"Blue",
        "type":"Printing",
        "colour":"Silver"
    },
    {
        "ProductNameTH": "ริบบิ้นออกานดี้ แสตมป์ 1 สี",
        "ProductNameEN": "Organdy ribbon",
        "DescriptionTH": "ริบบิ้นออกานดี้ แสตมป์ 1 สี",
        "DescriptionEN": "Organdy ribbon",
        "ImageUrl": "./assets/images/products/250946828_2988942961354556_582341749348420186_n.jpeg",
        "ribbonType":"Organdy_ribbon",
        "ribbonColour":"Cream",
        "type":"Printing",
        "colour":"Black"
    },
    {
        "ProductNameTH": "ริบบิ้นออกานดี้ แสตมป์ 1 สี",
        "ProductNameEN": "Organdy ribbon",
        "DescriptionTH": "ริบบิ้นออกานดี้ แสตมป์ 1 สี",
        "DescriptionEN": "Organdy ribbon",
        "ImageUrl": "./assets/images/products/269849071_3029573063958212_5259443131695609090_n.jpeg",
        "ribbonType":"Organdy_ribbon",
        "ribbonColour":"Blue",
        "type":"Printing",
        "colour":"Gold"
    },
    {
        "ProductNameTH": "ริบบิ้นกรอสเกรน สกรีน 1 สี",
        "ProductNameEN": "Green Grosgrain",
        "DescriptionTH": "ริบบิ้นกรอสเกรน สกรีน 1 สี",
        "DescriptionEN": "Green Grosgrain",
        "ImageUrl": "./assets/images/products/290375252_3166425500272967_8845483716531960433_n.jpeg",
        "ribbonType":"Grosgrain",
        "ribbonColour":"Green",
        "type":"Screen",
        "colour":"white"
    },
    {
        "ProductNameTH": "ริบบิ้นกรอสเกรน สกรีน 1 สี",
        "ProductNameEN": "Blue Grosgrain",
        "DescriptionTH": "ริบบิ้นกรอสเกรน สกรีน 1 สี",
        "DescriptionEN": "Blue Grosgrain",
        "ImageUrl": "./assets/images/products/286782446_3153089701606547_115133165819336939_n.jpeg",
        "ribbonType":"Grosgrain",
        "ribbonColour":"Blue",
        "type":"Printing",
        "colour":"white"
    },
    {
        "ProductNameTH": "ริบบิ้นซาตินสีขาว พิมพ์ชื่อร้าน ชื่อแบรนด์ ข้อความตามสั่ง",
        "ProductNameEN": "White satin with black label",
        "DescriptionTH": "ริบบิ้นซาตินสีขาว พิมพ์ชื่อร้าน ชื่อแบรนด์ ข้อความตามสั่ง",
        "DescriptionEN": "White satin with black label",
        "ImageUrl": "./assets/images/products/286662802_3153090911606426_2307410246782653272_n.jpeg",
        "ribbonType":"Satin",
        "ribbonColour":"White",
        "type":"Printing",
        "colour":"black"
    },

    {
        "ProductNameTH": "ริบบิ้นคอตตอนครีม (ผ้าดิบ)/ คอตตอนขาว พิมพ์ชื่อร้าน ชื่อแบรนด์ โลโก้ ข้อความตามสั่ง",
        "ProductNameEN": "Cream Cotton / White Cotton",
        "DescriptionTH": "ริบบิ้นคอตตอนครีม (ผ้าดิบ)/ คอตตอนขาว พิมพ์ชื่อร้าน ชื่อแบรนด์ โลโก้ ข้อความตามสั่ง",
        "DescriptionEN": "Cream Cotton / White Cotton",
        "ImageUrl": "./assets/images/products/280710382_3132886190293565_1299806640701046082_n.jpeg",
        "ribbonType":"Cream_cotton",
        "ribbonColour":"Cream",
        "type":"Printing",
        "colour":"multicolour"
    },

    {
        "ProductNameTH": "ริบบิ้นคอตตอนครีม (ผ้าดิบ)/ คอตตอนขาว พิมพ์ชื่อร้าน ชื่อแบรนด์ โลโก้ ข้อความตามสั่ง",
        "ProductNameEN": "Cream Cotton / White Cotton",
        "DescriptionTH": "ริบบิ้นคอตตอนครีม (ผ้าดิบ)/ คอตตอนขาว พิมพ์ชื่อร้าน ชื่อแบรนด์ โลโก้ ข้อความตามสั่ง",
        "DescriptionEN": "Cream Cotton / White Cotton",
        "ImageUrl": "./assets/images/products/286713651_3153091691606348_6902219218499844737_n.jpeg",
        "ribbonType":"Cream_cotton",
        "ribbonColour":"Cream",
        "type":"Printing",
        "colour":"multicolour"
    },
    {
        "ProductNameTH": "ริบบิ้นกรอสเกรน สกรีน 1 สี",
        "ProductNameEN": "Blue Gross gain while label",
        "DescriptionTH": "ริบบิ้นกรอสเกรน สกรีน 1 สี",
        "DescriptionEN": "Blue Gross gain while label",
        "ImageUrl": "./assets/images/products/286674509_3153092178272966_890217445240656867_n.jpeg",
        "ribbonType":"Grosgrain",
        "ribbonColour":"blue",
        "type":"Screen",
        "colour":"white"
    },
    {
        "ProductNameTH": "ริบบิ้นผ้าต่วน พิมพ์ชื่อร้าน ชื่อแบรนด์ ข้อความตามสั่ง ปั้มฟอยล์สีเงิน หรือทอง",
        "ProductNameEN": "Gold Tuan stamped logo",
        "DescriptionTH": "ริบบิ้นผูกกล่องทุเรียน ผูกกล่องผลไม้ กระเช้าผลไม้",
        "DescriptionEN": "Decorated giftbox with customed stamped Ribbon",
        "ImageUrl": "./assets/images/products/286648129_3153097794939071_3911008837623290037_n.jpeg",
        "ribbonType":"Tuan",
        "ribbonColour":"gold",
        "type":"Stamped",
        "colour":"gold"
    },
    {
        "ProductNameTH": "ริบบิ้นต่วนพิมพ์สีเทา สีน้ำตาลอ่อน SONGKHLA Thailand",
        "ProductNameEN": "Black Tuan with SONGKHLA Thailand logo",
        "DescriptionTH": "ริบบิ้นต่วนพิมพ์สีเทา สีน้ำตาลอ่อน SONGKHLA Thailand",
        "DescriptionEN": "Black Tuan with SONGKHLA Thailand logo",
        "ImageUrl": "./assets/images/products/ipadimage10.jpg",
        "ribbonType":"Tuan",
        "ribbonColour":"black",
        "type":"Printing",
        "colour":"multicolour"
    },
    {
        "ProductNameTH": "ริบบิ้นต่วนพิมพ์เคทอง เคเงิน Our Wedding Day",
        "ProductNameEN": "White and Gold Tuan with Our Wedding Day logo",
        "DescriptionTH": "ริบบิ้นต่วนพิมพ์เคทอง เคเงิน Our Wedding Day",
        "DescriptionEN": "White and Gold Tuan with Our Wedding Day logo",
        "ImageUrl": "./assets/images/products/74226516_2408902922691899_7139162706052907008_o.jpg",
        "ribbonType":"Tuan",
        "ribbonColour":"WhiteAndGold",
        "type":"Stampping",
        "colour":"goldsilver"
    },
    {
        "ProductNameTH": "ริบบิ้นต่วนพิมพ์เคทอง SENA",
        "ProductNameEN": "Light Green Tuan with SENA logo",
        "DescriptionTH": "ริบบิ้นต่วนพิมพ์เคทอง SENA",
        "DescriptionEN": "Light Green Tuan with SENA logo",
        "ImageUrl": "./assets/images/products/ipadimage07.jpg",
        "ribbonType":"Tuan",
        "ribbonColour":"lightGreen",
        "type":"Stampping",
        "colour":"gold"
    },
    {
        "ProductNameTH": "ริบบิ้นซาตินมีขอบ PETCH PRADUB PLOY 1995",
        "ProductNameEN": "Border satin ribbon PETCH PRADUB PLOY 1995",
        "DescriptionTH": "ริบบิ้นซาตินมีขอบ PETCH PRADUB PLOY 1995",
        "DescriptionEN": "Border satin ribbon PETCH PRADUB PLOY 1995",
        "ImageUrl": "./assets/images/products/ipadimage11.jpg",
        "ribbonType":"Border_satin",
        "ribbonColour":"white",
        "type":"Printing",
        "colour":"gray"
    },
    {
        "ProductNameTH": "ริบบิ้นต่วนพิมพ์เคเงิน surgi plus",
        "ProductNameEN": "Blue Tuan with surgi plus logo",
        "DescriptionTH": "ริบบิ้นต่วนพิมพ์เคเงิน surgi plus",
        "DescriptionEN": "Blue Tuan with surgi plus logo",
        "ImageUrl": "./assets/images/products/ipadimage08.jpg",
        "ribbonType":"Tuan",
        "ribbonColour":"Blue",
        "type":"Stampping",
        "colour":"silver"
    },
    {
        "ProductNameTH": "ริบบิ้นต่วนพิมพ์สีเทา สีน้ำตาลอ่อน O Me",
        "ProductNameEN": "Black Tuan with O Me logo",
        "DescriptionTH": "ริบบิ้นต่วนพิมพ์สีเทา สีน้ำตาลอ่อน O Me",
        "DescriptionEN": "Black Tuan with O Me logo",
        "ImageUrl": "./assets/images/products/ipadimage09.jpg",
        "ribbonType":"Tuan",
        "ribbonColour":"black",
        "type":"Printing",
        "colour":"multicolour"
    },
    {
        "ProductNameTH": "ริบบิ้นต่วนพิมพ์สีดำ NOS",
        "ProductNameEN": "Red Tuan with NOS logo ",
        "DescriptionTH": "ริบบิ้นต่วนพิมพ์สีดำ NOS",
        "DescriptionEN": "Red Tuan with NOS logo",
        "ImageUrl": "./assets/images/products/ipadimage04.jpg",
        "ribbonType":"Tuan",
        "ribbonColour":"red",
        "type":"Printing",
        "colour":"black"
    },
    {
        "ProductNameTH": "ริบบิ้นซาตินพิมพ์ Creation logo",
        "ProductNameEN": "Satin ribbon with Creation logo",
        "DescriptionTH": "ริบบิ้นซาตินพิมพ์ Creation logo",
        "DescriptionEN": "Satin ribbon with Creation logo",
        "ImageUrl": "./assets/images/products/ipadimage05.jpg",
        "ribbonType":"Satin",
        "ribbonColour":"white",
        "type":"Printing",
        "colour":"black"
    },
    {
        "ProductNameTH": "ริบบิ้นพิมพ์เคเงิน ซาติน Zero",
        "ProductNameEN": "Green Tuan, with Zero logo",
        "DescriptionTH": "ริบบิ้นพิมพ์เคเงิน ซาติน Zero",
        "DescriptionEN": "Green Tuan, with Zero logo",
        "ImageUrl": "./assets/images/products/ipadimage06.jpg",
        "ribbonType":"Tuan",
        "ribbonColour":"green",
        "type":"Stampping",
        "colour":"silver"
    },
    {
        "ProductNameTH": "ริบบิ้นซาตินมีขอบ Signature",
        "ProductNameEN": "Border satin ribbon Signature",
        "DescriptionTH": "ริบบิ้นซาตินมีขอบ Signature",
        "DescriptionEN": "Border satin ribbon Signature",
        "ImageUrl": "./assets/images/products/ipadimage01.jpg",
        "ribbonType":"Border_satin",
        "ribbonColour":"multicolour",
        "type":"Stampping",
        "colour":"multicolour"
    },
    {
        "ProductNameTH": "ริบบิ้นพิมพ์สีเหลือง ผ้ากลอสเกรน ทานตะวัน",
        "ProductNameEN": "Groosgrain Yellow ribbon sunny",
        "DescriptionTH": "ริบบิ้นพิมพ์สีเหลือง ผ้ากลอสเกรน ทานตะวัน",
        "DescriptionEN": "Groosgrain Yellow ribbon sunny",
        "ImageUrl": "./assets/images/products/ipadimage02.jpg",
        "ribbonType":"Grossgrain",
        "ribbonColour":"cream",
        "type":"Printing",
        "colour":"yellow"
    },
    {
        "ProductNameTH": "ริบบิ้นพิมพ์เคทอง ซาตินมีขอบ bakie douly",
        "ProductNameEN": "Border Satin dark blue ribbon bakie douly",
        "DescriptionTH": "ริบบิ้นพิมพ์เคทอง ซาตินมีขอบ bakie douly",
        "DescriptionEN": "Border Satin dark blue ribbon bakie douly",
        "ImageUrl": "./assets/images/products/ipadimage03.jpg",
        "ribbonType":"Border_satin",
        "ribbonColour":"darkblue",
        "type":"Stampping",
        "colour":"gold"
    },
    {
        "ProductNameTH": "ริบบิ้นพิมพ์สีเทา ผ้ากลอสเกรน Shopmuk",
        "ProductNameEN": "Groosgrain Gray ribbon Shopmuk",
        "DescriptionTH": "ริบบิ้นพิมพ์สีเทา ผ้ากลอสเกรน Shopmuk",
        "DescriptionEN": "Groosgrain Gray ribbon Shopmuk",
        "ImageUrl": "./assets/images/products/70707285_2384777691771089_1310222353950572544_o.jpg",
        "ribbonType":"Cream_cotton",
        "ribbonColour":"cream",
        "type":"Stampping",
        "colour":"gray"
    },
    {
        "ProductNameTH": "ริบบิ้นซาตินพิมพ์สีเขียว Patitta",
        "ProductNameEN": "Customed White satin ribbon, Patitta",
        "DescriptionTH": "ริบบิ้นซาตินพิมพ์สีเขียว Patitta",
        "DescriptionEN": "Customed White satin ribbon, Patitta",
        "ImageUrl": "./assets/images/products/70986100_2384777675104424_7304810862991114240_o.jpg",
        "ribbonType":"Satin",
        "ribbonColour":"white",
        "type":"print",
        "colour":"green"
    },
    {
        "ProductNameTH": "ริบบิ้นซาตินพิมพ์สีขาว Path.",
        "ProductNameEN": "Customed White satin ribbon, Path.",
        "DescriptionTH": "ริบบิ้นซาตินพิมพ์สีขาว Path.",
        "DescriptionEN": "Customed White satin ribbon, Path.",
        "ImageUrl": "./assets/images/products/70638233_2384777581771100_6824553147575304192_o.jpg",
        "ribbonType":"Satin",
        "ribbonColour":"white",
        "type":"print",
        "colour":"gray"
    },
    {
        "ProductNameTH": "ริบบิ้น แสตมป์เคเงิน SCB Happy New Year",
        "ProductNameEN": "Stampping Silver Tuan ribbon, SCB Happy New Year",
        "DescriptionTH": "ริบบิ้น แสตมป์เคเงิน SCB Happy New Year",
        "DescriptionEN": "Stampping Gold Tuan ribbon, SCB Happy New Year",
        "ImageUrl": "./assets/images/products/71823047_2390251924556999_7429377941210923008_n.jpg",
        "ribbonType":"Tuan",
        "ribbonColour":"purple",
        "type":"k_stampping",
        "colour":"silver"
    },
    {
        "ProductNameTH": "ริบบิ้นค๊อตต่อนครีม พิมพ์สีดำ Linin",
        "ProductNameEN": "Customed ribbon, Linin",
        "DescriptionTH": "ริบบิ้นค๊อตต่อนครีม พิมพ์สีดำ Linin",
        "DescriptionEN": "Customed ribbon, Linin",
        "ImageUrl": "./assets/images/products/71299781_2390255551223303_564721395502678016_o.jpg",
        "ribbonType":"Cream_cotton",
        "ribbonColour":"cream",
        "type":"printing",
        "colour":"black"
    },
    {
        "ProductNameTH": "ริบบิ้นซาตินพิมพ์สีเทา EXO",
        "ProductNameEN": "Customed Gray satin ribbon, EXO",
        "DescriptionTH": "ริบบิ้นซาตินพิมพ์สีเทา EXO",
        "DescriptionEN": "Customed Gray satin ribbon, EXO",
        "ImageUrl": "./assets/images/products/70962966_2391118967803628_3693216453407801344_o.jpg",
        "ribbonType":"Satin",
        "ribbonColour":"black",
        "type":"print",
        "colour":"gray"
    },
    {
        "ProductNameTH": "ริบบิ้น แสตมป์เคทอง FLOWER@RAYONG",
        "ProductNameEN": "Stampping Gold Tuan ribbon, FLOWER@RAYONG",
        "DescriptionTH": "ริบบิ้น แสตมป์เคทอง FLOWER@RAYONG",
        "DescriptionEN": "Stampping Gold Tuan ribbon, FLOWER@RAYONG",
        "ImageUrl": "./assets/images/products/69714435_2373903612858497_4366662867244548096_o.jpg",
        "ribbonType":"Satin",
        "ribbonColour":"multi-colour",
        "type":"k_stampping",
        "colour":"multi-colour"
    },
    {
        "ProductNameTH": "ริบบิ้นซาตินมีขอบ แสตมป์เคเงิน M Concrete",
        "ProductNameEN": "Stampping Silver Border satin ribbon, M Concrete",
        "DescriptionTH": "ริบบิ้นซาตินมีขอบ แสตมป์เคเงิน M Concrete",
        "DescriptionEN": "Stampping Silver Border satin ribbon, M Concrete",
        "ImageUrl": "./assets/images/products/70510175_2376335435948648_7222949099861966848_o.jpg",
        "ribbonType":"Border_satin",
        "ribbonColour":"blue",
        "type":"k_stampping",
        "colour":"gold,silver"
    },
    {
        "ProductNameTH": "ริบบิ้นพิมพ์สีเทา harumiki",
        "ProductNameEN": "Customed Gray Border satin ribbon, BYBLOOMFLOWER",
        "DescriptionTH": "ริบบิ้นพิมพ์สีเทา harumiki",
        "DescriptionEN": "Customed Gray Border satin ribbon, BYBLOOMFLOWER",
        "ImageUrl": "./assets/images/products/71381590_2384785645103627_1175445202165301248_o.jpg",
        "ribbonType":"Border_satin",
        "ribbonColour":"multi-colour",
        "type":"print",
        "colour":"gray"
    },
    {
        "ProductNameTH": "ริบบิ้นสกรีน ต่วน ไทยทราเวล โกลบอล เซอร์วิส",
        "ProductNameEN": "Screened Tuan ribbon, Thai travel global service",
        "DescriptionTH": "ริบบิ้นสกรีน ต่วน ไทยทราเวล โกลบอล เซอร์วิส",
        "DescriptionEN": "Screened Tuan ribbon, Thai travel global service",
        "ImageUrl": "./assets/images/products/69695348_2376334062615452_2997532915115491328_o.jpg",
        "ribbonType":"Tuan",
        "ribbonColour":"orange",
        "type":"Screen",
        "colour":"white"
    },
    {
        "ProductNameTH": "ริบบิ้นต่วน แสตมป์เคเงิน Teddy Rose Bangkok",
        "ProductNameEN": "Stampping Silver Tuan ribbon, Teddy Rose Bangkok",
        "DescriptionTH": "ริบบิ้นต่วน แสตมป์เคเงิน Teddy Rose Bangkok",
        "DescriptionEN": "Stampping Silver Tuan ribbon, Teddy Rose Bangkok",
        "ImageUrl": "./assets/images/products/70452679_2373904639525061_6228135245615464448_o.jpg",
        "ribbonType":"Tuan",
        "ribbonColour":"silver",
        "type":"k_stampping",
        "colour":"gold"
    },
    {
        "ProductNameTH": "ริบบิ้นต่วน แสตมป์เคเงิน BYBLOOMFLOWER",
        "ProductNameEN": "Stampping Silver Tuan ribbon, BYBLOOMFLOWER",
        "DescriptionTH": "ริบบิ้นต่วน แสตมป์เคเงิน BYBLOOMFLOWER",
        "DescriptionEN": "Stampping Silver Tuan ribbon, BYBLOOMFLOWER",
        "ImageUrl": "./assets/images/products/70562783_2373903836191808_2684722879215435776_o.jpg",
        "ribbonType":"Tuan",
        "ribbonColour":"multi-colour",
        "type":"k_stampping",
        "colour":"silver"
    },
    {
        "ProductNameTH": "ริบบิ้นสกรีน ผ้ากลอสเกรน Seven stars",
        "ProductNameEN": "Customed Grossgrain ribbon even stars",
        "DescriptionTH": "ริบบิ้นสกรีน Grossgrain ribbon even stars",
        "DescriptionEN": "Customed Grossgrain ribbon even stars",
        "ImageUrl": "./assets/images/products/67201677_2336046933310832_1281380201153953792_o.jpg",
        "ribbonType":"Grosgrain",
        "type":"Screen"
    },
    {
        "ProductNameTH": "ริบบิ้นสกรีน ผ้ากลอสเกรน Muang Kaen",
        "ProductNameEN": "Customed Grossgrain ribbon Muang Kaen",
        "DescriptionTH": "ริบบิ้นสกรีน Grossgrain ribbon Muang Kaen",
        "DescriptionEN": "Customed Grossgrain ribbon Muang Kaen",
        "ImageUrl": "./assets/images/products/66882043_2336046896644169_1826852390754582528_o.jpg",
        "ribbonType":"Grosgrain",
        "type":"Screen"
    },
    {
        "ProductNameTH": "ริบบิ้นสกรีน ผ้ากลอสเกรน Groovy",
        "ProductNameEN": "Customed Grossgrain ribbon Groovy",
        "DescriptionTH": "ริบบิ้นสกรีน Grossgrain ribbon Groovy",
        "DescriptionEN": "Customed Grossgrain ribbon Groovy",
        "ImageUrl": "./assets/images/products/66518677_2336046863310839_3780199703044423680_n.jpg",
        "ribbonType":"Grosgrain",
        "type":"Screen"
    },
    {
        "ProductNameTH": "ริบบิ้นสกรีน TORR",
        "ProductNameEN": "Customed ribbon TORR",
        "DescriptionTH": "ริบบิ้นสกรีน ribbon TORR",
        "DescriptionEN": "Customed ribbon TORR",
        "ImageUrl": "./assets/images/products/67130104_2336046873310838_761842316871729152_n.jpg",
        "ribbonType":"Grosgrain",
        "type":"Screen"
    },
    {
        "ProductNameTH": "ริบบิ้นต่วน แสตมป์ เค เงิน be Home",
        "ProductNameEN": "Tuan ribbon with stamping silver K, be Home",
        "DescriptionTH": "ริบบิ้นต่วน แสตมป์ เค เงิน be Home",
        "DescriptionEN": "Tuan ribbon with stamping silver K, be Home",
        "ImageUrl": "./assets/images/products/67943510_2345956518986540_1346117938263883776_o.jpg",
        "ribbonType":"Tuan",
        "type":"stampping K"
    },
    {
        "ProductNameTH": "ริบบิ้นซาตินมีขอบ พุทธรักษา ขนมไทย",
        "ProductNameEN": "Stampping ribbon, พุทธรักษา ขนมไทย",
        "DescriptionTH": "ริบบิ้นซาตินมีขอบ พุทธรักษา ขนมไทย",
        "DescriptionEN": "Stampping ribbon, พุทธรักษา ขนมไทย",
        "ImageUrl": "./assets/images/products/67509026_2356194071296118_1981460196819468288_o.jpg",
        "ribbonType":"Border_satin",
        "type":"stampping K"
    },
    {
        "ProductNameTH": "ริบบิ้นสกรีน ริบบิ้นผูกผม สตรีราชินูทิศ",
        "ProductNameEN": "Customed ribbon สตรีราชินูทิศ",
        "DescriptionTH": "ริบบิ้นสกรีน ริบบิ้นผูกผม สตรีราชินูทิศ",
        "DescriptionEN": "Customed ribbon สตรีราชินูทิศ",
        "ImageUrl": "./assets/images/products/67343049_2336050899977102_6890107551241732096_n.jpg",
        "ribbonType":"Border_satin"
    },
    {
        "ProductNameTH": "ริบบิ้นซาติน Happy birth day",
        "ProductNameEN": "Customed ribbon, Happy birth day",
        "DescriptionTH": "ริบบิ้นซาติน  Happy birth day",
        "DescriptionEN": "Customed ribbon, Happy birth day",
        "ImageUrl": "./assets/images/products/68581760_2361146070800918_7246756571735130112_o.jpg",
        "ribbonType":"Tuan"
    },
    {
        "ProductNameTH": "ริบบิ้นสกรีน MONO MAX",
        "ProductNameEN": "Screened ribbon, MONO MAX",
        "DescriptionTH": "ริบบิ้นสกรีน MONO MAX",
        "DescriptionEN": "Screened MONO MAX",
        "ImageUrl": "./assets/images/products/70641329_2369861769929348_6569435204044193792_o.jpg",
        "ribbonType":"Tuan"
    },
    {
        "ProductNameTH": "ริบบิ้นพิมพ์ผ้าดิบ เข้าใจธรรม",
        "ProductNameEN": "Cream cotton ribbon เข้าใจธรรม",
        "DescriptionTH": "ริบบิ้นพิมพ์ผ้าดิบ เข้าใจธรรม",
        "DescriptionEN": "Cream cotton เข้าใจธรรม",
        "ImageUrl": "./assets/images/products/67176710_2342096122705913_6144187172057513984_o.jpg",
        "ribbonType":"Cream_cotton"
    },
    {
        "ProductNameTH": "ริบบิ้นพิมพ์ผ้าดิบ SN Handmade",
        "ProductNameEN": "Customed ribbon, SN Handmade",
        "DescriptionTH": "ริบบิ้นพิมพ์ผ้าดิบ SN Handmade",
        "DescriptionEN": "Customed ribbon, SN Handmade",
        "ImageUrl": "./assets/images/products/67418617_2342096046039254_8785662341942345728_n.jpg",
        "ribbonType":"Cream_cotton"
    },
    {
        "ProductNameTH": "ริบบิ้นสกรีน ริบบิ้นผูกผม",
        "ProductNameEN": "Screened ribbon",
        "DescriptionTH": "ริบบิ้นสกรีน ริบบิ้นผูกผม",
        "DescriptionEN": "Screened ribbon",
        "ImageUrl": "./assets/images/products/66958602_2336050919977100_2805870149855346688_n.jpg",
        "ribbonType":"Border_satin"
    },
    {
        "ProductNameTH": "ริบบิ้นพิมพ์เคทอง Happy Anniversary",
        "ProductNameEN": "Stampping Gold ribbon, Happy Anniversary",
        "DescriptionTH": "ริบบิ้นพิมพ์เคทอง Happy Anniversary",
        "DescriptionEN": "Stampping Gold ribbon, Happy Anniversary",
        "ImageUrl": "./assets/images/products/69208021_2361146097467582_4919846842423836672_o.jpg",
        "ribbonType":"Border_satin"
    },
    {
        "ProductNameTH": "ริบบิ้นสี Daddy Told",
        "ProductNameEN": "Customed ribbon, Daddy Told",
        "DescriptionTH": "ริบบิ้นสี Daddy Told",
        "DescriptionEN": "Customed ribbon, Daddy Told",
        "ImageUrl": "./assets/images/products/67516439_2347285175520341_4988972601591201792_o.jpg",
        "ribbonType":"Border_satin"
    },
    {
        "ProductNameTH": "ริบบิ้นพิมพ์เคทอง ประจักษ์เบเกอรี่",
        "ProductNameEN": "Stampping K Gold on ribbon, ประจักษ์เบเกอรี่",
        "DescriptionTH": "ริบบิ้นพิมพ์เคทอง ประจักษ์เบเกอรี่",
        "DescriptionEN": "Stampping K Gold on ribbon, ประจักษ์เบเกอรี่",
        "ImageUrl": "./assets/images/products/67444195_2347285208853671_1874341152656719872_o.jpg",
        "ribbonType":"Border_satin"
    },
    {
        "ProductNameTH": "ริบบิ้นพิมพ์สี MamyAnn",
        "ProductNameEN": "Customed ribbon, MamyAnn",
        "DescriptionTH": "ริบบิ้นพิมพ์สี MamyAnn",
        "DescriptionEN": "Customed ribbon, MamyAnn",
        "ImageUrl": "./assets/images/products/68877450_2361156744133184_7357412525761101824_o.jpg",
        "ribbonType":"White_cotton"
    },
    {
        "ProductNameTH": "ริบบิ้นพิมพ์สีเขียว น้ำเงิน VP Embroider",
        "ProductNameEN": "Customed ribbon with Green, Blue logo",
        "DescriptionTH": "ริบบิ้นพิมพ์สีเขียว น้ำเงิน VP Embroider",
        "DescriptionEN": "Customed ribbon with Green, Blue logo",
        "ImageUrl": "./assets/images/products/68776954_2361156640799861_4234177681807114240_o.jpg",
        "ribbonType":"Satin"
    },
    {
        "ProductNameTH": "ริบบิ้นสีชื่อ",
        "ProductNameEN": "Customed ribbon",
        "DescriptionTH": "ริบบิ้นสีชื่อ",
        "DescriptionEN": "Customed ribbon",
        "ImageUrl": "./assets/images/products/68752537_2361156500799875_6871889579872354304_o.jpg",
        "ribbonType":"Satin"
    },
    {
        "ProductNameTH": "ริบบิ้นดำพิมพ์สีน้ำตาล Bank Boxer",
        "ProductNameEN": "Customed ribbon, Bank Boxer",
        "DescriptionTH": "ริบบิ้นดำพิมพ์สีน้ำตาล Bank Boxer",
        "DescriptionEN": "Customed ribbon, Bank Boxer",
        "ImageUrl": "./assets/images/products/69115151_2361156470799878_6011120778760683520_o.jpg",
        "ribbonType":"Satin"
    },
    {
        "ProductNameTH": "ริบบิ้นผ้าดิบพิมส์เขียว",
        "ProductNameEN": "Customed ribbon with Green logo",
        "DescriptionTH": "ริบบิ้นผ้าดิบพิมส์เขียว",
        "DescriptionEN": "Customed ribbon with Green logo",
        "ImageUrl": "./assets/images/products/69267342_2361156427466549_3621630949290147840_o.jpg",
        "ribbonType":"White_cotton"
    },
    {
        "ProductNameTH": "ริบบิ้นสี Thai technical",
        "ProductNameEN": "Customed ribbon with Purple logo, Thai technical",
        "DescriptionTH": "ริบบิ้นสี Thai technical",
        "DescriptionEN": "Customed ribbon with Purple logo, Thai technical",
        "ImageUrl": "./assets/images/products/68561012_2361156380799887_5725966307862511616_o.jpg",
        "ribbonType":"White_cotton"
    },
    {
        "ProductNameTH": "ริบบิ้นพิมพ์สี Pook Pun",
        "ProductNameEN": "Customed ribbon, Pook Pun",
        "DescriptionTH": "ริบบิ้นพิมพ์สี Pook Pun",
        "DescriptionEN": "Customed ribbon, Pook Pun",
        "ImageUrl": "./assets/images/products/68961233_2361156317466560_7227618158809448448_o.jpg",
        "ribbonType":"Cotton"
    },
    {
        "ProductNameTH": "ริบบิ้นผ้าดิบพิมส์สีดำ the hagnature",
        "ProductNameEN": "Customed ribbon with black logo, the hagnature",
        "DescriptionTH": "ริบบิ้นผ้าดิบพิมส์สีดำ the hagnature",
        "DescriptionEN": "Customed ribbon with black logo, the hagnature",
        "ImageUrl": "./assets/images/products/69320537_2361156224133236_497430205845995520_o.jpg",
        "ribbonType":"Cream_cotton"
    },
    {
        "ProductNameTH": "ริบบิ้นสีน้ำเงิน DKK SHOP",
        "ProductNameEN": "Customed ribbon with blue logo, DKK SHOP",
        "DescriptionTH": "ริบบิ้นสีน้ำเงิน DKK SHOP",
        "DescriptionEN": "Customed ribbon with blue logo, DKK SHOP",
        "ImageUrl": "./assets/images/products/68766878_2361152744133584_7722627832756568064_o.jpg",
        "ribbonType": "White_cotton"
    },
    {
        "ProductNameTH": "ริบบิ้นพิมพ์สีดำ Nine Chill Clothes",
        "ProductNameEN": "Customed ribbon, Nine Chill Clothes",
        "DescriptionTH": "ริบบิ้นพิมพ์สีดำ Nine Chill Clothes",
        "DescriptionEN": "Customed ribbon, Nine Chill Clothes",
        "ImageUrl": "./assets/images/products/69307979_2361152677466924_6968030953914499072_o.jpg",
        "ribbonType": "Satin"
    },
    {
        "ProductNameTH": "ริบบิ้นผ้าดิบพิมส์สีดำ Catty Quilt",
        "ProductNameEN": "Customed ribbon with black logo, Catty Quilt",
        "DescriptionTH": "ริบบิ้นผ้าดิบพิมส์สีดำ Catty Quilt",
        "DescriptionEN": "Customed ribbon with black logo, Catty Quilt",
        "ImageUrl": "./assets/images/products/68880106_2361152760800249_7007824040660303872_n.jpg",
        "ribbonType":"Cream_cotton"
    },
    {
        "ProductNameTH": "ริบบิ้นเคเงิน Soberry",
        "ProductNameEN": "Ribbon stamp K Silver, Soberry",
        "DescriptionTH": "ริบบิ้นเคเงิน Soberry",
        "DescriptionEN": "Silver Stampping on Ribbon, Soberry",
        "ImageUrl": "./assets/images/products/68730535_2361163284132530_2126622669720780800_o.jpg",
        "ribbonType": "Tuan"
    },
    {
        "ProductNameTH": "ริบบิ้นเคเงิน เคทอง เลิศรส ",
        "ProductNameEN": "Silver and Gold Stampping on Ribbon, เลิศรส",
        "DescriptionTH": "ริบบิ้นเคเงิน เคทอง เลิศรส",
        "DescriptionEN": "Gold and Silver Stampping on Ribbon, เลิศรส",
        "ImageUrl": "./assets/images/products/68755076_2361163214132537_6331612312130027520_o.jpg",
        "ribbonType": "Tuan"
    },
    {
        "ProductNameTH": "ริบบิ้นเคทอง Exotic Travel",
        "ProductNameEN": "Gold Stampping on Ribbon, Exotic Travel",
        "DescriptionTH": "ริบบิ้นเคทอง Exotic Travel",
        "DescriptionEN": "Gold Stampping on Ribbon Exotic Travel",
        "ImageUrl": "./assets/images/products/68706217_2361163187465873_8044015970613723136_o.jpg",
        "ribbonType": "Tuan"
    },
    {
        "ProductNameTH": "ริบบิ้นเคทอง Best for you",
        "ProductNameEN": "Ribbon stamp K Gold, Best for you",
        "DescriptionTH": "ริบบิ้นเคทอง Best for you",
        "DescriptionEN": "Gold Stampping on Ribbon, Best for you",
        "ImageUrl": "./assets/images/products/68570000_2361163220799203_8654041132126175232_o.jpg",
        "ribbonType": "Tuan"
    },
    {
        "ProductNameTH": "ริบบิ้นเคทอง Goggy Fruit",
        "ProductNameEN": "Gold Stampping on Ribbon Goggy Fruit",
        "DescriptionTH": "ริบบิ้นเคทอง Goggy Fruit",
        "DescriptionEN": "Gold Stampping on Ribbon",
        "ImageUrl": "./assets/images/products/68584458_2361163317465860_4892321754233438208_o.jpg",
        "ribbonType": "Tuan"
    },
    {
        "ProductNameTH": "ริบบิ้นเคทอง Mother day",
        "ProductNameEN": "Gold Stampping on Ribbon",
        "DescriptionTH": "ริบบิ้นเคทอง",
        "DescriptionEN": "Gold Stampping on Ribbon",
        "ImageUrl": "./assets/images/products/69057464_2361163750799150_7350462590071341056_o.jpg",
        "ribbonType": "Tuan"
    },
    {
        "ProductNameTH": "ริบบิ้นสกรีน 76 Tour",
        "ProductNameEN": "Screened Ribbon 76 Tour",
        "DescriptionTH": "ริบบิ้นสกรีน",
        "DescriptionEN": "Screened ribbon",
        "ImageUrl": "./assets/images/products/69625993_2363932507188941_7745669395996737536_o.jpg",
        "ribbonType": "Tuan"
    },
    {
        "ProductNameTH": "ริบบิ้นสกรีน 76 Tour",
        "ProductNameEN": "Screened Ribbon 76 Tour",
        "DescriptionTH": "ริบบิ้นสกรีน 76 Tour",
        "DescriptionEN": "Customed ribbon with Gold",
        "ImageUrl": "./assets/images/products/69205417_2363932737188918_1497612902356484096_o.jpg",
        "ribbonType": "Tuan"
    },
    {
        "ProductNameTH": "ริบบิ้นสกรีน 76 Tour",
        "ProductNameEN": "Screened Ribbon 76 Tour",
        "DescriptionTH": "ริบบิ้นสกรีน 76 Tour",
        "DescriptionEN": "Customed ribbon with Gold",
        "ImageUrl": "./assets/images/products/69010798_2363932653855593_524438304528007168_o.jpg",
        "ribbonType": "Tuan"
    },
    {
        "ProductNameTH": "ริบบิ้นพิมพ์ Planet Blue",
        "ProductNameEN": "Printed Ribbon",
        "DescriptionTH": "ริบบิ้นพิมพ์",
        "DescriptionEN": "Customed ribbon",
        "ImageUrl": "./assets/images/products/69638435_2363943237187868_1794066989828800512_o.jpg",
        "ribbonType": "Satin"
    },
    {
        "ProductNameTH": "ริบบิ้นสกรีน",
        "ProductNameEN": "Screened Ribbon",
        "DescriptionTH": "ริบบิ้นสกรีน",
        "DescriptionEN": "Customed ribbon with Silver stamping ",
        "ImageUrl": "./assets/images/products/66718776_2336050896643769_6181672456911060992_o.jpg",
        "ribbonType": "Border_satin"
    },
    {
        "ProductNameTH": "ริบบิ้นสกรีน",
        "ProductNameEN": "Screened Ribbon",
        "DescriptionTH": "ริบบิ้นสกรีน",
        "DescriptionEN": "Customed ribbon with Silver stamping ",
        "ImageUrl": "./assets/images/products/67096098_2336050916643767_6739722793245474816_o.jpg",
        "ribbonType": "Border_satin"
    },
    {
        "ProductNameTH": "ริบบิ้นสกรีน",
        "ProductNameEN": "Screened Ribbon",
        "DescriptionTH": "ริบบิ้นสกรีน",
        "DescriptionEN": "Customed ribbon with Silver stamping ",
        "ImageUrl": "./assets/images/products/66846565_2336048456644013_5989279800613666816_o.jpg",
        "ribbonType": "Border_satin"
    },
    {
        "ProductNameTH": "ริบบิ้นพิมพ์เคเงินเคทอง",
        "ProductNameEN": "Ribbon stamp K Silver K Gold",
        "DescriptionTH": "ริบบิ้นพิมพ์เคเงินเคทอง",
        "DescriptionEN": "Customed ribbon with Silver stamping",
        "ImageUrl": "./assets/images/products/66788786_2336044853311040_3623732738781085696_o.jpg",
        "ribbonType": "Border_satin"
    },
    {
        "ProductNameTH": "ริบบิ้นพิมพ์เคเงินเคทอง",
        "ProductNameEN": "Ribbon stamp K Silver K Gold",
        "DescriptionTH": "ริบบิ้นพิมพ์เคเงินเคทอง",
        "DescriptionEN": "Customed ribbon with Silver stamping",
        "ImageUrl": "./assets/images/products/66803171_2336044839977708_7751161082915323904_n.jpg",
        "ribbonType": "Border_satin"
    },
    {
        "ProductNameTH": "ริบบิ้นพิมพ์เคเงินเคทอง",
        "ProductNameEN": "Ribbon stamp K Silver K Gold",
        "DescriptionTH": "ริบบิ้นพิมพ์เคเงินเคทอง",
        "DescriptionEN": "Customed ribbon with Silver stamping",
        "ImageUrl": "./assets/images/products/67246075_2336044879977704_7322656181523054592_o.jpg",
        "ribbonType": "Border_satin"
    },
    {
        "ProductNameTH": "ริบบิ้นพิมพ์เคเงินเคทอง",
        "ProductNameEN": "Ribbon stamp K Silver K Gold",
        "DescriptionTH": "ริบบิ้นพิมพ์เคเงินเคทอง",
        "DescriptionEN": "Customed ribbon with Silver stamping",
        "ImageUrl": "./assets/images/products/54435831_2260927434156116_8412277341429956608_o.jpg",
        "ribbonType": "Border_satin"
    },
    {
        "ProductNameTH": "ริบบิ้นพิมพ์เคเงินเคทอง",
        "ProductNameEN": "Ribbon stamp K Silver K Gold",
        "DescriptionTH": "ริบบิ้นพิมพ์เคเงินเคทอง",
        "DescriptionEN": "Customed ribbon with Silver stamping",
        "ImageUrl": "./assets/images/products/54523391_2260927974156062_3254294405191827456_o.jpg",
        "ribbonType": "Tuan"
    },
    {
        "ProductNameTH": "ริบบิ้นพิมพ์เคเงินเคทอง",
        "ProductNameEN": "Ribbon stamp K Silver K Gold",
        "DescriptionTH": "ริบบิ้นพิมพ์เคเงินเคทอง",
        "DescriptionEN": "Customed ribbon with Silver stamping",
        "ImageUrl": "./assets/images/products/55576550_2260927954156064_6810093032071757824_o.jpg",
        "ribbonType": "Tuan"
    },
    {
        "ProductNameTH": "ริบบิ้นพิมพ์สี",
        "ProductNameEN": "Customed ribbon",
        "DescriptionTH": "ริบบิ้นพิมพ์สี",
        "DescriptionEN": "Customed ribbon",
        "ImageUrl": "./assets/images/products/57160941_2276614312587428_920385150498373632_o.jpg",
        "ribbonType": "Border_satin"
    },
    {
        "ProductNameTH": "ริบบิ้นพิมพ์เคเงินเคทอง",
        "ProductNameEN": "Ribbon stamp K Silver K Gold",
        "DescriptionTH": "ริบบิ้นพิมพ์เคเงินเคทอง",
        "DescriptionEN": "Customed ribbon with Silver stamping",
        "ImageUrl": "./assets/images/products/56899548_2271165759798950_5760212667683831808_o.jpg",
        "ribbonType":"Tuan"
    },
    {
        "ProductNameTH": "ริบบิ้นพิมพ์เคเงินเคทอง",
        "ProductNameEN": "Ribbon stamp K Silver K Gold",
        "DescriptionTH": "ริบบิ้นพิมพ์เคเงินเคทอง",
        "DescriptionEN": "Customed ribbon with Silver stamping ",
        "ImageUrl": "./assets/images/products/57001893_2271165756465617_6417720329036103680_n.jpg",
        "ribbonType":"Tuan"
    },
    {
        "ProductNameTH": "ริบบิ้นพิมพ์เคเงินเคทอง",
        "ProductNameEN": "Ribbon stamp K Silver K Gold",
        "DescriptionTH": "ริบบิ้นพิมพ์เคเงินเคทอง",
        "DescriptionEN": "Customed ribbon with Silver stamping ",
        "ImageUrl": "./assets/images/products/S__35643409-Recovered.jpg",
        "ribbonType":"Border_satin"
    },
    {
        "ProductNameTH": "ริบบิ้นพิมพ์สีฟ้า",
        "ProductNameEN": "Ribbon with blue logo",
        "DescriptionTH": "ริบบิ้นพิมพ์สีฟ้า",
        "DescriptionEN": "Customed ribbon with Silver stamping ",
        "ImageUrl": "./assets/images/products/65504752_2324943934421132_4497772134138904576_o.jpg",
        "ribbonType":"Cotton"
    },
    {
        "ProductNameTH": "ริบบิ้นสกรีน",
        "ProductNameEN": "Screened Ribbon",
        "DescriptionTH": "ริบบิ้นสกรีน",
        "DescriptionEN": "Customed ribbon with Silver stamping ",
        "ImageUrl": "./assets/images/products/65318533_2324942844421241_1017544706667577344_n.jpg",
        "ribbonType":"Tuan"
    },
    {
        "ProductNameTH": "ริบบิ้นพิมพ์เคเงิน",
        "ProductNameEN": "Ribbon stamp K Silver",
        "DescriptionTH": "ริบบิ้นพิมพ์เคเงิน",
        "DescriptionEN": "Customed ribbon with Silver stamping ",
        "ImageUrl": "./assets/images/products/62161702_2312366175678908_4584903182190116864_o.jpg",
        "ribbonType":"Tuan"
    },
    {
        "ProductNameTH": "ริบบิ้นพิมพ์เคทอง",
        "ProductNameEN": "Ribbon stamp K Gold",
        "DescriptionTH": "ริบบิ้นพิมพ์เคทอง",
        "DescriptionEN": "Customed ribbon with Gold stamping ",
        "ImageUrl": "./assets/images/products/62006058_2309430032639189_7860332442840727552_o.jpg",
        "ribbonType":"Tuan"
    },
    {
        "ProductNameTH": "ริบบิ้นพิมพ์โลโก้",
        "ProductNameEN": "Printed ribbon",
        "DescriptionTH": "ริบบิ้นพิมพ์โลโก้",
        "DescriptionEN": "Customed ribbon with Color printing ",
        "ImageUrl": "./assets/images/products/60943213_2301503833431809_8912315017626386432_o.jpg",
        "ribbonType":"Tuan"
    },
    {
        "ProductNameTH": "ริบบิ้นพิมพ์เคทอง",
        "ProductNameEN": "",
        "DescriptionTH": "",
        "DescriptionEN": "",
        "ImageUrl": "./assets/images/products/56421000_2271165713132288_6222436601402753024_o.jpg",
        "ribbonType":"Tuan"
    },
    {
        "ProductNameTH": "ริบบิ้นพิมพ์เคเงิน",
        "ProductNameEN": "",
        "DescriptionTH": "",
        "DescriptionEN": "",
        "ImageUrl": "./assets/images/products/57034812_2271165699798956_6906121877970747392_o.jpg",
        "ribbonType":"Tuan"
    },
    {
        "ProductNameTH": "ริบบิ้นพิมพ์เคเงิน",
        "ProductNameEN": "",
        "DescriptionTH": "",
        "DescriptionEN": "",
        "ImageUrl": "./assets/images/products/56935170_2271165753132284_8093452650508451840_o.jpg",
        "ribbonType":"Tuan"
    },
    {
        "ProductNameTH": "ริบบิ้นพิมพ์โลโก้",
        "ProductNameEN": "",
        "DescriptionTH": "",
        "DescriptionEN": "",
        "ImageUrl": "./assets/images/products/60336398_2292423287673197_5001620756291911680_o.jpg",
        "ribbonType":"Satin"
    },
    {
        "ProductNameTH": "ริบบิ้นพิมพ์ลาย",
        "ProductNameEN": "",
        "DescriptionTH": "",
        "DescriptionEN": "",
        "ImageUrl": "./assets/images/products/51861621_2240572489524944_5818108285668032512_n.jpg",
        "ribbonType":"Border_satin"
    },
    {
        "ProductNameTH": "ริบบิ้นพิมพ์ลาย",
        "ProductNameEN": "",
        "DescriptionTH": "",
        "DescriptionEN": "",
        "ImageUrl": "./assets/images/products/55538072_2260927440822782_6869884732088254464_n.jpg",
        "ribbonType":"Tuan"
    },
    {
        "ProductNameTH": "ริบบิ้นพิมพ์โลโก้",
        "ProductNameEN": "",
        "DescriptionTH": "",
        "DescriptionEN": "",
        "ImageUrl": "./assets/images/products/60191199_2292423464339846_1031077766365184000_o.jpg",
        "ribbonType":"Satin"
    },
    {
        "ProductNameTH": "ป้ายเสื้อ",
        "ProductNameEN": "",
        "DescriptionTH": "",
        "DescriptionEN": "",
        "ImageUrl": "./assets/images/products/60251814_2292423411006518_3027434258386911232_o.jpg",
        "ribbonType":"Satin"
    },
    {
        "ProductNameTH": "ริบบิ้นพิมพ์ลาย",
        "ProductNameEN": "",
        "DescriptionTH": "",
        "DescriptionEN": "",
        "ImageUrl": "./assets/images/products/60344654_2292423441006515_7929108424166473728_o.jpg",
        "ribbonType":"Satin"
    },
    {
        "ProductNameTH": "ริบบิ้นผ้าดิบพิมพ์ลาย",
        "ProductNameEN": "",
        "DescriptionTH": "",
        "DescriptionEN": "",
        "ImageUrl": "./assets/images/products/60484605_2292422114339981_8870341732466688000_n.jpg",
        "ribbonType":"Cream_cotton"
    },
    {
        "ProductNameTH": "ริบบิ้นพิมพ์โลโก้",
        "ProductNameEN": "",
        "DescriptionTH": "",
        "DescriptionEN": "",
        "ImageUrl": "./assets/images/products/60407599_2292423334339859_9187235835588640768_n.jpg",
        "ribbonType":"Satin"
    },
    {
        "ProductNameTH": "ริบบิ้นพิมพ์ลาย",
        "ProductNameEN": "",
        "DescriptionTH": "",
        "DescriptionEN": "",
        "ImageUrl": "./assets/images/products/60276372_2292423344339858_8354667033828261888_o.jpg",
        "ribbonType":"Satin"
    },
    {
        "ProductNameTH": "ริบบิ้นพิมพ์ลาย",
        "ProductNameEN": "",
        "DescriptionTH": "",
        "DescriptionEN": "",
        "ImageUrl": "./assets/images/products/60597683_2297262873855905_2994373580122226688_o.jpg",
        "ribbonType":"White_cotton"
    },
    {
        "ProductNameTH": "โบว์ผูกผมโรงเรียน",
        "ProductNameEN": "",
        "DescriptionTH": "",
        "DescriptionEN": "",
        "ImageUrl": "./assets/images/products/60337510_2292418614340331_5854116926405476352_o.jpg",
        "ribbonType":"Border_satin"
    },
    {
        "ProductNameTH": "ริบบิ้นผ้าดิบพิมพ์ลาย",
        "ProductNameEN": "",
        "DescriptionTH": "",
        "DescriptionEN": "",
        "ImageUrl": "./assets/images/products/60221621_2292422057673320_2001305531297300480_n.jpg",
        "ribbonType":"Cream_cotton"
    },
    {
        "ProductNameTH": "ริบบิ้นเคทอง",
        "ProductNameEN": "",
        "DescriptionTH": "",
        "DescriptionEN": "",
        "ImageUrl": "./assets/images/products/52115557_2237460746502785_2295193779537182720_n.jpg",
        "ribbonType":"Tuan"
    },
    {
        "ProductNameTH": "ริบบิ้นเคเงินเคทอง",
        "ProductNameEN": "",
        "DescriptionTH": "",
        "DescriptionEN": "",
        "ImageUrl": "./assets/images/products/51699147_2237460713169455_6149364106592780288_n.jpg",
        "ribbonType":"Tuan"
    },
    {
        "ProductNameTH": "ริบบิ้นผูกกล่องดอกไม้",
        "ProductNameEN": "",
        "DescriptionTH": "",
        "DescriptionEN": "",
        "ImageUrl": "./assets/images/products/51582857_2237452743170252_5929067030593404928_n.jpg",
        "ribbonType":"Tuan"
    },
    {
        "ProductNameTH": "ริบบิ้นแต่งงาน",
        "ProductNameEN": "",
        "DescriptionTH": "",
        "DescriptionEN": "",
        "ImageUrl": "./assets/images/products/51046996_2230587663856760_326870006480502784_n.jpg",
        "ribbonType":"Tuan"
    },
    {
        "ProductNameTH": "ริบบิ้นแต่งงาน",
        "ProductNameEN": "",
        "DescriptionTH": "",
        "DescriptionEN": "",
        "ImageUrl": "./assets/images/products/51168192_2230587773856749_5602825094360465408_n.jpg",
        "ribbonType":"Tuan"
    },
    {
        "ProductNameTH": "ริบบิ้นแต่งงาน",
        "ProductNameEN": "",
        "DescriptionTH": "",
        "DescriptionEN": "",
        "ImageUrl": "./assets/images/products/50876752_2230588217190038_2343055542169108480_n.jpg",
        "ribbonType":"Border_satin"
    },
    {
        "ProductNameTH": "ริบบิ้นแต่งงาน",
        "ProductNameEN": "",
        "DescriptionTH": "",
        "DescriptionEN": "",
        "ImageUrl": "./assets/images/products/51548053_2230587677190092_3463756936560771072_n.jpg",
        "ribbonType":"Tuan"
    },
    {
        "ProductNameTH": "ริบบิ้นแต่งงาน",
        "ProductNameEN": "",
        "DescriptionTH": "",
        "DescriptionEN": "",
        "ImageUrl": "./assets/images/products/51289010_2230587647190095_6131164431784083456_n.jpg",
        "ribbonType":"Border_satin"
    },
    {
        "ProductNameTH": "ริบบิ้นแต่งงาน",
        "ProductNameEN": "",
        "DescriptionTH": "",
        "DescriptionEN": "",
        "ImageUrl": "./assets/images/products/50836356_2230587713856755_1960486638857486336_n.jpg",
        "ribbonType":"Tuan"
    },
    {
        "ProductNameTH": "ริบบิ้นแต่งงาน",
        "ProductNameEN": "",
        "DescriptionTH": "",
        "DescriptionEN": "",
        "ImageUrl": "./assets/images/products/51041757_2230587740523419_629561524632944640_n.jpg",
        "ribbonType":"Tuan"
    },
    {
        "ProductNameTH": "ริบบิ้นแต่งงาน",
        "ProductNameEN": "",
        "DescriptionTH": "",
        "DescriptionEN": "",
        "ImageUrl": "./assets/images/products/51075903_2230587910523402_8227778981051498496_n.jpg",
        "ribbonType":"Tuan"
    },
    {
        "ProductNameTH": "ริบบิ้นแต่งงาน",
        "ProductNameEN": "",
        "DescriptionTH": "",
        "DescriptionEN": "",
        "ImageUrl": "./assets/images/products/51461769_2230587820523411_2725193376793100288_n.jpg",
        "ribbonType":"Tuan"
    },
    {
        "ProductNameTH": "ริบบิ้นผ้าดิบ",
        "ProductNameEN": "",
        "DescriptionTH": "",
        "DescriptionEN": "",
        "ImageUrl": "./assets/images/products/51818499_2240573672858159_9196950708014809088_n.jpg",
        "ribbonType":"Cream_cotton"
    },
    {
        "ProductNameTH": "ริบบิ้นผ้าดิบ",
        "ProductNameEN": "",
        "DescriptionTH": "",
        "DescriptionEN": "",
        "ImageUrl": "./assets/images/products/52599378_2240573646191495_668358930585354240_n.jpg",
        "ribbonType":"Cream_cotton"
    },
    {
        "ProductNameTH": "ริบบิ้นผูกดอกไม้พิมพ์เคเงิน",
        "ProductNameEN": "",
        "DescriptionTH": "",
        "DescriptionEN": "",
        "ImageUrl": "./assets/images/products/51709363_2237460699836123_5150030915958734848_n.jpg",
        "ribbonType":"Tuan"
    },
    {
        "ProductNameTH": "ริบบิ้นผ้าดิบ",
        "ProductNameEN": "",
        "DescriptionTH": "",
        "DescriptionEN": "",
        "ImageUrl": "./assets/images/products/52126753_2240573729524820_1375591885044711424_n.jpg",
        "ribbonType":"Cream_cotton"
    },
    {
        "ProductNameTH": "ริบบิ้นผ้าดิบ",
        "ProductNameEN": "",
        "DescriptionTH": "",
        "DescriptionEN": "",
        "ImageUrl": "./assets/images/products/51882877_2240573712858155_4477419439469363200_n.jpg",
        "ribbonType":"Cream_cotton"
    },
    {
        "ProductNameTH": "ริบบิ้นผ้าดิบ",
        "ProductNameEN": "",
        "DescriptionTH": "",
        "DescriptionEN": "",
        "ImageUrl": "./assets/images/products/52384537_2240573676191492_7750655977581445120_n.jpg",
        "ribbonType":"Cream_cotton"
    },
    {
        "ProductNameTH": "สกรีนสายเหรียญ",
        "ProductNameEN": "",
        "DescriptionTH": "",
        "DescriptionEN": "",
        "ImageUrl": "./assets/images/products/50274368_2224402604475266_4983048445825646592_n.jpg",
        "ribbonType":"Border_satin"
    },
    {
        "ProductNameTH": "ริบบิ้นสกรีนโลโก้",
        "ProductNameEN": "",
        "DescriptionTH": "",
        "DescriptionEN": "",
        "ImageUrl": "./assets/images/products/50334634_2224403204475206_2281708630199762944_n.jpg",
        "ribbonType":"Tuan"
    },
    {
        "ProductNameTH": "ริบบิ้นสกรีนโลโก้",
        "ProductNameEN": "",
        "DescriptionTH": "",
        "DescriptionEN": "",
        "ImageUrl": "./assets/images/products/52293364_2239755362939990_2607200845531447296_n.jpg",
        "ribbonType":"Border_satin"
    },
    {
        "ProductNameTH": "ริบบิ้นเคทอง",
        "ProductNameEN": "",
        "DescriptionTH": "",
        "DescriptionEN": "",
        "ImageUrl": "./assets/images/products/51755805_2237460996502760_6818349956374462464_o.jpg",
        "ribbonType":"Tuan"
    },
    {
        "ProductNameTH": "ริบบิ้นซาติน พิมพ์เคทอง",
        "ProductNameEN": "",
        "DescriptionTH": "",
        "DescriptionEN": "",
        "ImageUrl": "./assets/images/products/51153467_2234316826817177_6455850189696532480_n.jpg",
        "ribbonType":"Tuan"
    },
    {
        "ProductNameTH": "ริบบิ้นแบรนด์",
        "ProductNameEN": "",
        "DescriptionTH": "",
        "DescriptionEN": "",
        "ImageUrl": "./assets/images/products/horizontal1.jpg",
        "ribbonType":"Satin"
    },
    {
        "ProductNameTH": "ริบบิ้นโรงแรม",
        "ProductNameEN": "",
        "DescriptionTH": "",
        "DescriptionEN": "",
        "ImageUrl": "./assets/images/products/horizontal2.jpg",
        "ribbonType":"Satin"
    },
    {
        "ProductNameTH": "ริบบิ้นผูกกล่องขนม",
        "ProductNameEN": "",
        "DescriptionTH": "",
        "DescriptionEN": "",
        "ImageUrl": "./assets/images/products/horizontal3.jpg",
        "ribbonType":"Tuan"
    },
    {
        "ProductNameTH": "ริบบิ้นแบรนด์",
        "ProductNameEN": "",
        "DescriptionTH": "",
        "DescriptionEN": "",
        "ImageUrl": "./assets/images/products/scb.jpg",
        "ribbonType":"Tuan"
    },
    {
        "ProductNameTH": "ริบบิ้นแบรนด์",
        "ProductNameEN": "",
        "DescriptionTH": "",
        "DescriptionEN": "",
        "ImageUrl": "./assets/images/products/hiplant.jpg",
        "ribbonType":"Cream_cotton"
    },
    {
        "ProductNameTH": "ริบบิ้นแต่งงาน",
        "ProductNameEN": "",
        "DescriptionTH": "",
        "DescriptionEN": "",
        "ImageUrl": "./assets/images/products/14067433_1765145730400958_3646879403295901555_n.jpg",
        "ribbonType":"Border_satin"
    },
    {
        "ProductNameTH": "ริบบิ้นแบรนด์",
        "ProductNameEN": "",
        "DescriptionTH": "",
        "DescriptionEN": "",
        "ImageUrl": "./assets/images/products/image_0001.jpg",
        "ribbonType":"Tuan"
    },
    {
        "ProductNameTH": "ริบบิ้นร้านทัวร์",
        "ProductNameEN": "",
        "DescriptionTH": "",
        "DescriptionEN": "",
        "ImageUrl": "./assets/images/products/image_0002.jpg",
        "ribbonType":"Tuan"
    },
    {
        "ProductNameTH": "ริบบิ้นแบรนด์",
        "ProductNameEN": "",
        "DescriptionTH": "",
        "DescriptionEN": "",
        "ImageUrl": "./assets/images/products/image_0003.jpg",
        "ribbonType":"Tuan"
    },
    {
        "ProductNameTH": "ริบบิ้นแบรนด์",
        "ProductNameEN": "",
        "DescriptionTH": "",
        "DescriptionEN": "",
        "ImageUrl": "./assets/images/products/image_0004.jpg",
        "ribbonType":"Tuan"
    },
    {
        "ProductNameTH": "ริบบิ้นร้านทัวร์",
        "ProductNameEN": "",
        "DescriptionTH": "",
        "DescriptionEN": "",
        "ImageUrl": "./assets/images/products/image_0005.jpg",
        "ribbonType":"Tuan"
    },
    {
        "ProductNameTH": "ริบบิ้นแบรนด์",
        "ProductNameEN": "",
        "DescriptionTH": "",
        "DescriptionEN": "",
        "ImageUrl": "./assets/images/products/image_0006.jpg",
        "ribbonType":"Tuan"
    },
    {
        "ProductNameTH": "ริบบิ้นผูกของขวัญ",
        "ProductNameEN": "",
        "DescriptionTH": "",
        "DescriptionEN": "",
        "ImageUrl": "./assets/images/products/image_0007.jpg",
        "ribbonType":"Tuan"
    },
    {
        "ProductNameTH": "ริบบิ้นแบรนด์",
        "ProductNameEN": "",
        "DescriptionTH": "",
        "DescriptionEN": "",
        "ImageUrl": "./assets/images/products/12003224_1704354799813385_8933288969564601528_n.jpg",
        "ribbonType":"Satin"
    },
    {
        "ProductNameTH": "ริบบิ้นเคทอง",
        "ProductNameEN": "",
        "DescriptionTH": "",
        "DescriptionEN": "",
        "ImageUrl": "./assets/images/products/image_0009.jpg",
        "ribbonType":"Satin"
    },
    {
        "ProductNameTH": "ริบบิ้นตราเสื้อ",
        "ProductNameEN": "",
        "DescriptionTH": "",
        "DescriptionEN": "",
        "ImageUrl": "./assets/images/products/image_0010.jpg",
        "ribbonType":"Satin"
    },
    {
        "ProductNameTH": "ริบบิ้นตราเสื้อ",
        "ProductNameEN": "",
        "DescriptionTH": "",
        "DescriptionEN": "",
        "ImageUrl": "./assets/images/products/image_0011.jpg",
        "ribbonType":"Border_satin"
    },
    {
        "ProductNameTH": "ริบบิ้นตราเสื้อ",
        "ProductNameEN": "",
        "DescriptionTH": "",
        "DescriptionEN": "",
        "ImageUrl": "./assets/images/products/image_0012.jpg",
        "ribbonType":"Satin"
    },
    {
        "ProductNameTH": "ริบบิ้นเคเงิน",
        "ProductNameEN": "",
        "DescriptionTH": "",
        "DescriptionEN": "",
        "ImageUrl": "./assets/images/products/image_0013.jpg",
        "ribbonType":"Border_satin"
    },
    {
        "ProductNameTH": "ริบบิ้นตราเสื้อ",
        "ProductNameEN": "",
        "DescriptionTH": "",
        "DescriptionEN": "",
        "ImageUrl": "./assets/images/products/image_0014.jpg",
        "ribbonType":"Border_satin"
    },
    {
        "ProductNameTH": "ริบบิ้นผูกของขวัญ",
        "ProductNameEN": "",
        "DescriptionTH": "",
        "DescriptionEN": "",
        "ImageUrl": "./assets/images/products/image_0015.jpg",
        "ribbonType":"Satin"
    },
    {
        "ProductNameTH": "ริบบิ้นพิมพ์ลาย",
        "ProductNameEN": "",
        "DescriptionTH": "",
        "DescriptionEN": "",
        "ImageUrl": "./assets/images/products/IMG_7191.jpg",
        "ribbonType":"Tuan"
    },
    {
        "ProductNameTH": "ริบบิ้นผูกของขวัญ",
        "ProductNameEN": "",
        "DescriptionTH": "",
        "DescriptionEN": "",
        "ImageUrl": "./assets/images/products/image_0017.jpg",
        "ribbonType":"Border_satin"
    },
    {
        "ProductNameTH": "ริบบิ้นตราเสื้อ",
        "ProductNameEN": "",
        "DescriptionTH": "",
        "DescriptionEN": "",
        "ImageUrl": "./assets/images/products/image_0018.jpg",
        "ribbonType":"Satin"
    },
    {
        "ProductNameTH": "ริบบิ้นพิมพ์เค",
        "ProductNameEN": "",
        "DescriptionTH": "",
        "DescriptionEN": "",
        "ImageUrl": "./assets/images/products/116792814_2653395504909305_20803090388363720_n.jpeg",
        "ribbonType":"Tuan"
    },
    {
        "ProductNameTH": "ริบบิ้นพิมพ์เค",
        "ProductNameEN": "",
        "DescriptionTH": "",
        "DescriptionEN": "",
        "ImageUrl": "./assets/images/products/116801324_2653395548242634_6784613942209094636_n.jpeg",
        "ribbonType":"Border_satin"
    },
    {
        "ProductNameTH": "ริบบิ้นพิมพ์เค",
        "ProductNameEN": "",
        "DescriptionTH": "",
        "DescriptionEN": "",
        "ImageUrl": "./assets/images/products/217978206_2924053867843466_3249920534002596123_n.jpeg",
        "ribbonType":"Border_satin"
    },
    {
        "ProductNameTH": "ริบบิ้นพิมพ์เค",
        "ProductNameEN": "",
        "DescriptionTH": "",
        "DescriptionEN": "",
        "ImageUrl": "./assets/images/products/224070978_2919306801651506_190334083076344555_n.jpeg",
        "ribbonType":"Tuan"
    },
    {
        "ProductNameTH": "ริบบิ้นพิมพ์เค ผูกช่อดอกไม้",
        "ProductNameEN": "Ribbon Stamp K for a flower bouquet",
        "DescriptionTH": "ริบบิ้นพิมพ์เค เหมาะสำหรับผูกช่อดอกไม้",
        "DescriptionEN": "Suitable for a flower bouquet",
        "ImageUrl": "./assets/images/products/223002144_2919306808318172_3795930603786228905_n.jpeg",
        "ribbonType":"Tuan"
    },
    {
        "ProductNameTH": "ริบบิ้นของที่ละลึก",
        "ProductNameEN": "Souvenir",
        "DescriptionTH": "ริบบิ้นของที่ละลึก",
        "DescriptionEN": "Souvenir",
        "ImageUrl": "./assets/images/products/223560470_2919306754984844_1857928920651227546_n.jpeg",
        "ribbonType":"Tuan"
    } 


]