<svg width="32" height="32" viewBox="0 0 32 32" fill="none" xmlns="http://www.w3.org/2000/svg">
<g id="Frame 89">
<path id="lens" d="M29.6867 6.06699C26.3854 2.7809 20.8832 2.52812 17.3068 5.56143L16.2064 6.44615L11.6671 10.2378L3.4138 17.1891L3.27625 17.3155L15.1059 29.196L29.1365 17.4419C32.7129 14.4086 32.988 9.35307 29.6867 6.06699Z" fill="url(#paint0_linear_1082_1604)"/>
<path id="hand" d="M16.2063 6.44613L15.2434 5.43503C11.9421 2.14894 6.43994 1.89617 2.86353 4.92948C-0.712883 7.96278 -0.987992 13.0183 2.31331 16.3044C2.58842 16.6835 3.00108 16.9363 3.27619 17.3155L11.667 10.2378L15.1059 13.6502C17.8569 16.178 20.7456 15.5461 22.9465 13.7766C23.2216 13.5238 23.2216 13.2711 22.9465 13.0183L16.2063 6.44613Z" fill="#7D2AEB"/>
</g>
<defs>
<linearGradient id="paint0_linear_1082_1604" x1="3.77606" y1="14.1995" x2="30.9111" y2="18.5916" gradientUnits="userSpaceOnUse">
<stop stop-color="#9747FF"/>
<stop offset="1" stop-color="#CC66CC"/>
</linearGradient>
</defs>
</svg>
