<svg width="192" height="44" viewBox="0 0 192 44" fill="none" xmlns="http://www.w3.org/2000/svg">
<g id="lOGO">
<path id="background" d="M0 14C0 6.26801 6.26801 0 14 0H177.055C184.787 0 191.055 6.26801 191.055 14V30C191.055 37.732 184.787 44 177.055 44H14C6.26802 44 0 37.732 0 30V14Z" fill="#7D2AEB"/>
<path id="lens" d="M112.96 14.6646C110.33 11.907 105.947 11.6949 103.098 14.2403L102.221 14.9828L98.6051 18.1646L92.0305 23.9979L91.9209 24.104L101.345 34.0737L112.522 24.2101C115.371 21.6646 115.59 17.4222 112.96 14.6646Z" fill="url(#paint0_linear_1078_1574)"/>
<path id="hand" d="M102.221 14.9828L101.454 14.1343C98.8243 11.3767 94.4412 11.1646 91.5922 13.7101C88.7431 16.2555 88.524 20.498 91.1539 23.2555C91.373 23.5737 91.7017 23.7859 91.9209 24.104L98.6051 18.1646L101.345 21.0283C103.536 23.1495 105.837 22.6192 107.591 21.1343C107.81 20.9222 107.81 20.7101 107.591 20.498L102.221 14.9828Z" fill="white"/>
<g id="poisk">
<path d="M15.8519 29.1646V11.9806H28.3319V29.1646H25.4519V14.5726H18.7079V29.1646H15.8519Z" fill="white"/>
<path d="M37.0587 29.3806C35.2667 29.3806 33.8507 28.8206 32.8107 27.7006C31.7707 26.5646 31.2507 25.0046 31.2507 23.0206C31.2507 21.0526 31.7707 19.5166 32.8107 18.4126C33.8667 17.2926 35.2827 16.7326 37.0587 16.7326C38.8507 16.7326 40.2667 17.2926 41.3067 18.4126C42.3627 19.5166 42.8907 21.0526 42.8907 23.0206C42.8907 24.9886 42.3627 26.5406 41.3067 27.6766C40.2507 28.8126 38.8347 29.3806 37.0587 29.3806ZM37.0827 27.2926C38.0267 27.2926 38.7387 26.9246 39.2187 26.1886C39.7147 25.4366 39.9627 24.3726 39.9627 22.9966C39.9627 21.6526 39.7147 20.6206 39.2187 19.9006C38.7387 19.1806 38.0267 18.8206 37.0827 18.8206C35.1467 18.8206 34.1787 20.2126 34.1787 22.9966C34.1787 25.8606 35.1467 27.2926 37.0827 27.2926Z" fill="white"/>
<path d="M53.4359 29.1646V21.0286L48.3239 29.1646H45.5399V16.9726H48.3719V25.1566L53.4839 16.9726H56.2679V29.1646H53.4359Z" fill="white"/>
<path d="M64.835 29.3566C62.979 29.3566 61.531 28.8126 60.491 27.7246C59.451 26.6206 58.931 25.0606 58.931 23.0446C58.931 21.0926 59.459 19.5486 60.515 18.4126C61.571 17.2766 63.035 16.7086 64.907 16.7086C65.467 16.7086 65.987 16.7566 66.467 16.8526C66.963 16.9326 67.315 17.0206 67.523 17.1166L67.835 17.2606V19.3966C67.035 19.0446 66.187 18.8686 65.291 18.8686C64.171 18.8686 63.315 19.2286 62.723 19.9486C62.147 20.6686 61.859 21.6846 61.859 22.9966C61.859 24.3406 62.139 25.3806 62.699 26.1166C63.275 26.8526 64.139 27.2206 65.291 27.2206C65.723 27.2206 66.147 27.1806 66.563 27.1006C66.995 27.0046 67.315 26.9166 67.523 26.8366L67.835 26.7166V28.8286C67.131 29.1806 66.131 29.3566 64.835 29.3566Z" fill="white"/>
<path d="M77.8934 29.1646L74.2934 24.1006H73.3094V29.1646H70.4774V16.9726H73.3094V21.8206H74.2694L77.8214 16.9726H80.8214L76.6454 22.7086L81.1814 29.1646H77.8934Z" fill="white"/>
</g>
<g id="uslug">
<path d="M125.241 33.1463L127.042 28.2071L122.626 16.2311H124.714L128.074 25.3271L131.314 16.2311H133.234L127.042 33.6071L125.241 33.1463Z" fill="white"/>
<path d="M140.206 28.3751C138.414 28.3751 137.046 27.8471 136.102 26.7911C135.158 25.7191 134.686 24.1911 134.686 22.2071C134.686 20.2711 135.166 18.7591 136.126 17.6711C137.086 16.5671 138.454 16.0151 140.23 16.0151C140.758 16.0151 141.262 16.0631 141.742 16.1591C142.222 16.2551 142.566 16.3511 142.774 16.4471L143.086 16.5911V18.2231C142.206 17.8231 141.318 17.6231 140.422 17.6231C139.238 17.6231 138.334 18.0311 137.71 18.8471C137.102 19.6471 136.798 20.7591 136.798 22.1831C136.798 25.2391 138.006 26.7671 140.422 26.7671C140.87 26.7671 141.31 26.7271 141.742 26.6471C142.19 26.5511 142.526 26.4551 142.75 26.3591L143.062 26.2391V27.8711C142.406 28.2071 141.454 28.3751 140.206 28.3751Z" fill="white"/>
<path d="M144.653 28.2311V26.6471C144.765 26.7111 144.941 26.7431 145.181 26.7431C146.029 26.7431 146.581 25.8391 146.837 24.0311C146.917 23.5191 146.997 22.6151 147.077 21.3191C147.157 20.0071 147.221 18.8311 147.269 17.7911L147.341 16.2311H154.877V28.2311H152.837V17.8151H149.045C148.885 20.9991 148.717 23.1991 148.541 24.4151C148.317 25.8231 147.957 26.8311 147.461 27.4391C146.981 28.0471 146.325 28.3511 145.493 28.3511L144.653 28.2311Z" fill="white"/>
<path d="M160.051 33.0336L161.8 28.2071L157.384 16.2311H159.472L162.832 25.3271L166.072 16.2311H167.992L161.8 33.6071L160.051 33.0336Z" fill="white"/>
<path d="M170.491 28.2311V16.2311H177.691V17.8151H172.531V28.2311H170.491Z" fill="white"/>
</g>
</g>
<defs>
<linearGradient id="paint0_linear_1078_1574" x1="92.3191" y1="21.4892" x2="113.99" y2="24.819" gradientUnits="userSpaceOnUse">
<stop stop-color="#9747FF"/>
<stop offset="1" stop-color="#CC66CC"/>
</linearGradient>
</defs>
</svg>
