{

		"TITLE" : "Bootstrap",
		"ICON" : "icon.png",
		"TYPE" : "library",
		"MODUL" :
		{
			"REQUIRED" :
			{
				
				"wp_smarty" :
				{
					"VERSION" : "100",
					"URL" : "https://gitlab.com/papp"
				},
				"wp_jquery" :
				{
					"VERSION" : "100",
					"URL" : "https://gitlab.com/papp"
				}
			},
			"OPTIONAL" :
			{
			},
			"INCOMPATIBLE" :
			{
			}
		},
		"SERVER" :
		{
			"REQUIRED" :
			{
				"php_version" : "5.6",
				"memory_limit" : "128",
				"max_execution_time" : "120"
			},
			"OPTIONAL" :
			{
				"php_version" : "7",
				"memory_limit" : "256"
			}
		},
		"DESCRIPTION" : "Template Bootstrap CSS & JS",
		"CHANGLOG" : "* born 2016 - add bottstrap v3.3.6",
		"CREATOR" :
		{
			"company" : "",
			"author" : "",
			"email" : "",
			"url" : "",
			"date" : "20160726"
		}

}