[0m[[0m[0mdebug[0m] [0m[0m> Exec(package, None, None)[0m
[0m[[0m[0mdebug[0m] [0m[0mEvaluating tasks: Compile / package[0m
[0m[[0m[0mdebug[0m] [0m[0mRunning task... Cancel: Signal, check cycles: false, forcegc: true[0m
[0m[[0m[0minfo[0m] [0m[0mcompiling 1 Scala source to /home/jeannory-e580/Projects/scala-formation/target/scala-2.11/classes ...[0m
[0m[[0m[0minfo[0m] [0m[0mNon-compiled module 'compiler-bridge_2.11' for Scala 2.11.8. Compiling...[0m
[0m[[0m[0minfo[0m] [0m[0m  Compilation completed in 11.614s.[0m
[0m[[0m[31merror[0m] [0m[0m/home/jeannory-e580/Projects/scala-formation/src/main/scala/Rdd09.scala:1:25: object sql is not a member of package org.apache.spark[0m
[0m[[0m[31merror[0m] [0m[0mimport org.apache.spark.sql.SparkSession[0m
[0m[[0m[31merror[0m] [0m[0m                        ^[0m
[0m[[0m[31merror[0m] [0m[0m/home/jeannory-e580/Projects/scala-formation/src/main/scala/Rdd09.scala:5:15: not found: value SparkSession[0m
[0m[[0m[31merror[0m] [0m[0m  val spark = SparkSession.builder()[0m
[0m[[0m[31merror[0m] [0m[0m              ^[0m
[0m[[0m[31merror[0m] [0m[0m/home/jeannory-e580/Projects/scala-formation/src/main/scala/Rdd09.scala:10:34: not found: type SparkSession[0m
[0m[[0m[31merror[0m] [0m[0m  private def getSparkSession(): SparkSession = {[0m
[0m[[0m[31merror[0m] [0m[0m                                 ^[0m
[0m[[0m[31merror[0m] [0m[0mthree errors found[0m
[0m[[0m[31merror[0m] [0m[0m(Compile / [31mcompileIncremental[0m) Compilation failed[0m
[0m[[0m[31merror[0m] [0m[0mTotal time: 13 s, completed 3 févr. 2021 22:49:53[0m
[0m[[0m[0mdebug[0m] [0m[0m> Exec(idea-shell, None, None)[0m
