{
    "depart": [
        {
            "departmentName": "Senior MIS Manager(ไก๋)",
            "tel": "7604"
        },
        {
            "departmentName": "Assistant MIS Fin-Tech Manager(เบ้นซ์)",
            "tel": "7621"
        },
        {
            "departmentName": "Assistant Credit Scoring Manager(กำไล)",
            "tel": "7621"
        },
        {
            "departmentName": "MIS-Assistant Manger(โอเปิ้ล)",
            "tel": "7620"
        },
        {
            "departmentName": "Business Analytic(ไข่มุข)",
            "tel": "7402"
        },
        {
            "departmentName": "LS Specialist(ส้ม)",
            "tel": "7620"
        },
        {
            "departmentName": "ITEC Specialist Officer(อุ๊, แอม)",
            "tel": "7616"
        },
        {
            "departmentName": "BC Specialist(คิงคอง)",
            "tel": "7622"
        },
        {
            "departmentName": "SQL/Database(มินทร์)",
            "tel": "7622"
        },
        {
            "departmentName": "ERP Specialist(อุ๊)",
            "tel": "7577"
        },
        {
            "departmentName": "ERP Support(เตย, มีน, สตาร์ท, เค, แบม)",
            "tel": "7577,7617"
        },
        {
            "departmentName": "K2 Support(บัส, น๊อต, เอก, อาร์ม)",
            "tel": "7621"
        },
        {
            "departmentName": "Application Support(กิต)",
            "tel": "7621"
        }
        ,{
            "departmentName": "GA เบิกของ(พี่ป๊อด)",
            "tel": "7410"
        }
    ]
}