<svg width="20" height="20" viewBox="0 0 20 20" fill="none" xmlns="http://www.w3.org/2000/svg">
<path fill-rule="evenodd" clip-rule="evenodd" d="M18.75 10.0532C18.75 5.22119 14.832 1.30322 10 1.30322C5.16797 1.30322 1.25 5.22119 1.25 10.0532C1.25 14.4204 4.44922 18.0403 8.63281 18.6974V12.5833H6.41055V10.0532H8.63281V8.12549C8.63281 5.93291 9.93945 4.7208 11.9379 4.7208C12.8953 4.7208 13.8969 4.89189 13.8969 4.89189V7.04541H12.793C11.7066 7.04541 11.3668 7.71963 11.3668 8.4126V10.0532H13.7934L13.4059 12.5833H11.3672V18.6981C15.5508 18.0415 18.75 14.4216 18.75 10.0532Z" fill="white"/>
</svg>
