<svg width="20" height="20" viewBox="0 0 20 20" fill="none" xmlns="http://www.w3.org/2000/svg">
<path fill-rule="evenodd" clip-rule="evenodd" d="M3.74825 1.875L3.75 1.875H16.25L16.2517 1.875C16.7481 1.87639 17.2238 2.0742 17.5748 2.4252C17.9258 2.7762 18.1236 3.25186 18.125 3.74825L18.125 3.75V16.25L18.125 16.2517C18.1236 16.7481 17.9258 17.2238 17.5748 17.5748C17.2238 17.9258 16.7481 18.1236 16.2517 18.125L16.25 18.125H3.75L3.74825 18.125C3.25186 18.1236 2.7762 17.9258 2.4252 17.5748C2.0742 17.2238 1.87639 16.7481 1.875 16.2517L1.875 16.25V3.75L1.875 3.74825C1.87639 3.25186 2.0742 2.7762 2.4252 2.4252C2.7762 2.0742 3.25186 1.87639 3.74825 1.875ZM3.75102 3.125C3.5852 3.12566 3.42635 3.19182 3.30908 3.30908C3.19182 3.42635 3.12566 3.5852 3.125 3.75102V16.249C3.12566 16.4148 3.19182 16.5737 3.30908 16.6909C3.42635 16.8082 3.58521 16.8743 3.75104 16.875H16.249C16.4148 16.8743 16.5736 16.8082 16.6909 16.6909C16.8082 16.5736 16.8743 16.4148 16.875 16.249V3.75104C16.8743 3.58521 16.8082 3.42635 16.6909 3.30908C16.5737 3.19182 16.4148 3.12566 16.249 3.125H3.75102Z" fill="#143080"/>
</svg>
