<svg width="808" height="15" viewBox="0 0 808 15" fill="none" xmlns="http://www.w3.org/2000/svg">
<path fill-rule="evenodd" clip-rule="evenodd" d="M417.174 3.99649e-05L417.178 0L437.958 1.99676e-05L807.001 0.543443C807.277 0.543849 807.5 0.768035 807.5 1.04418C807.5 1.32032 807.276 1.54385 807 1.54344L437.958 1.00002H417.181C416.461 1.00646 415.706 1.01282 414.919 1.01945C406.58 1.08968 394.623 1.19038 382.879 1.74343C370.007 2.34966 357.459 3.49737 350.213 5.72054C348.345 6.29385 346.787 7.1758 346.011 8.17178C345.643 8.64418 345.469 9.11776 345.487 9.58795C346.739 9.81802 347.878 10.0575 348.901 10.3068C350.435 10.681 351.719 11.0804 352.723 11.5089C353.714 11.932 354.488 12.4058 354.945 12.9573L354.969 12.9859L354.988 13.0177C355.158 13.2974 355.171 13.6145 355.044 13.8998C354.928 14.1626 354.71 14.3661 354.47 14.5165C353.986 14.8192 353.263 15 352.405 15C350.67 15 348.253 14.2636 345.676 12.0239L345.66 12.0099L345.645 11.9945C345.16 11.4942 344.827 10.9781 344.646 10.4527C342.316 10.0431 339.609 9.66231 336.558 9.30909C326.536 8.14898 312.854 7.29259 296.706 6.67997C264.414 5.45482 222.305 5.20588 180.005 5.44388C95.4024 5.91989 10.065 8.34344 1.02432 8.79584C0.748863 8.80963 0.514401 8.59722 0.500634 8.32142C0.486867 8.04562 0.699008 7.81087 0.974465 7.79709C10.0367 7.34361 95.391 4.91994 179.999 4.4439C222.304 4.20588 264.43 4.4547 296.744 5.68068C312.9 6.29361 326.613 7.15113 336.673 8.3157C339.592 8.65362 342.208 9.0179 344.489 9.41052C344.517 8.73298 344.794 8.10819 345.223 7.55696C346.184 6.32293 347.974 5.36156 349.921 4.76443C357.304 2.49891 369.975 1.35005 382.832 0.744537C394.596 0.190526 406.573 0.089686 414.909 0.019492C415.698 0.012853 416.454 0.00648814 417.174 3.99649e-05ZM345.861 10.6753C345.986 10.8707 346.146 11.0735 346.347 11.2831C348.767 13.3801 350.952 14 352.405 14C353.144 14 353.664 13.8412 353.941 13.6682C354.039 13.6069 354.089 13.555 354.113 13.5234C353.793 13.1781 353.216 12.8063 352.331 12.4288C351.396 12.0299 350.171 11.6457 348.664 11.2784C347.814 11.0711 346.878 10.8701 345.861 10.6753Z" fill="#D4D4D3"/>
</svg>
