{
  "product": {
    "data" : [
      {"name":"macbook air","description":"Laptop 16GB, 256GB SSD","image":"https://image.com.vn/1","price":200,"colors":["red","blue","while"],"categories":[{"id": "1", "name":"laptop"}]},
      {"name":"macbook air 15","description":"Laptop 16GB, 2TB SSD","image":"https://image.com.vn/11","price":200,"colors":["red","blue","while"],"categories":[{"id": "1", "name":"laptop"}]},
      {"name":"macbook pro 13","description":"Laptop 8GB, 256GB SSD","image":"https://image.com.vn/2","price":300,"colors":["red"],"categories":[{"id": "1", "name":"laptop"}]},
      {"name":"macbook pro 14","image":"https://image.com.vn/3","price":500,"colors":["blue"],"categories":[{"id": "1", "name":"laptop"}]},
      {"name":"macbook pro 15","description":"Laptop 32GB, 256GB SSD","image":"https://image.com.vn/4","price":1000,"colors":["red","blue", "black"],"categories":[{"id": "1", "name":"laptop"}]},
      {"name":"macbook pro 16","description":"Laptop 16GB, 1TB SSD","image":"https://image.com.vn/5","price":2000,"colors":["red","yellow"],"categories":[{"id": "1", "name":"laptop"}]},
      {"name":"dell 1220","image":"https://image.com.vn/6","price":400,"colors":["red","black"],"categories":[{"id": "1", "name":"laptop"}]},
      {"name":"dell 1555","description":"Laptop 4GB, 256GB SSD","image":"https://image.com.vn/7","price":500,"colors":["red","blue"],"categories":[{"id": "1", "name":"laptop"}]},
      {"name":"asus vivobook","description":"Laptop 16GB, 256GB SSD","image":"https://image.com.vn/8","price":200,"colors":["red","blue"],"categories":[{"id": "1", "name":"laptop"}]},
      {"name":"asus 1234","description":"Laptop 16GB, 256GB SSD","image":"https://image.com.vn/9","price":300,"colors":["red","blue"],"categories":[{"id": "1", "name":"laptop"}]}
    ]
  }
}
