bin/benchmark
01,06,826.789368,826.789368
01,06,900.224365,900.224365
01,06,800.229980,800.229980
01,06,1044.697144,1044.697144
01,06,754.729065,754.729065
01,07,976.805359,976.805359
01,07,987.483826,987.483826
01,07,929.213379,929.213379
01,07,1017.432983,1017.432983
01,07,1328.877075,1328.877075
01,08,1072.111084,1072.111084
01,08,747.361023,747.361023
01,08,1747.000244,1747.000244
01,08,579.945251,579.945251
01,08,1268.936768,1268.936768
01,09,1276.430664,1276.430664
01,09,1317.233765,1317.233765
01,09,1177.499023,1177.499023
01,09,1364.171265,1364.171265
01,09,1115.815186,1115.815186
01,10,1403.770386,1403.770386
01,10,1403.203613,1403.203613
01,10,1914.534668,1914.534668
01,10,2018.330200,2018.330200
01,10,1406.157959,1406.157959
01,11,1867.804688,1867.804688
01,11,1347.328857,1347.328857
01,11,1305.614990,1305.614990
01,11,1716.692383,1716.692383
01,11,1608.195801,1608.195801
01,12,2468.499268,2468.499268
01,12,1451.271118,1451.271118
01,12,2002.545166,2002.545166
01,12,2009.997437,2009.997437
01,12,1997.536865,1997.536865
02,06,507.634460,507.634521
02,06,233.840622,233.840622
02,06,706.926758,716.253418
02,06,489.564850,559.777710
02,06,469.140198,476.903381
02,07,510.587097,544.623413
02,07,679.869080,679.869141
02,07,555.169373,562.621948
02,07,621.713867,640.246094
02,07,282.361115,286.075623
02,08,500.041718,513.525452
02,08,727.384644,737.629883
02,08,613.236450,685.291870
02,08,791.888123,792.311035
02,08,773.859497,827.005249
02,09,779.688721,794.106201
02,09,631.957825,652.342285
02,09,708.072449,727.818359
02,09,564.371338,568.051453
02,09,759.544678,803.357788
02,10,961.420349,985.151733
02,10,914.689514,921.202820
02,10,724.210266,735.396301
02,10,725.374512,728.235413
02,10,464.127350,467.577698
02,11,1088.767822,1111.740967
02,11,652.492310,661.237305
02,11,630.020020,637.459717
02,11,610.280945,611.525391
02,11,831.319519,846.999390
02,12,1039.787598,1047.366089
02,12,904.280518,906.781372
02,12,816.813904,829.231445
02,12,807.255371,825.311401
02,12,796.103577,832.625000
03,06,441.929321,456.960175
03,06,235.848038,241.616348
03,06,334.865387,369.361816
03,06,316.409393,355.842773
03,06,251.832703,256.399536
03,07,288.752777,316.916229
03,07,231.545670,236.491730
03,07,506.369904,549.198364
03,07,237.752228,237.752243
03,07,286.585510,286.585541
03,08,345.092346,399.976501
03,08,345.833740,461.997559
03,08,430.003052,430.003021
03,08,391.139343,437.653564
03,08,408.006226,420.547119
03,09,487.588562,494.629639
03,09,527.836182,602.108398
03,09,475.255005,475.767029
03,09,505.452515,608.226746
03,09,398.997284,440.314026
03,10,563.520203,578.427185
03,10,531.580872,590.781799
03,10,614.720825,617.398621
03,10,424.324127,446.348389
03,10,498.164551,520.837341
03,11,555.279907,607.810181
03,11,509.489319,510.558960
03,11,502.242493,525.321533
03,11,475.597870,489.635681
03,11,555.935974,576.447632
03,12,616.220459,647.933228
03,12,581.360779,596.372925
03,12,538.520142,607.031555
03,12,636.028931,702.436279
03,12,556.810425,590.360046
04,06,314.427673,314.427673
04,06,285.344818,285.344818
04,06,286.187927,302.621826
04,06,316.287476,370.958984
04,06,257.704987,257.704987
04,07,273.150940,273.150909
04,07,281.485626,281.485626
04,07,299.932159,308.534271
04,07,262.080658,262.080658
04,07,248.093185,248.093185
04,08,388.692169,423.126404
04,08,363.491211,393.438904
04,08,255.838013,256.886627
04,08,272.938019,272.937988
04,08,320.090881,329.128937
04,09,332.579651,332.579651
04,09,375.244446,422.531952
04,09,398.384521,433.810730
04,09,366.507111,418.530151
04,09,317.703644,356.712189
04,10,417.665131,491.578552
04,10,539.695923,583.274658
04,10,411.458954,502.768494
04,10,384.731445,450.619202
04,10,400.138245,406.503967
04,11,577.755920,655.630371
04,11,299.505737,312.171600
04,11,307.787415,326.878601
04,11,312.955994,315.909180
04,11,382.457275,476.799347
04,12,409.427124,418.748047
04,12,463.480835,492.213348
04,12,462.783234,495.533142
04,12,495.154602,512.991272
04,12,490.145294,534.554138
05,06,297.494598,297.494598
05,06,300.643799,300.643799
05,06,251.931641,251.931641
05,06,275.818604,275.818604
05,06,167.930267,167.930267
05,07,256.156067,256.156067
05,07,258.465118,258.465149
05,07,277.645905,277.645905
05,07,293.961914,293.961914
05,07,279.509613,279.509613
05,08,317.897919,322.842651
05,08,297.488617,297.488617
05,08,359.195679,397.611115
05,08,269.715363,269.715363
05,08,354.411713,354.411682
05,09,445.707367,445.707367
05,09,293.376007,293.376007
05,09,341.142853,341.142853
05,09,350.049377,350.049377
05,09,246.972580,246.972580
05,10,321.270447,335.246887
05,10,328.236664,372.668396
05,10,347.013550,399.551819
05,10,233.219666,236.461670
05,10,348.623291,400.575073
05,11,474.892395,508.379547
05,11,283.736725,335.789764
05,11,385.210815,402.682800
05,11,402.460999,463.805084
05,11,332.900085,337.787537
05,12,373.662598,425.998291
05,12,349.121246,393.178467
05,12,436.249634,578.793274
05,12,268.660706,288.161865
05,12,439.884216,485.537964
06,06,293.714203,293.714203
06,06,273.452301,273.452332
06,06,231.384827,231.384827
06,06,299.844543,299.844543
06,06,286.165833,286.165833
06,07,299.633118,299.633118
06,07,291.762268,291.762268
06,07,271.259827,271.259827
06,07,272.153503,272.153503
06,07,280.736908,280.736908
06,08,250.620773,291.182404
06,08,260.124939,283.687469
06,08,304.357544,304.357544
06,08,272.102570,272.102570
06,08,284.835999,284.835999
06,09,335.604614,384.953033
06,09,254.394379,254.394394
06,09,225.841904,225.841904
06,09,296.230194,296.230194
06,09,270.968933,270.968933
06,10,305.242920,305.242920
06,10,243.015625,243.015625
06,10,262.624420,262.624390
06,10,215.038086,215.038086
06,10,287.921326,287.921326
06,11,330.451691,361.001343
06,11,274.359192,287.769867
06,11,310.875000,351.328247
06,11,423.678589,423.678589
06,11,337.984741,468.187866
06,12,377.011780,446.967285
06,12,303.137726,303.137695
06,12,312.538544,324.055023
06,12,351.792236,416.819824
06,12,387.683472,405.404541
