<?xml version="1.0" encoding="UTF-8" standalone="no"?>
<svg width="20px" height="20px" viewBox="0 0 20 20" version="1.1" xmlns="http://www.w3.org/2000/svg" xmlns:xlink="http://www.w3.org/1999/xlink" xmlns:sketch="http://www.bohemiancoding.com/sketch/ns">
    <!-- Generator: Sketch 3.3 (11970) - http://www.bohemiancoding.com/sketch -->
    <title>Line 6 + Line 3</title>
    <desc>Created with Sketch.</desc>
    <defs></defs>
    <g id="Page-1" stroke="none" stroke-width="1" fill="none" fill-rule="evenodd" sketch:type="MSPage">
        <g id="Mobile---Menu" sketch:type="MSArtboardGroup" transform="translate(-324.000000, -33.000000)" stroke-linecap="square" stroke-width="2" stroke="#FFFFFF">
            <g id="Line-6-+-Line-3" sketch:type="MSLayerGroup" transform="translate(326.000000, 35.000000)">
                <g sketch:type="MSShapeGroup">
                    <path d="M0.264981359,0.117637723 L16.0297059,15.8823623" id="Line-6"></path>
                    <path d="M0.264981359,15.8823623 L16.0297059,0.117637723" id="Line-3"></path>
                </g>
            </g>
        </g>
    </g>
</svg>
