xi,sx,sy,cx,cy,ex,ey,ne
0,-0,0,0,0,-0,0,0
0.01,-0.0052611692,-0.0313539734,-0.0016835136,-0.0099642228,-0.0035776555,-0.0213897506,0.0216868866
0.02,-0.0098195714,-0.0574877867,-0.0033913671,-0.0199227621,-0.0064282042,-0.0375650246,0.0381110598
0.03,-0.0138459763,-0.0797303408,-0.0051242714,-0.0298754321,-0.008721705,-0.0498549087,0.0506120544
0.04,-0.0174699363,-0.0990658062,-0.0068829682,-0.0398220361,-0.0105869681,-0.0592437701,0.0601822913
0.05,-0.0207890393,-0.116215743,-0.0086682325,-0.0497623653,-0.0121208068,-0.0664533777,0.0675497251
0.06,-0.0238763456,-0.131704403,-0.010480874,-0.0596961979,-0.0133954716,-0.0720082051,0.073243568
0.07,-0.0267862986,-0.1459099719,-0.0123217392,-0.0696232983,-0.0144645594,-0.0762866737,0.0776458631
0.08,-0.0295593675,-0.1591041857,-0.0141917138,-0.0795434156,-0.0153676537,-0.0795607701,0.0810313577
0.09,-0.032225648,-0.1714824557,-0.016091725,-0.0894562829,-0.0161339229,-0.0820261728,0.0835978259
0.1,-0.0348076168,-0.183186356,-0.0180227444,-0.0993616156,-0.0167848725,-0.0838247403,0.0854887071
0.11,-0.0373222102,-0.1943200637,-0.01998579,-0.1092591102,-0.0173364201,-0.0850609535,0.0868096612
0.12,-0.0397823684,-0.2049621029,-0.0219819302,-0.1191484423,-0.0178004382,-0.0858136606,0.0876404014
0.13,-0.0421981695,-0.2151735208,-0.0240122862,-0.1290292653,-0.0181858832,-0.0861442555,0.088042939
0.14,-0.0445776491,-0.2250034237,-0.026078036,-0.1389012081,-0.0184996131,-0.0861022156,0.0880671744
0.15,-0.0469273896,-0.2344926201,-0.0281804179,-0.1487638734,-0.0187469717,-0.0857287467,0.0877545837
0.16,-0.04925294,-0.2436759544,-0.0303207348,-0.1586168346,-0.0189322052,-0.0850591198,0.087140589
0.17,-0.0515591169,-0.2525837769,-0.0325003583,-0.1684596338,-0.0190587587,-0.0841241431,0.0862560591
0.18,-0.0538502232,-0.2612428718,-0.034720734,-0.1782917787,-0.0191294893,-0.0829510931,0.0851282633
0.19,-0.0561302078,-0.2696770651,-0.0369833862,-0.1881127392,-0.0191468216,-0.0815643259,0.0837815018
0.2,-0.0584027861,-0.2779076529,-0.0392899238,-0.1979219439,-0.0191128623,-0.079985709,0.0822375531
0.21,-0.0606715307,-0.2859537293,-0.0416420465,-0.207718776,-0.0190294842,-0.0782349533,0.0805160182
0.22,-0.0629399381,-0.2938324527,-0.0440415515,-0.2175025689,-0.0188983866,-0.0763298838,0.0786345991
0.23,-0.0652114763,-0.3015592655,-0.0464903404,-0.227272601,-0.0187211359,-0.0742866645,0.0766093301
0.24,-0.0674896159,-0.309148077,-0.0489904277,-0.2370280899,-0.0184991882,-0.0721199871,0.0744547682
0.25,-0.0697778478,-0.3166114161,-0.0515439493,-0.2467681864,-0.0182338985,-0.0698432297,0.0721841519
0.26,-0.0720796898,-0.3239605587,-0.0541531719,-0.2564919669,-0.017926518,-0.0674685918,0.0698095332
0.27,-0.0743986849,-0.3312056361,-0.0568205031,-0.2661984257,-0.0175781817,-0.0650072105,0.067341888
0.28,-0.0767383935,-0.3383557273,-0.0595485037,-0.2758864651,-0.0171898898,-0.0624692622,0.064791211
0.29,-0.0791023817,-0.3454189394,-0.062339899,-0.2855548859,-0.0167624828,-0.0598640535,0.0621665966
0.3,-0.0814942077,-0.3524024785,-0.0651975932,-0.295202375,-0.0162966145,-0.0572001035,0.0594763103
0.31,-0.0839174073,-0.3593127129,-0.0681246841,-0.3048274918,-0.0157927232,-0.0544852211,0.0567278541
0.32,-0.0863754811,-0.3661552307,-0.0711244795,-0.3144286533,-0.0152510016,-0.0517265774,0.0539280248
0.33,-0.0888718844,-0.3729348923,-0.0742005153,-0.3240041162,-0.0146713691,-0.0489307762,0.051082971
0.34,-0.0914100202,-0.3796558789,-0.0773565752,-0.3335519565,-0.014053445,-0.0461039223,0.0481982466
0.35,-0.0939932369,-0.3863217365,-0.0805967124,-0.3430700469,-0.0133965245,-0.0432516896,0.0452788639
0.36,-0.0966248312,-0.3929354167,-0.0839252735,-0.3525560295,-0.0126995578,-0.0403793872,0.0423293477
0.37,-0.0993080569,-0.3994993121,-0.0873469242,-0.3620072851,-0.0119611328,-0.037492027,0.0393537899
0.38,-0.1020461388,-0.4060152878,-0.0908666783,-0.3714208974,-0.0111794605,-0.0345943903,0.0363559098
0.39,-0.1048422927,-0.4124847071,-0.0944899284,-0.3807936115,-0.0103523643,-0.0316910956,0.033339121
0.4,-0.1076997513,-0.4189084516,-0.0982224799,-0.3901217854,-0.0094772714,-0.0287866661,0.0303066135
0.41,-0.1106217942,-0.4252869342,-0.1020705878,-0.3994013336,-0.0085512065,-0.0258856006,0.0272614646
0.42,-0.1136117826,-0.4316201065,-0.1060409955,-0.4086276613,-0.007570787,-0.0229924453,0.0242068039
0.43,-0.1166731967,-0.4379074572,-0.1101409779,-0.4177955866,-0.0065322188,-0.0201118706,0.0211460923
0.44,-0.1198096754,-0.4441480046,-0.1143783848,-0.4268992505,-0.0054312906,-0.0172487541,0.0180836511
0.45,-0.1230250557,-0.4503402812,-0.1187616879,-0.4359320096,-0.0042633678,-0.0144082717,0.0150257977
0.46,-0.126323411,-0.4564823112,-0.1233000269,-0.4448863105,-0.0030233842,-0.0115960008,0.0119836591
0.47,-0.1297090862,-0.4625715818,-0.1280032558,-0.4537535422,-0.0017058304,-0.0088180396,0.0089815188
0.48,-0.1331867277,-0.4686050081,-0.1328819852,-0.4625238615,-0.0003047424,-0.0060811466,0.0060887776
0.49,-0.1367613061,-0.4745788936,-0.1379476173,-0.4711859879,0.0011863112,-0.0033929057,0.003594321
0.5,-0.1404381308,-0.4804888857,-0.1432123684,-0.4797269633,0.0027742376,-0.0007619224,0.0028769636
0.51,-0.1442228535,-0.4863299283,-0.1486892719,-0.4881318696,0.0044664183,0.0018019413,0.0048162107
0.52,-0.1481214594,-0.4920962124,-0.1543921496,-0.4963835022,0.0062706902,0.0042872898,0.0075962102
0.53,-0.1521402448,-0.4977811261,-0.160335538,-0.5044619935,0.0081952932,0.0066808675,0.0105734016
0.54,-0.1562857797,-0.5033772042,-0.1665345491,-0.5123443852,0.0102487694,0.008967181,0.013617915
0.55,-0.1605648546,-0.5088760813,-0.1730046395,-0.5200041544,0.0124397849,0.0111280731,0.0166907837
0.56,-0.1649844099,-0.5142684468,-0.1797612543,-0.5274107029,0.0147768444,0.0131422562,0.0197755917
0.57,-0.169551449,-0.5195440054,-0.1868193043,-0.5345288359,0.0172678552,0.0149848304,0.0228631574
0.58,-0.1742729347,-0.5246914447,-0.1941924301,-0.5413182722,0.0199194954,0.0166268276,0.0259468243
0.59,-0.1791556681,-0.5296984092,-0.2018920038,-0.5477332607,0.0227363357,0.0180348514,0.0290206276
0.6,-0.1842061536,-0.5345514858,-0.209925829,-0.553722408,0.0257196754,0.0191709222,0.0320784345
0.61,-0.1894304498,-0.5392361988,-0.218296529,-0.5592288719,0.0288660792,0.019992673,0.0351134946
0.62,-0.1948340086,-0.5437370185,-0.2269996646,-0.5641911058,0.032165656,0.0204540873,0.0381182254
0.63,-0.200421507,-0.5480373835,-0.236021718,-0.568544363,0.035600211,0.0205069794,0.0410841968
0.64,-0.2061966729,-0.5521197389,-0.2453381973,-0.5722231288,0.0391415244,0.0201033899,0.044002332
0.65,-0.2121621111,-0.5559655906,-0.2549122485,-0.5751645381,0.0427501374,0.0191989475,0.0468633527
0.66,-0.2183191329,-0.5595555787,-0.2646942449,-0.5773126116,0.046375112,0.0177570328,0.0496584658
0.67,-0.2246675947,-0.5628695679,-0.2746227902,-0.5786228557,0.0499551954,0.0157532878,0.0523802217
0.68,-0.2312057514,-0.5658867573,-0.2846273543,-0.5790664961,0.0534216029,0.0131797388,0.0550233874
0.69,-0.2379301293,-0.5685858091,-0.2946323831,-0.5786334935,0.0567022538,0.0100476845,0.0575856019
0.7,-0.2448354246,-0.570944993,-0.3045622909,-0.5773336483,0.0597268664,0.0063886553,0.0600675743
0.71,-0.2519144333,-0.5729423481,-0.3143464596,-0.5751955219,0.0624320262,0.0022531738,0.0624726716
0.72,-0.2591580177,-0.5745558558,-0.3239233624,-0.5722634403,0.0647653448,-0.0022924155,0.0648059029
0.73,-0.2665551135,-0.575763624,-0.3332432206,-0.5685932711,0.066688107,-0.0071703529,0.06707248
0.74,-0.2740927856,-0.5765440741,-0.3422690246,-0.5642478225,0.068176239,-0.0122962515,0.0692762396
0.75,-0.2817563324,-0.5768761284,-0.3509761392,-0.5592925993,0.0692198068,-0.0175835291,0.07141822
0.76,-0.2895294473,-0.5767393889,-0.3593509239,-0.5537923742,0.0698214766,-0.0229470147,0.0734956058
0.77,-0.2973944362,-0.576114299,-0.3673888414,-0.5478087434,0.0699944052,-0.0283055556,0.075501134
0.78,-0.3053324971,-0.5749822799,-0.3750924408,-0.5413986123,0.0697599437,-0.0335836677,0.0774229455
0.79,-0.3133240601,-0.5733258282,-0.3824694731,-0.5346134423,0.069145413,-0.0387123859,0.0792447914
0.8,-0.3213491915,-0.571128563,-0.3895312753,-0.527499053,0.0681820838,-0.04362951,0.0809464681
0.81,-0.3293880588,-0.5683752071,-0.3962914671,-0.5200957898,0.0669034083,-0.0482794173,0.0825043525
0.82,-0.337421456,-0.5650514859,-0.4027649488,-0.5124389067,0.0653434927,-0.0526125791,0.0838919276
0.83,-0.3454313875,-0.5611439236,-0.4089671624,-0.5045590546,0.0635357749,-0.056584869,0.0850802098
0.84,-0.3534017048,-0.556639511,-0.414913567,-0.4964828029,0.0615118622,-0.0601567081,0.0860380074
0.85,-0.3613187973,-0.5515251935,-0.4206192802,-0.4882331502,0.0593004828,-0.0632920434,0.0867319435
0.86,-0.3691723402,-0.5457870954,-0.4260988465,-0.4798299991,0.0569265063,-0.0659570963,0.087126148
0.87,-0.3769561112,-0.5394093329,-0.431366097,-0.4712905842,0.0544099858,-0.0681187487,0.0871814801
0.88,-0.3846689016,-0.5323721999,-0.4364340749,-0.4626298492,0.0517651734,-0.0697423508,0.0868540653
0.89,-0.3923155583,-0.5246494114,-0.4413150066,-0.4538607744,0.0489994482,-0.070788637,0.0860928397
0.9,-0.3999082169,-0.5162039809,-0.446020304,-0.4449946592,0.046112087,-0.0712093217,0.0848356769
0.91,-0.4074678002,-0.5069821787,-0.450560587,-0.4360413628,0.0430927868,-0.0709408159,0.0830035399
0.92,-0.4150258893,-0.4969048672,-0.4549457187,-0.4270095103,0.0399198294,-0.0698953569,0.080491948
0.93,-0.4226270946,-0.4858553449,-0.4591848472,-0.4179066669,0.0365577526,-0.067948678,0.0771588758
0.94,-0.4303320918,-0.4736626455,-0.463286452,-0.4087394861,0.0329543602,-0.0649231594,0.0728080111
0.95,-0.4382215168,-0.4600790359,-0.4672583903,-0.3995138362,0.0290368735,-0.0605651997,0.0671660885
0.96,-0.4464009558,-0.4447502341,-0.4711079436,-0.3902349063,0.0247069878,-0.0545153278,0.0598527878
0.97,-0.4550073039,-0.4271766311,-0.4748418615,-0.3809072981,0.0198345576,-0.046269333,0.0503414427
0.98,-0.464216813,-0.4066635403,-0.4784664048,-0.3715351028,0.0142495917,-0.0351284375,0.0379085476
0.99,-0.4742551949,-0.382258224,-0.481987384,-0.3621219675,0.0077321891,-0.0201362565,0.0215697838
1,-0.4854101966,-0.3526711514,-0.4854101966,-0.3526711514,-0,-0,0
