xi,s1,s2
0,5.05325922841122e-27,8.08591106398274e-27
0.01,-0.00604559508564758,-0.0081619199386993
0.02,-0.0124927843082721,-0.0159421137973564
0.03,-0.0193163633416017,-0.0233397617467705
0.04,-0.0264918180349222,-0.0303543743819826
0.05,-0.0339953167619957,-0.0369857852844226
0.06,-0.041803702769978,-0.0432341435840562
0.07,-0.0498944865283373,-0.0490999065215318
0.08,-0.0582458380777718,-0.0545838320103271
0.09,-0.066836579379128,-0.0596869711988963
0.1,-0.0756461766623185,-0.0644106610328168
0.11,-0.0846547327752403,-0.0687565168169361
0.12,-0.0938429795326928,-0.0727264247775189
0.13,-0.103192270065296,-0.0763225346243933
0.14,-0.112684571168408,-0.0795472521130986
0.15,-0.122302455651043,-0.0824032316070313
0.16,-0.132029094684791,-0.0848933686395928
0.17,-0.141848250152734,-0.0870207924763356
0.18,-0.151744266998364,-0.0887888586771104
0.19,-0.161702065574503,-0.0902011416582131
0.2,-0.171707133992219,-0.0912614272545315
0.21,-0.181745520469745,-0.0919737052816922
0.22,-0.191803825681397,-0.0923421620982077
0.23,-0.201869195106492,-0.092371173167623
0.24,-0.211929311378265,-0.0920652956206625
0.25,-0.22197238663279,-0.091429260817377
0.26,-0.231987154857894,-0.0904679669092905
0.27,-0.241962864242079,-0.0891864714015471
0.28,-0.251889269523438,-0.0875899837150578
0.29,-0.261756624338571,-0.0856838577486475
0.3,-0.271555673571508,-0.0834735844412017
0.31,-0.281277645702622,-0.0809647843338137
0.32,-0.290914245157553,-0.0781632001319309
0.33,-0.300457644656119,-0.0750746892675023
0.34,-0.309900477561239,-0.0717052164611251
0.35,-0.319235830227849,-0.0680608462841914
0.36,-0.328457234351821,-0.0641477357210352
0.37,-0.337558659318881,-0.0599721267310796
0.38,-0.346534504553527,-0.0555403388109833
0.39,-0.355379591867945,-0.0508587615567872
0.4,-0.364089157810932,-0.0459338472260622
0.41,-0.372658846016807,-0.0407721033000552
0.42,-0.381084699554335,-0.0353800850458361
0.43,-0.389363153275645,-0.0297643880784452
0.44,-0.397491026165142,-0.0239316409230397
0.45,-0.405465513688433,-0.0178884975770403
0.46,-0.413284180141237,-0.0116416300722786
0.47,-0.420944950998312,-0.00519772103714384
0.48,-0.428446105262363,0.0014365437412706
0.49,-0.435786267812971,0.00825448275501983
0.5,-0.442964401755502,0.0152494262131608
0.51,-0.449979800770027,0.0224147234796056
0.52,-0.456832081460246,0.0297437505109743
0.53,-0.463521175702397,0.0372299172944481
0.54,-0.470047322994182,0.0448666752856225
0.55,-0.47641106280368,0.0526475248463609
0.56,-0.482613226918266,0.0605660226826467
0.57,-0.488654931793532,0.0686157892824373
0.58,-0.494537570902201,0.0767905163535171
0.59,-0.500262807083047,0.0850839742613504
0.6,-0.505832564889814,0.0934900194669343
0.61,-0.511249022940132,0.102002601964652
0.62,-0.516514606264436,0.110615772720128
0.63,-0.521631978654885,0.119323691108076
0.64,-0.526604035014278,0.128120632350157
0.65,-0.531433893704975,0.137000994952832
0.66,-0.53612488889781,0.145959308145212
0.67,-0.540680562921015,0.154990239316913
0.68,-0.545104658609135,0.164088601455911
0.69,-0.549401111651945,0.173249360586391
0.7,-0.553574042943372,0.182467643206603
0.71,-0.557627750930408,0.191738743726716
0.72,-0.561566703962031,0.201058131906667
0.73,-0.565395532638123,0.21042146029402
0.74,-0.569119022158389,0.219824571661812
0.75,-0.572742104671272,0.229263506446414
0.76,-0.576269851622872,0.238734510185378
0.77,-0.579707466105868,0.248234040955291
0.78,-0.583060275208429,0.257758776809632
0.79,-0.58633372236314,0.267305623216621
0.8,-0.589533359695911,0.276871720497074
0.81,-0.592664840374906,0.286454451262257
0.82,-0.595733910959449,0.296051447851734
0.83,-0.598746403748954,0.30566059977123
0.84,-0.601708229131832,0.315280061130472
0.85,-0.604625367934417,0.324908258081053
0.86,-0.607503863769881,0.334543896254277
0.87,-0.610349815387153,0.344185968199019
0.88,-0.613169369019835,0.353833760819571
0.89,-0.615968710735122,0.363486862813501
0.9,-0.618754058782719,0.373145172109504
0.91,-0.621531655943761,0.382808903305253
0.92,-0.624307761879729,0.392478595105257
0.93,-0.627088645481367,0.402155117758709
0.94,-0.629880577217604,0.411839680497343
0.95,-0.63268982148447,0.421533838973284
0.96,-0.635522628954011,0.431239502696904
0.97,-0.638385228923212,0.440958942474674
0.98,-0.641283821662914,0.450694797847015
0.99,-0.644224570766728,0.460450084526155
1,-0.647213595499958,0.470228201833979
