xi,sx,sy,cx,cy,ex,ey,ne
0,-1.71963433182451e-27,5.67845383553425e-28,0,0,-1.71963433182451e-27,5.67845383553425e-28,1.81096400152307e-27
0.01,-0.00783580334984584,-0.0182663805148289,-0.00398527645065169,-0.00932420767982078,-0.00385052689919415,-0.00894217283500812,0.00973596489376245
0.02,-0.0154618622757107,-0.0357635586764234,-0.00801062471855411,-0.0186296442114537,-0.00745123755715656,-0.0171339144649697,0.0186840029443928
0.03,-0.0228853263884781,-0.052517674760854,-0.0120767916678916,-0.027915774883104,-0.0108085347205865,-0.02460189987775,0.0268715072223528
0.04,-0.0301133452990319,-0.0685548690441914,-0.0161845425066783,-0.0371820437286331,-0.0139288027923535,-0.0313728253155583,0.0343258753057924
0.05,-0.0371530686182556,-0.083901281802506,-0.0203346612564669,-0.0464278725228547,-0.0168184073617886,-0.0374734092796514,0.041074508265192
0.06,-0.0440116459570328,-0.0985830533118683,-0.0245279512276781,-0.0556526597235463,-0.0194836947293547,-0.042930393588322,0.0471448094062848
0.07,-0.0506962269262472,-0.112626323848349,-0.0287652354996098,-0.064855779357191,-0.0219309914266374,-0.047770544491158,0.0525641827287075
0.08,-0.0572139611367824,-0.126057233688019,-0.0330473574040319,-0.0740365798453178,-0.0241666037327506,-0.0520206538427009,0.0573600310512285
0.09,-0.0635719981995222,-0.138901923106948,-0.0373751810110897,-0.0831943827681378,-0.0261968171884325,-0.0557075403388099,0.0615597537471057
0.1,-0.06977748772535,-0.151186532381207,-0.0417495916160402,-0.09232848156201,-0.0280278961093098,-0.0588580508191967,0.0651907440251252
0.11,-0.0758375793251497,-0.162937201786866,-0.0461714962251244,-0.101438140147097,-0.0296660831000253,-0.0614990616397697,0.0682803856833703
0.12,-0.0817594226098047,-0.174180071599997,-0.0506418240386218,-0.110522591481391,-0.0311175985711829,-0.0636574801186054,0.0708560492540187
0.13,-0.0875501671901988,-0.184941282096669,-0.0551615269288627,-0.119581036037126,-0.0323886402613361,-0.0653602460595432,0.0729450874490001
0.14,-0.0932169626772156,-0.195246973552953,-0.0597315799106529,-0.128612640195378,-0.0334853827665627,-0.0666343333575758,0.0745748298089358
0.15,-0.0987669586817387,-0.205123286244921,-0.064352981601226,-0.13761653455453,-0.0344139770805127,-0.0675067516903903,0.0757725764527383
0.16,-0.104207304814652,-0.214596360448641,-0.069026754666445,-0.146591812148046,-0.0351805501482068,-0.0680045483005953,0.0765655908244591
0.17,-0.109545150686838,-0.223692336440185,-0.0737539462495493,-0.15553752656685,-0.0357912044372892,-0.0681548098733347,0.076981091340291
0.18,-0.114787645909182,-0.232437354495624,-0.0785356283782637,-0.164452689981462,-0.0362520175309187,-0.0679846645141621,0.0770462418562074
0.19,-0.119941940092567,-0.240857554891027,-0.0833728983455551,-0.173336271058826,-0.0365690417470122,-0.0675212838322012,0.0767881409114936
0.2,-0.125015182847877,-0.248979077902466,-0.0882668790587356,-0.182187192768707,-0.0367483037891412,-0.0667918851337589,0.0762338097637803
0.21,-0.130014523785994,-0.256828063806011,-0.0932187193509621,-0.191004330074336,-0.0367958044350322,-0.0658237337316752,0.0754101793287856
0.22,-0.134947112517804,-0.264430652877732,-0.0982295942484608,-0.199786507501938,-0.0367175182693429,-0.0646441453757939,0.0743440762887421
0.23,-0.139820098654189,-0.271812985393701,-0.103300705186014,-0.208532496583703,-0.036519393468175,-0.0632804888099979,0.0730622088587229
0.24,-0.144640631806033,-0.279001201629987,-0.108433280162369,-0.217241013168713,-0.0362073516436635,-0.0617601884612743,0.0715911530275914
0.25,-0.149415861584219,-0.286021441862661,-0.113628573826278,-0.225910714596409,-0.0357872877579409,-0.0601107272662521,0.0699573405551369
0.26,-0.154152247283484,-0.292896232704943,-0.118887867482801,-0.234540196727231,-0.035264379800683,-0.0583560359777116,0.068183600797837
0.27,-0.158853486933966,-0.299633646118646,-0.124212469008366,-0.243127990825237,-0.0346410179255999,-0.0565056552934091,0.0662788744854596
0.28,-0.163522588249657,-0.306238140402732,-0.129603712661815,-0.251672560287758,-0.0339188755878426,-0.0545655801149736,0.0642486782309733
0.29,-0.168162558944549,-0.312714173856164,-0.135062958777258,-0.260172297217503,-0.0330996001672911,-0.0525418766386608,0.0620985694839002
0.3,-0.172776406732633,-0.319066204777904,-0.140591593323095,-0.268625518832971,-0.0321848134095385,-0.0504406859449328,0.0598341458767664
0.31,-0.177367139327901,-0.325298691466915,-0.146191027309896,-0.277030463713692,-0.0311761120180048,-0.0482682277532221,0.057461045683107
0.32,-0.181937764444343,-0.331416092222158,-0.151862696028106,-0.285385287877573,-0.0300750684162368,-0.0460308043445853,0.0549849496576183
0.33,-0.186491289795952,-0.337422865342596,-0.157608058094614,-0.293688060688622,-0.0288832317013371,-0.0437348046539742,0.0524115847082914
0.34,-0.191030723096718,-0.343323469127192,-0.163428594285214,-0.301936760594567,-0.0276021288115034,-0.0413867085326257,0.0497467301246156
0.35,-0.195559072060633,-0.349122361874908,-0.169325806127808,-0.310129270695317,-0.026233265932825,-0.0389930911795909,0.0469962275213895
0.36,-0.200079344401688,-0.354824001884706,-0.175301214228907,-0.318263374145076,-0.0247781301727814,-0.0365606277396295,0.0441659963724931
0.37,-0.204594547833876,-0.360432847455548,-0.181356356303566,-0.326336749392997,-0.0232381915303103,-0.0340960980625519,0.0412620582216949
0.38,-0.209107690071187,-0.365953356886398,-0.187492784876349,-0.334346965269846,-0.021614905194838,-0.0316063916165517,0.0382905747880684
0.39,-0.213621778827612,-0.371389988476216,-0.193712064618325,-0.342291475931147,-0.0199097142092871,-0.0290985125450698,0.0352579090734416
0.4,-0.218139821817144,-0.376747200523966,-0.200015769282399,-0.35016761567074,-0.0181240525347451,-0.0265795848532265,0.0321707259982125
0.41,-0.222664826753773,-0.38202945132861,-0.206405478196592,-0.357972593622833,-0.0162593485571811,-0.0240568577057773,0.0290361639715015
0.42,-0.227199801351491,-0.38724119918911,-0.212882772272232,-0.365703488375284,-0.0143170290792592,-0.0215377108138268,0.0258621404519499
0.43,-0.231747753324289,-0.392386902404429,-0.21944922948141,-0.373357242522309,-0.0122985238428792,-0.0190296598821204,0.0226579267353183
0.44,-0.236311690386159,-0.397471019273529,-0.22610641975569,-0.380930657191003,-0.0102052706304688,-0.0165403620825264,0.0194353061839063
0.45,-0.240894620251092,-0.402498008095372,-0.2328558992559,-0.38842038658307,-0.00803872099519193,-0.0140776215123019,0.0162111215738506
0.46,-0.24549955063308,-0.40747232716892,-0.239699203961107,-0.395822932581123,-0.00580034667197254,-0.011649394587797,0.0130135473940527
0.47,-0.250129489246113,-0.412398434793137,-0.246637842523673,-0.403134639477767,-0.00349164672244057,-0.00926379531536953,0.00989997477165434
0.48,-0.254787443804184,-0.417280789266984,-0.253673288336776,-0.410351688895579,-0.00111415546740767,-0.00692910037140515,0.00701810333085524
0.49,-0.259476422021284,-0.422123848889423,-0.260806970761213,-0.417470094976978,0.00133054873992888,-0.00465375391244482,0.00484022576197865
0.5,-0.264199431611403,-0.426932071959418,-0.268040265459796,-0.424485699934897,0.0038408338483929,-0.00244637202452058,0.00455376116340301
0.51,-0.268960130672619,-0.431708684176974,-0.275374483790669,-0.431394170068008,0.00641435311805022,-0.00031451410896588,0.00642205925290161
0.52,-0.273764778839343,-0.436451980846279,-0.282810861215418,-0.438190992358077,0.00904608237607546,0.00173901151179806,0.00921171902485683
0.53,-0.278620286130071,-0.441159024672562,-0.290350544684585,-0.444871471781473,0.0117302585545138,0.00371244710891133,0.0123037079489155
0.54,-0.283533562563301,-0.445826878361055,-0.297994578972152,-0.451430729481977,0.0144610164088514,0.00560385112092188,0.0155088408000897
0.55,-0.288511518157529,-0.450452604616989,-0.305743891942359,-0.457863701967286,0.0172323737848304,0.00741109735029671,0.0187584399723348
0.56,-0.293561062931251,-0.455033266145593,-0.313599278747037,-0.46416514150683,0.0200382158157857,0.00913187536123605,0.0220209273349955
0.57,-0.298689106902965,-0.4595659256521,-0.321561384970008,-0.470329617923021,0.0228722780670434,0.0107636922709211,0.0252784132270845
0.58,-0.303902560091166,-0.46404764584174,-0.329630688757197,-0.476351521981333,0.0257281286660314,0.0123038761395932,0.028518800337923
0.59,-0.309208332514352,-0.468475489419743,-0.337807481997316,-0.482225070595854,0.0285991494829644,0.0137495811761108,0.0317326698162541
0.6,-0.314613334191018,-0.47284651909134,-0.346091850648441,-0.487944314075296,0.0314785164574225,0.0150977949839556,0.0349118949892121
0.61,-0.320124475139662,-0.477157797561763,-0.354483654340555,-0.493503145638789,0.0343591792008927,0.0163453480770255,0.0380489631805938
0.62,-0.325748665378781,-0.481406387536242,-0.36298250542307,-0.498895313430035,0.0372338400442891,0.017488925893793,0.0411366183996971
0.63,-0.33149281492687,-0.485589351720007,-0.37158774766907,-0.504114435251253,0.0400949327421997,0.0185250835312463,0.044167661829003
0.64,-0.337363833802427,-0.48970375281829,-0.380298434893951,-0.509154016223452,0.0429346010915249,0.0194502634051626,0.0471348354979476
0.65,-0.343368632023947,-0.493746653536321,-0.389113309794236,-0.514007469555649,0.0457446777702886,0.0202608160193285,0.0500307526435153
0.66,-0.349514119609928,-0.497715116579331,-0.39803078336128,-0.518668140571396,0.0485166637513518,0.0209530239920656,0.0528478559259864
0.67,-0.355807206578867,-0.50160620465255,-0.407048915272672,-0.523129334095351,0.0512417086938053,0.0215231294428008,0.0555783933815324
0.68,-0.362254802949259,-0.505416980461211,-0.416165395709051,-0.527384345244791,0.0539105927597922,0.02196736478358,0.0582144065266238
0.69,-0.368863818739602,-0.509144506710542,-0.425377529083425,-0.531426493600643,0.0565137103438233,0.0222819868901005,0.0607477275014973
0.7,-0.375641163968391,-0.512785846105776,-0.434682220200838,-0.535249160649968,0.0590410562324468,0.0224633145441923,0.0631699835472059
0.71,-0.382593748654124,-0.516338061352143,-0.444075963385369,-0.53884583029784,0.0614822147312445,0.0225077689456969,0.0654726079453976
0.72,-0.389728482815298,-0.519798215154873,-0.4535548351157,-0.54221013214305,0.0638263523004023,0.022411916988177,0.0676468570671248
0.73,-0.397052276470408,-0.523163370219199,-0.463114490696847,-0.545335887101748,0.0660622142264393,0.0221725168825494,0.0696838335154352
0.74,-0.404572039637952,-0.526430589250349,-0.472750165461379,-0.548217154849662,0.0681781258234275,0.021786565599313,0.0715745155862636
0.75,-0.412294682336425,-0.529596934953555,-0.482456680936591,-0.550848282441696,0.0701619986001658,0.0212513474881413,0.0733097934632979
0.76,-0.420229457425508,-0.53265701413442,-0.492228456333574,-0.553223953362731,0.0719989989080658,0.0205669392283114,0.0748789345075417
0.77,-0.428394989129613,-0.535595610000034,-0.502059525610122,-0.555339236171501,0.0736645364805088,0.0197436261714666,0.0762645049107829
0.78,-0.436812244514333,-0.53839504985786,-0.511943560233589,-0.557189631826605,0.0751313157192554,0.0187945819687447,0.0774464389955168
0.79,-0.445502190645264,-0.541037661015359,-0.521873897625424,-0.558771118736079,0.0763717069801604,0.0177334577207201,0.0784035276616815
0.8,-0.454485794588,-0.543505770779995,-0.531843575110962,-0.560080194554783,0.0773577805229627,0.0165744237747885,0.0791134484832075
0.81,-0.463784023408135,-0.545781706459229,-0.541845369032517,-0.561113913771274,0.0780613456243818,0.0153322073120453,0.0795528142918196
0.82,-0.473417844171265,-0.547847795360523,-0.55187183851842,-0.561869920180287,0.0784539943471557,0.0140221248197636,0.0796972346664837
0.83,-0.483408223942983,-0.54968636479134,-0.561915373243558,-0.56234647342872,0.0785071493005747,0.0126601086373793,0.0795213860669756
0.84,-0.493776129788885,-0.551279742059143,-0.571968244376642,-0.562542468950263,0.078192114587757,0.0112627268911196,0.0789990873411134
0.85,-0.504542528774565,-0.552610254471393,-0.582022657793869,-0.562457450762195,0.077480129019304,0.00984719629080166,0.0781033780808332
0.86,-0.515728387965617,-0.553660229335554,-0.59207080855449,-0.562091616780949,0.0763424205888728,0.00843138744539529,0.076806597865175
0.87,-0.527354674427637,-0.554411993959086,-0.60210493558635,-0.561445816512564,0.074750261158713,0.00703382255347784,0.0750804648561103
0.88,-0.539442355226218,-0.554847875649453,-0.612117375521492,-0.56052154118063,0.0726750202952738,0.00567366553117699,0.0728961525423539
0.89,-0.552012397426956,-0.554950201714117,-0.622100614654026,-0.559320906557774,0.0700882172270697,0.00437070484365709,0.0702243636845453
0.9,-0.565085768095445,-0.554701299460539,-0.632047338062575,-0.557846628957378,0.06696156996713,0.00314532949683877,0.0670354007230995
0.91,-0.57868343429728,-0.554083496196184,-0.641950475043538,-0.556101995011246,0.0632670407462581,0.00201849881506244,0.0632992320826651
0.92,-0.592826363098055,-0.553079119228511,-0.651803240132826,-0.554090825999095,0.0589768770347714,0.00101170677058393,0.0589855539548811
0.93,-0.607535521563364,-0.551670495864986,-0.661599169145208,-0.551817437601931,0.0540636475818438,0.000146941736945405,0.0540638472708691
0.94,-0.622831876758803,-0.549839953413068,-0.671332149823508,-0.549286596020606,0.0485002730647052,-0.000553357392462095,0.048503429690639
0.95,-0.638736395749966,-0.547569819180221,-0.680996446856355,-0.546503471432743,0.0422600511063892,-0.00106634774747771,0.0422735025403997
0.96,-0.655270045602448,-0.544842420473907,-0.690586721185054,-0.543473589757279,0.0353166755826058,-0.0013688307166273,0.0353431927213403
0.97,-0.672453793381843,-0.541640084601588,-0.70009804367065,-0.540202783659707,0.0276442502888069,-0.00143730094188055,0.0276815896947363
0.98,-0.690308606153745,-0.537945138870726,-0.709525903325897,-0.536697143667543,0.0192172971721514,-0.00124799520318353,0.0192577777178455
0.99,-0.708855450983751,-0.533739910588785,-0.718866210429732,-0.532962970180395,0.0100107594459812,-0.00077694040839027,0.010040863562637
1,-0.728115294937453,-0.529006727063226,-0.728115294931767,-0.529006727058463,-5.6861182429202e-12,-4.76252370873453e-12,7.41711350518033e-12
