xi,sx,sy,cx,cy,ex,ey,ne
0,-0,0,0,0,-0,0,0
0.01,0.0131499679,-0.0389501154,0.0031314169,-0.0095814661,0.0100185511,-0.0293686494,0.0310304517
0.02,0.0228668189,-0.0660029515,0.0063205337,-0.019142339,0.0165462853,-0.0468606125,0.0496960417
0.03,0.0307993441,-0.086819249,0.0095694086,-0.0286815281,0.0212299356,-0.0581377209,0.0618926874
0.04,0.0377699385,-0.1042005232,0.0128802038,-0.03819786,0.0248897346,-0.0660026632,0.0705397083
0.05,0.0441650184,-0.1194487058,0.0162551924,-0.0476900717,0.027909826,-0.0717586341,0.0769951943
0.06,0.0501691786,-0.1331789825,0.0196967646,-0.0571568018,0.030472414,-0.0760221807,0.0819020145
0.07,0.0558851057,-0.1457332928,0.0232074357,-0.066596581,0.03267767,-0.0791367119,0.085618043
0.08,0.0613812035,-0.1573417391,0.0267898533,-0.0760078217,0.0345913502,-0.0813339174,0.0883842047
0.09,0.0667062667,-0.168169942,0.030446806,-0.0853888065,0.0362594608,-0.0827811355,0.0903740277
0.1,0.0718959034,-0.1783389006,0.0341812316,-0.0947376753,0.0377146718,-0.0836012254,0.0917145646
0.11,0.0769769136,-0.1879388712,0.0379962271,-0.1040524104,0.0389806864,-0.0838864608,0.092500985
0.12,0.0819702485,-0.19703915,0.0418950577,-0.1133308211,0.0400751908,-0.0837083289,0.0928068168
0.13,0.0868928881,-0.2056946201,0.0458811672,-0.1225705248,0.0410117209,-0.0831240952,0.0926907571
0.14,0.0917589678,-0.2139499211,0.0499581888,-0.1317689278,0.041800779,-0.0821809933,0.0922009804
0.15,0.0965804885,-0.2218420936,0.0541299559,-0.1409232016,0.0424505325,-0.080918892,0.0913778682
0.16,0.1013678911,-0.2294024401,0.0584005139,-0.1500302584,0.0429673773,-0.0793721817,0.0902559623
0.17,0.1061306146,-0.2366579756,0.0627741309,-0.1590867226,0.0433564838,-0.077571253,0.0888655387
0.18,0.1108776275,-0.2436325495,0.0672553101,-0.1680888984,0.0436223174,-0.0755436511,0.0872338798
0.19,0.1156178993,-0.2503476688,0.0718488011,-0.1770327345,0.0437690983,-0.0733149343,0.0853862609
0.2,0.1203607781,-0.2568230506,0.0765596103,-0.1859137837,0.0438011677,-0.0709092668,0.0833466641
0.21,0.1251162395,-0.2630769324,0.081393012,-0.194727158,0.0437232275,-0.0683497744,0.0811382295
0.22,0.1298949768,-0.2691261695,0.0863545562,-0.2034674777,0.0435404206,-0.0656586918,0.0787834502
0.23,0.1347083171,-0.2749861546,0.0914500764,-0.2121288151,0.0432582407,-0.0628573395,0.0763041317
0.24,0.1395679934,-0.2806706077,0.0966856928,-0.220704631,0.0428823006,-0.0599659767,0.0737211643
0.25,0.1444858163,-0.2861912903,0.1020678131,-0.2291877039,0.0424180032,-0.0570035864,0.0710541756
0.26,0.1494732961,-0.2915576993,0.1076031271,-0.2375700514,0.041870169,-0.0539876478,0.0683211327
0.27,0.1545412618,-0.2967767948,0.1132985947,-0.2458428434,0.0412426671,-0.0509339514,0.0655379661
0.28,0.1596995274,-0.3018528177,0.1191614253,-0.2539963055,0.0405381021,-0.0478565122,0.0627182867
0.29,0.1649566466,-0.3067872443,0.1251990449,-0.2620196148,0.0397576017,-0.0447676294,0.0598732623
0.3,0.1703197768,-0.3115788958,0.1314190488,-0.2699007864,0.038900728,-0.0416781094,0.0570116781
0.31,0.1757946366,-0.3162241756,0.1378291359,-0.2776265516,0.0379655007,-0.038597624,0.0541401498
0.32,0.1813855345,-0.320717398,0.14443702,-0.2851822318,0.0369485145,-0.0355351662,0.0512634447
0.33,0.1870954424,-0.325051168,0.1512503125,-0.2925516077,0.03584513,-0.0324995603,0.0483848608
0.34,0.1929260926,-0.329216775,0.1582763719,-0.2997167917,0.0346497206,-0.0294999833,0.0455066166
0.35,0.1988780712,-0.3332045616,0.1655221132,-0.3066581073,0.033355958,-0.0265464543,0.0426302025
0.36,0.204950891,-0.3370042359,0.1729937709,-0.3133539874,0.0319571201,-0.0236502485,0.039756657
0.37,0.2111430355,-0.3406051206,0.1806966112,-0.319780902,0.0304464243,-0.0208242186,0.0368867568
0.38,0.2174519804,-0.3439963492,0.1886345889,-0.3259133334,0.0288173914,-0.0180830157,0.0340211333
0.39,0.2238741989,-0.3471670236,0.1968099489,-0.3317238169,0.02706425,-0.0154432067,0.0311603316
0.4,0.230405159,-0.3501063483,0.2052227768,-0.3371830725,0.0251823822,-0.0129232759,0.0283048306
0.41,0.2370393176,-0.3528037549,0.2138705109,-0.3422602522,0.0231688068,-0.0105435027,0.0254550399
0.42,0.243770121,-0.3552490303,0.2227474364,-0.3469233292,0.0210226846,-0.0083257011,0.0226112929
0.43,0.2505900153,-0.3574324591,0.2318441955,-0.3511396495,0.0187458197,-0.0062928096,0.0197738517
0.44,0.2574904721,-0.3593449767,0.2411473582,-0.3548766606,0.0163431139,-0.0044683162,0.0169429401
0.45,0.2644620316,-0.3609783272,0.2506391086,-0.3581028104,0.013822923,-0.0028755168,0.0141188454
0.46,0.2714943654,-0.3623252182,0.2602971092,-0.3607885932,0.0111972563,-0.001536625,0.0113022018
0.47,0.2785763626,-0.3633794661,0.270094599,-0.3629076874,0.0084817636,-0.0004717787,0.0084948743
0.48,0.2856962402,-0.3641361236,0.2800007709,-0.3644381064,0.0056954693,0.0003019828,0.0057034695
0.49,0.2928416817,-0.3645915822,0.2899814422,-0.3653632591,0.0028602395,0.0007716769,0.0029625083
0.5,0.3,-0.3647436472,0.3,-0.3656728132,0,0.000929166,0.000929166
0.51,0.3071583183,-0.3645915822,0.3100185578,-0.3653632591,-0.0028602395,0.0007716769,0.0029625083
0.52,0.3143037598,-0.3641361236,0.3199992291,-0.3644381064,-0.0056954693,0.0003019828,0.0057034695
0.53,0.3214236374,-0.3633794661,0.329905401,-0.3629076874,-0.0084817636,-0.0004717787,0.0084948743
0.54,0.3285056346,-0.3623252182,0.3397028908,-0.3607885932,-0.0111972563,-0.001536625,0.0113022018
0.55,0.3355379684,-0.3609783272,0.3493608914,-0.3581028104,-0.013822923,-0.0028755168,0.0141188454
0.56,0.3425095279,-0.3593449767,0.3588526418,-0.3548766606,-0.0163431139,-0.0044683162,0.0169429401
0.57,0.3494099847,-0.3574324591,0.3681558045,-0.3511396495,-0.0187458197,-0.0062928096,0.0197738517
0.58,0.356229879,-0.3552490303,0.3772525636,-0.3469233292,-0.0210226846,-0.0083257011,0.0226112929
0.59,0.3629606824,-0.3528037549,0.3861294891,-0.3422602522,-0.0231688068,-0.0105435027,0.0254550399
0.6,0.369594841,-0.3501063483,0.3947772232,-0.3371830725,-0.0251823822,-0.0129232759,0.0283048306
0.61,0.3761258011,-0.3471670236,0.4031900511,-0.3317238169,-0.02706425,-0.0154432067,0.0311603316
0.62,0.3825480196,-0.3439963492,0.4113654111,-0.3259133334,-0.0288173914,-0.0180830157,0.0340211332
0.63,0.3888569645,-0.3406051206,0.4193033888,-0.319780902,-0.0304464243,-0.0208242186,0.0368867568
0.64,0.395049109,-0.3370042359,0.4270062291,-0.3133539874,-0.0319571201,-0.0236502485,0.039756657
0.65,0.4011219288,-0.3332045616,0.4344778868,-0.3066581073,-0.033355958,-0.0265464543,0.0426302025
0.66,0.4070739074,-0.329216775,0.4417236281,-0.2997167917,-0.0346497206,-0.0294999833,0.0455066166
0.67,0.4129045576,-0.325051168,0.4487496875,-0.2925516077,-0.03584513,-0.0324995603,0.0483848608
0.68,0.4186144655,-0.320717398,0.45556298,-0.2851822318,-0.0369485145,-0.0355351662,0.0512634447
0.69,0.4242053634,-0.3162241756,0.4621708641,-0.2776265516,-0.0379655007,-0.038597624,0.0541401498
0.7,0.4296802232,-0.3115788958,0.4685809512,-0.2699007864,-0.038900728,-0.0416781094,0.0570116781
0.71,0.4350433534,-0.3067872443,0.4748009551,-0.2620196148,-0.0397576017,-0.0447676294,0.0598732623
0.72,0.4403004726,-0.3018528177,0.4808385747,-0.2539963055,-0.0405381021,-0.0478565122,0.0627182867
0.73,0.4454587382,-0.2967767948,0.4867014053,-0.2458428434,-0.0412426671,-0.0509339514,0.0655379661
0.74,0.4505267039,-0.2915576993,0.4923968729,-0.2375700514,-0.041870169,-0.0539876478,0.0683211327
0.75,0.4555141837,-0.2861912903,0.4979321869,-0.2291877039,-0.0424180032,-0.0570035864,0.0710541756
0.76,0.4604320066,-0.2806706077,0.5033143072,-0.220704631,-0.0428823006,-0.0599659767,0.0737211643
0.77,0.4652916829,-0.2749861546,0.5085499236,-0.2121288151,-0.0432582407,-0.0628573395,0.0763041317
0.78,0.4701050232,-0.2691261695,0.5136454438,-0.2034674777,-0.0435404205,-0.0656586918,0.0787834502
0.79,0.4748837605,-0.2630769324,0.518606988,-0.194727158,-0.0437232275,-0.0683497744,0.0811382295
0.8,0.4796392219,-0.2568230506,0.5234403897,-0.1859137837,-0.0438011677,-0.0709092668,0.0833466641
0.81,0.4843821007,-0.2503476688,0.5281511989,-0.1770327345,-0.0437690983,-0.0733149343,0.0853862609
0.82,0.4891223725,-0.2436325495,0.5327446899,-0.1680888984,-0.0436223174,-0.0755436511,0.0872338798
0.83,0.4938693854,-0.2366579756,0.5372258691,-0.1590867226,-0.0433564838,-0.077571253,0.0888655387
0.84,0.4986321089,-0.2294024401,0.5415994861,-0.1500302584,-0.0429673773,-0.0793721817,0.0902559623
0.85,0.5034195115,-0.2218420936,0.5458700441,-0.1409232016,-0.0424505325,-0.080918892,0.0913778682
0.86,0.5082410322,-0.2139499211,0.5500418112,-0.1317689278,-0.041800779,-0.0821809933,0.0922009804
0.87,0.5131071119,-0.2056946201,0.5541188328,-0.1225705248,-0.0410117209,-0.0831240952,0.0926907571
0.88,0.5180297515,-0.19703915,0.5581049423,-0.1133308211,-0.0400751908,-0.0837083289,0.0928068168
0.89,0.5230230864,-0.1879388712,0.5620037729,-0.1040524104,-0.0389806864,-0.0838864608,0.092500985
0.9,0.5281040966,-0.1783389006,0.5658187684,-0.0947376753,-0.0377146718,-0.0836012254,0.0917145646
0.91,0.5332937333,-0.168169942,0.569553194,-0.0853888065,-0.0362594607,-0.0827811355,0.0903740277
0.92,0.5386187965,-0.1573417391,0.5732101467,-0.0760078217,-0.0345913502,-0.0813339174,0.0883842047
0.93,0.5441148943,-0.1457332928,0.5767925643,-0.066596581,-0.03267767,-0.0791367119,0.085618043
0.94,0.5498308214,-0.1331789825,0.5803032354,-0.0571568018,-0.030472414,-0.0760221807,0.0819020145
0.95,0.5558349816,-0.1194487058,0.5837448076,-0.0476900717,-0.027909826,-0.0717586341,0.0769951943
0.96,0.5622300615,-0.1042005232,0.5871197962,-0.03819786,-0.0248897346,-0.0660026632,0.0705397082
0.97,0.5692006559,-0.086819249,0.5904305914,-0.0286815281,-0.0212299356,-0.0581377209,0.0618926874
0.98,0.5771331811,-0.0660029515,0.5936794663,-0.019142339,-0.0165462853,-0.0468606125,0.0496960417
0.99,0.5868500321,-0.0389501154,0.5968685831,-0.0095814661,-0.0100185511,-0.0293686494,0.0310304517
1,0.6,-0,0.6,0,0,-0,0
