xi,sx,sy,cx,cy,ex,ey,ne
0,0,0,0,0,0,0,0
0.01,0.0152614727,-0.00518321,0.0096130487,-0.0034810041,0.005648424,-0.001702206,0.0058993389
0.02,0.0301032949,-0.0101316346,0.0192479707,-0.0068994454,0.0108553242,-0.0032321893,0.0113263017
0.03,0.0445423418,-0.0148532376,0.0289044685,-0.0102549005,0.0156378734,-0.0045983371,0.0162999321
0.04,0.0585951424,-0.0193558184,0.0385822367,-0.0135469498,0.0200129057,-0.0058088686,0.0208388903
0.05,0.072277879,-0.0236470123,0.0482809625,-0.0167751781,0.0239969166,-0.0068718342,0.0249614525
0.06,0.0856063882,-0.0277342905,0.0580003256,-0.0199391744,0.0276060626,-0.0077951161,0.0286855107
0.07,0.0985961597,-0.0316249599,0.0677399981,-0.0230385325,0.0308561615,-0.0085864274,0.0320285723
0.08,0.1112623372,-0.0353261633,0.0774996448,-0.026072851,0.0337626924,-0.0092533122,0.0350077589
0.09,0.1236197181,-0.038844879,0.0872789228,-0.0290417336,0.0363407953,-0.0098031454,0.0376398069
0.1,0.1356827533,-0.0421879215,0.097077482,-0.0319447893,0.0386052713,-0.0102431322,0.0399410657
0.11,0.1474655477,-0.0453619409,0.106894965,-0.0347816327,0.0405705827,-0.0105803081,0.0419274981
0.12,0.1589818594,-0.048373423,0.1167310068,-0.0375518843,0.0422508526,-0.0108215387,0.0436146793
0.13,0.1702451008,-0.0512286897,0.1265852356,-0.0402551704,0.0436598652,-0.0109735193,0.045017796
0.14,0.1812683374,-0.0539338983,0.136457272,-0.0428911237,0.0448110654,-0.0110427746,0.0461516462
0.15,0.1920642887,-0.0564950423,0.1463467299,-0.0454593833,0.0457175589,-0.0110356589,0.0470306385
0.16,0.202645328,-0.0589179507,0.1562532159,-0.0479595952,0.0463921121,-0.0109583555,0.0476687908
0.17,0.213023482,-0.0612082884,0.16617633,-0.0503914121,0.046847152,-0.0108168764,0.0480797303
0.18,0.2232104313,-0.0633715563,0.1761156652,-0.052754494,0.0470947661,-0.0106170623,0.0482766922
0.19,0.2332175099,-0.0654130907,0.1860708077,-0.0550485081,0.0471467023,-0.0103645825,0.0482725192
0.2,0.243055706,-0.067338064,0.1960413372,-0.0572731296,0.0470143687,-0.0100649343,0.0480796607
0.21,0.2527356609,-0.0691514842,0.2060268272,-0.0594280412,0.0467088337,-0.0097234431,0.0477101718
0.22,0.2622676701,-0.0708581955,0.2160268444,-0.0615129336,0.0462408257,-0.0093452618,0.0471757128
0.23,0.2716616823,-0.0724628773,0.2260409496,-0.0635275061,0.0456207328,-0.0089353712,0.046487548
0.24,0.2809273004,-0.0739700453,0.2360686973,-0.065471466,0.0448586031,-0.0084985793,0.0456565452
0.25,0.2900737806,-0.0753840507,0.2461096363,-0.0673445297,0.0439641443,-0.008039521,0.0446931749
0.26,0.2991100329,-0.0767090807,0.2561633095,-0.0691464222,0.0429467234,-0.0075626585,0.0436075092
0.27,0.3080446211,-0.0779491581,0.2662292542,-0.0708768777,0.0418153669,-0.0070722805,0.0424092214
0.28,0.3168857625,-0.0791081417,0.2763070022,-0.0725356395,0.0405787603,-0.0065725022,0.0411075853
0.29,0.3256413282,-0.080189726,0.2863960802,-0.0741224605,0.039245248,-0.0060672655,0.0397114744
0.3,0.3343188431,-0.0811974413,0.2964960096,-0.0756371033,0.0378228334,-0.005560338,0.0382293616
0.31,0.3429254854,-0.0821346538,0.3066063071,-0.07707934,0.0363191783,-0.0050553137,0.0366693184
0.32,0.3514680875,-0.0830045652,0.3167264844,-0.078448953,0.0347416031,-0.0045556122,0.0350390152
0.33,0.3599531351,-0.0838102133,0.3268560489,-0.0797457345,0.0330970862,-0.0040644788,0.0333457209
0.34,0.3683867677,-0.0845544717,0.3369945037,-0.0809694874,0.031392264,-0.0035849843,0.0315963028
0.35,0.3767747786,-0.0852400496,0.3471413477,-0.0821200246,0.029633431,-0.003120025,0.0297972279
0.36,0.3851226147,-0.0858694921,0.3572960758,-0.0831971699,0.0278265389,-0.0026723222,0.0279545627
0.37,0.3934353765,-0.0864451802,0.3674581794,-0.0842007577,0.025977197,-0.0022444225,0.0260739755
0.38,0.4017178183,-0.0869693305,0.3776271465,-0.0851306333,0.0240906718,-0.0018386972,0.0241607383
0.39,0.4099743481,-0.0874439956,0.3878024617,-0.0859866528,0.0221718864,-0.0014573428,0.0222197298
0.4,0.4182090275,-0.0878710638,0.3979836067,-0.0867686837,0.0202254209,-0.00110238,0.020255441
0.41,0.4264255719,-0.0882522591,0.4081700603,-0.0874766044,0.0182555116,-0.0007756547,0.0182719825
0.42,0.4346273502,-0.0885891414,0.4183612989,-0.0881103046,0.0162660513,-0.0004788368,0.0162730977
0.43,0.4428173852,-0.0888831066,0.4285567968,-0.0886696856,0.0142605885,-0.000213421,0.0142621854
0.44,0.4509983534,-0.089135386,0.4387560258,-0.0891546598,0.0122423275,1.92738e-05,0.0122423427
0.45,0.4591725847,-0.089347047,0.4489584565,-0.0895651515,0.0102141282,0.0002181045,0.0102164565
0.46,0.4673420629,-0.0895189927,0.4591635574,-0.0899010962,0.0081785055,0.0003821035,0.0081874267
0.47,0.4755084256,-0.0896519619,0.4693707961,-0.0901624412,0.0061376294,0.0005104793,0.0061588217
0.48,0.4836729638,-0.0897465295,0.4795796391,-0.0903491456,0.0040933247,0.0006026161,0.0041374453
0.49,0.4918366224,-0.0898031058,0.489789552,-0.09046118,0.0020470704,0.0006580742,0.0021502463
0.5,0.5,-0.0898219372,0.5,-0.0904985267,0,0.0006765895,0.0006765895
0.51,0.5081633776,-0.0898031058,0.510210448,-0.09046118,-0.0020470704,0.0006580742,0.0021502462
0.52,0.5163270362,-0.0897465295,0.5204203609,-0.0903491456,-0.0040933247,0.0006026161,0.0041374452
0.53,0.5244915744,-0.0896519619,0.5306292038,-0.0901624412,-0.0061376294,0.0005104793,0.0061588216
0.54,0.5326579371,-0.0895189927,0.5408364426,-0.0899010962,-0.0081785055,0.0003821035,0.0081874267
0.55,0.5408274153,-0.089347047,0.5510415435,-0.0895651515,-0.0102141282,0.0002181045,0.0102164565
0.56,0.5490016466,-0.089135386,0.5612439741,-0.0891546598,-0.0122423275,1.92738e-05,0.0122423427
0.57,0.5571826148,-0.0888831066,0.5714432032,-0.0886696856,-0.0142605885,-0.000213421,0.0142621854
0.58,0.5653726498,-0.0885891414,0.5816387011,-0.0881103046,-0.0162660513,-0.0004788368,0.0162730977
0.59,0.5735744281,-0.0882522591,0.5918299397,-0.0874766044,-0.0182555116,-0.0007756547,0.0182719825
0.6,0.5817909725,-0.0878710638,0.6020163933,-0.0867686837,-0.0202254208,-0.00110238,0.020255441
0.61,0.5900256519,-0.0874439956,0.6121975383,-0.0859866528,-0.0221718864,-0.0014573428,0.0222197298
0.62,0.5982821817,-0.0869693305,0.6223728535,-0.0851306333,-0.0240906718,-0.0018386972,0.0241607383
0.63,0.6065646235,-0.0864451802,0.6325418205,-0.0842007577,-0.025977197,-0.0022444225,0.0260739755
0.64,0.6148773853,-0.0858694921,0.6427039242,-0.0831971699,-0.0278265389,-0.0026723222,0.0279545627
0.65,0.6232252214,-0.0852400496,0.6528586523,-0.0821200246,-0.029633431,-0.003120025,0.0297972278
0.66,0.6316132323,-0.0845544717,0.6630054963,-0.0809694874,-0.031392264,-0.0035849843,0.0315963028
0.67,0.6400468649,-0.0838102133,0.6731439511,-0.0797457345,-0.0330970861,-0.0040644788,0.0333457209
0.68,0.6485319125,-0.0830045652,0.6832735156,-0.078448953,-0.0347416031,-0.0045556122,0.0350390152
0.69,0.6570745146,-0.0821346538,0.6933936929,-0.07707934,-0.0363191783,-0.0050553137,0.0366693184
0.7,0.6656811569,-0.0811974413,0.7035039903,-0.0756371033,-0.0378228334,-0.005560338,0.0382293616
0.71,0.6743586718,-0.080189726,0.7136039198,-0.0741224605,-0.039245248,-0.0060672655,0.0397114744
0.72,0.6831142375,-0.0791081417,0.7236929978,-0.0725356395,-0.0405787603,-0.0065725022,0.0411075853
0.73,0.6919553789,-0.0779491581,0.7337707458,-0.0708768777,-0.0418153669,-0.0070722805,0.0424092214
0.74,0.7008899671,-0.0767090807,0.7438366905,-0.0691464222,-0.0429467234,-0.0075626585,0.0436075092
0.75,0.7099262194,-0.0753840507,0.7538903637,-0.0673445297,-0.0439641443,-0.008039521,0.0446931749
0.76,0.7190726996,-0.0739700453,0.7639313027,-0.065471466,-0.0448586031,-0.0084985793,0.0456565452
0.77,0.7283383177,-0.0724628773,0.7739590504,-0.0635275061,-0.0456207328,-0.0089353712,0.046487548
0.78,0.7377323299,-0.0708581955,0.7839731556,-0.0615129336,-0.0462408257,-0.0093452618,0.0471757128
0.79,0.7472643391,-0.0691514842,0.7939731728,-0.0594280412,-0.0467088337,-0.0097234431,0.0477101718
0.8,0.756944294,-0.067338064,0.8039586627,-0.0572731296,-0.0470143687,-0.0100649343,0.0480796607
0.81,0.7667824901,-0.0654130907,0.8139291923,-0.0550485081,-0.0471467023,-0.0103645825,0.0482725192
0.82,0.7767895687,-0.0633715563,0.8238843348,-0.052754494,-0.0470947661,-0.0106170623,0.0482766921
0.83,0.786976518,-0.0612082884,0.83382367,-0.0503914121,-0.046847152,-0.0108168764,0.0480797303
0.84,0.797354672,-0.0589179507,0.843746784,-0.0479595952,-0.0463921121,-0.0109583555,0.0476687908
0.85,0.8079357113,-0.0564950423,0.8536532701,-0.0454593833,-0.0457175589,-0.0110356589,0.0470306385
0.86,0.8187316626,-0.0539338983,0.863542728,-0.0428911237,-0.0448110654,-0.0110427746,0.0461516462
0.87,0.8297548992,-0.0512286897,0.8734147644,-0.0402551704,-0.0436598652,-0.0109735193,0.045017796
0.88,0.8410181406,-0.048373423,0.8832689932,-0.0375518843,-0.0422508526,-0.0108215387,0.0436146792
0.89,0.8525344523,-0.0453619409,0.893105035,-0.0347816327,-0.0405705827,-0.0105803081,0.0419274981
0.9,0.8643172467,-0.0421879215,0.9029225179,-0.0319447893,-0.0386052713,-0.0102431322,0.0399410657
0.91,0.8763802819,-0.038844879,0.9127210772,-0.0290417336,-0.0363407953,-0.0098031454,0.0376398069
0.92,0.8887376628,-0.0353261633,0.9225003552,-0.026072851,-0.0337626924,-0.0092533122,0.0350077589
0.93,0.9014038403,-0.0316249599,0.9322600019,-0.0230385325,-0.0308561615,-0.0085864274,0.0320285722
0.94,0.9143936118,-0.0277342905,0.9419996744,-0.0199391744,-0.0276060626,-0.0077951161,0.0286855107
0.95,0.927722121,-0.0236470123,0.9517190375,-0.0167751781,-0.0239969165,-0.0068718342,0.0249614525
0.96,0.9414048576,-0.0193558184,0.9614177633,-0.0135469498,-0.0200129057,-0.0058088686,0.0208388903
0.97,0.9554576582,-0.0148532376,0.9710955315,-0.0102549005,-0.0156378733,-0.0045983371,0.0162999321
0.98,0.9698967051,-0.0101316346,0.9807520293,-0.0068994454,-0.0108553242,-0.0032321893,0.0113263017
0.99,0.9847385273,-0.00518321,0.9903869513,-0.0034810041,-0.005648424,-0.001702206,0.0058993389
1,1,0,1,0,0,-0,0
