xi,s1,s2
0,4.35214196362166e-25,-6.07497464686584e-25
0.01,0.0220175691893565,0.0269501009074101
0.02,0.039127414504555,0.0495350649875784
0.03,0.0526918776331875,0.0689014751020817
0.04,0.0637257135537688,0.0859071221953104
0.05,0.0729647794637531,0.101178033475667
0.06,0.0809269211698367,0.115159009092107
0.07,0.0879650569405486,0.128157667306016
0.08,0.0943124588211264,0.140381998158436
0.09,0.10012023141068,0.151971425632623
0.1,0.105486988101641,0.163021378311951
0.11,0.1104807247815,0.173601368533156
0.12,0.115152896248714,0.183766584423651
0.13,0.119545142160318,0.193563368205064
0.14,0.123691576665414,0.203031015970046
0.15,0.127620119070324,0.212202804769304
0.16,0.131353667829398,0.221106917444193
0.17,0.134911137895695,0.229767281946437
0.18,0.138308361431557,0.238204325144991
0.19,0.141558851879083,0.246435641120039
0.2,0.144674431390484,0.254476573944141
0.21,0.147665721618351,0.262340714950505
0.22,0.150542497865796,0.270040314488419
0.23,0.153313906640335,0.277586608184157
0.24,0.155988552554906,0.28499006019614
0.25,0.158574502697665,0.292260543614742
0.26,0.161079277027297,0.299407486714153
0.27,0.163509844017219,0.306439993105891
0.28,0.165872622208474,0.313366936070232
0.29,0.168173487671347,0.320197027065576
0.3,0.170417787375713,0.326938858415764
0.31,0.172610358470088,0.333600920175314
0.32,0.174755553469425,0.340191591172613
0.33,0.176857271351612,0.346719104231031
0.34,0.178918994561423,0.353191485573246
0.35,0.180943831617518,0.359616469656682
0.36,0.182934562231724,0.36600140211194
0.37,0.184893679677312,0.372353152363018
0.38,0.186823428621392,0.378678043247173
0.39,0.188725838339417,0.384981797970608
0.4,0.190602751311776,0.391269504400084
0.41,0.19245584720248,0.397545596690447
0.42,0.194286662219938,0.403813854248083
0.43,0.196096603859817,0.410077418030286
0.44,0.197886961030002,0.416338824180549
0.45,0.199658909557975,0.422600054999054
0.46,0.201413513240121,0.428862606907012
0.47,0.20315172248922,0.435127571004258
0.48,0.204874374773186,0.441395717246457
0.49,0.206582198557838,0.447667578576401
0.5,0.208275820856828,0.453943534788699
0.51,0.20995577838882,0.460223896127644
0.52,0.211622532341923,0.46650898661827
0.53,0.213276486745373,0.472799227130597
0.54,0.21491801044846,0.479095218177063
0.55,0.216547462706711,0.485397822443141
0.56,0.218165222375216,0.491708247050984
0.57,0.21977172057884,0.498028125363381
0.58,0.221367474696573,0.504359595127915
0.59,0.222953118365181,0.510705365126963
0.6,0.22452942490569,0.517068766491682
0.61,0.226097323971251,0.52345378838193
0.62,0.227657911415992,0.529865098031523
0.63,0.229212452384834,0.536308045158818
0.64,0.230762377624287,0.542788650742616
0.65,0.232309273014226,0.549313580163397
0.66,0.23385486232063,0.555890100709882
0.67,0.235400983169327,0.562526023450987
0.68,0.23694955635164,0.569229629796674
0.69,0.238502550875521,0.576009589788054
0.7,0.240061951879418,0.582874892877576
0.71,0.241629735588395,0.589834803390738
0.72,0.243207851724074,0.596898841869968
0.73,0.244798213370154,0.604076792305721
0.74,0.246402694293499,0.611378735254782
0.75,0.248023133720793,0.618815106845809
0.76,0.249661348570771,0.626396783672071
0.77,0.251319153142019,0.634135193571424
0.78,0.252998386256341,0.642042452293507
0.79,0.254700945911222,0.650131526492798
0.8,0.25642883300052,0.658416435826306
0.81,0.258184209663815,0.666912539729273
0.82,0.259969476167423,0.675636940857897
0.83,0.261787366799101,0.68460900914999
0.84,0.263641064780023,0.693851026532712
0.85,0.265534336194014,0.703388952277374
0.86,0.267471682934046,0.713253309001321
0.87,0.269458514665991,0.723480189316883
0.88,0.271501339809643,0.734112383127395
0.89,0.273607975536993,0.74520062557033
0.9,0.275787780483597,0.756804992216199
0.91,0.27805205817626,0.768997507099474
0.92,0.280415272660715,0.781870582059281
0.93,0.282897613918104,0.7955551578581
0.94,0.28552899549699,0.810249140524438
0.95,0.288354485329716,0.826256139894818
0.96,0.291441169733131,0.84403451035509
0.97,0.294886450593669,0.864256693781068
0.98,0.298827775736794,0.887878864678485
0.99,0.303453802480795,0.91622087752227
1,0.309016994374947,0.951056516295154
