x,y,z
-0.65,0.125,-0.480817246629871
0.65,0.125,-0.480817246629871
0.65,-0.125,-0.480817246629871
-0.65,-0.125,-0.480817246629871
-0.75,0.0999999999999999,0.0191827533701287
0.75,0.0999999999999999,0.0191827533701288
0.75,-0.1,0.0191827533701287
-0.75,-0.1,0.0191827533701287
