xi,s1,s2
0,1.70475337207025e-27,2.04911882329332e-28
0.01,0.00542782940539113,-0.0365963403020196
0.02,0.0145068537498957,-0.0643840719325482
0.03,0.0261922923713864,-0.0851724384857424
0.04,0.0395759448964014,-0.100308388363741
0.05,0.0538870123437438,-0.11080667120091
0.06,0.0684888340346371,-0.117450258256954
0.07,0.0828722119934138,-0.120864910880636
0.08,0.0966459945227116,-0.121571721145844
0.09,0.109525590637153,-0.120021448761742
0.1,0.121320087039481,-0.116614478358748
0.11,0.131918639323137,-0.11171022125208
0.12,0.141276809022337,-0.105629785436322
0.13,0.149403506326704,-0.0986556722044266
0.14,0.156349054077118,-0.0910314593338196
0.15,0.16219454503538,-0.0829625281040434
0.16,0.167042465808859,-0.0746177916804942
0.17,0.171008536400911,-0.0661322472364316
0.18,0.174214714057962,-0.0576101725247091
0.19,0.176783310084129,-0.0491287876106743
0.2,0.178832168294242,-0.0407422024776864
0.21,0.180470853776173,-0.0324854712166997
0.22,0.181797800633322,-0.0243785735113605
0.23,0.182898367375868,-0.0164301441384624
0.24,0.183843747905412,-0.00864077387288688
0.25,0.184690675035645,-0.00100574574925372
0.26,0.185481822620387,0.00648281554775952
0.27,0.186246791469745,0.0138343263711473
0.28,0.187003561127129,0.0210585926248667
0.29,0.187760289525926,0.0281650576515571
0.3,0.188517342544667,0.0351623830435565
0.31,0.189269435479515,0.0420582959260815
0.32,0.190007768452893,0.0488596362614384
0.33,0.190722037777081,0.055572537723132
0.34,0.191402205293796,0.062202675689652
0.35,0.192039909030941,0.0687555164565428
0.36,0.19262942378611,0.0752365122701197
0.37,0.193168163980714,0.0816512215967965
0.38,0.193656787399018,0.0880053615923764
0.39,0.194098970283691,0.0943048046650838
0.4,0.19450092453993,0.100555531142684
0.41,0.194870727800177,0.106763550054043
0.42,0.1952175371015,0.112934800035488
0.43,0.195550756927667,0.119075042372313
0.44,0.195879232367974,0.125189758185792
0.45,0.196210538144501,0.131284061775987
0.46,0.196550433774663,0.13736264204694
0.47,0.196902543274161,0.143429741892875
0.48,0.197268271221361,0.149489177381219
0.49,0.197646923911146,0.15554439112816
0.5,0.198035995105875,0.161598532670538
0.51,0.198431575601367,0.167654558587847
0.52,0.198828845825774,0.173715345128119
0.53,0.19922261068916,0.179783806091451
0.54,0.199607835901662,0.185863008724936
0.55,0.199980144978056,0.191956280382779
0.56,0.200336236146636,0.198067298705352
0.57,0.200674178566858,0.204200158104923
0.58,0.200993553197729,0.210359406426059
0.59,0.201295431408781,0.216550050697607
0.6,0.201582214423497,0.2227775363511
0.61,0.20185736432344,0.229047705670163
0.62,0.202125057653563,0.235366741292327
0.63,0.202389792669394,0.241741100584677
0.64,0.202655981266808,0.248177446714781
0.65,0.202927556635085,0.254682582238333
0.66,0.203207627673954,0.261263391024946
0.67,0.203498211215331,0.26792679434353
0.68,0.2038000729963,0.27467972691668
0.69,0.204112704349201,0.281529138245299
0.7,0.204434439326634,0.288482021664397
0.71,0.204762688868226,0.295545470002295
0.72,0.205094260133013,0.302726755632421
0.73,0.20542572867807,0.310033432650383
0.74,0.205753831163294,0.31747345890884
0.75,0.206075846262249,0.325055335642739
0.76,0.206389931458974,0.332788262417461
0.77,0.206695383410658,0.340682305132433
0.78,0.206992789556094,0.34874857481275
0.79,0.207284038725153,0.356999414956819
0.8,0.207572162851336,0.365448597252914
0.81,0.207861011105681,0.374111539222067
0.82,0.208154800945177,0.38300557765594
0.83,0.208457605955532,0.392150338956815
0.84,0.208772841380634,0.40156824796321
0.85,0.209102808234246,0.411285216846097
0.86,0.209448356889498,0.421331555660713
0.87,0.209808731041691,0.431743146138947
0.88,0.210181652939973,0.442562920307309
0.89,0.210563710783421,0.453842685515443
0.9,0.210951109005693,0.465645339929745
0.91,0.211340828223906,0.478047723537055
0.92,0.21173212813747,0.491145985034005
0.93,0.212128130309947,0.505068174316068
0.94,0.212537135368479,0.519999957600035
0.95,0.212973322410294,0.536229449405944
0.96,0.213456478369863,0.554217156142426
0.97,0.214010405100281,0.574697026039405
0.98,0.214659651922428,0.598814600172098
0.99,0.2154242213955,0.628308259320255
1,0.216311896062463,0.665739561406607
