xi,s1,s2
0,-3.76900214060573e-26,-3.12050996130393e-26
0.01,0.00652973382452886,0.00762563045819821
0.02,0.0129544578257348,0.0153456271225987
0.03,0.0192676462915223,0.02316078555884
0.04,0.0254642540627711,0.0310710035231179
0.05,0.0315405566200736,0.039075414806467
0.06,0.0374940017088568,0.0471725105538837
0.07,0.0433230719527819,0.0553602488488796
0.08,0.0490271579206123,0.0636361533228153
0.09,0.0546064411268575,0.0719974015177247
0.1,0.060061786461454,0.0804409037012853
0.11,0.0653946435585129,0.0889633728031289
0.12,0.0706069566287717,0.0975613861128182
0.13,0.07570108229481,0.106231439351532
0.14,0.0806797149823473,0.114969993701817
0.15,0.0855458194350214,0.123773516352659
0.16,0.0903025699339543,0.132638515090635
0.17,0.0949532958171443,0.141561567441965
0.18,0.0995014329072902,0.150539344844991
0.19,0.103950480470036,0.159568632307839
0.2,0.108303963337842,0.168646343981923
0.21,0.112565398847728,0.177769535058333
0.22,0.116738268254005,0.186935410371269
0.23,0.120825992289805,0.19614133007023
0.24,0.124831910563731,0.205384812700947
0.25,0.128759264490326,0.21466353601384
0.26,0.132611183465189,0.223975335798165
0.27,0.13639067400761,0.23331820302004
0.28,0.140100611605406,0.242690279523104
0.29,0.143743735008281,0.252089852531737
0.3,0.147322642727549,0.261515348178548
0.31,0.150839791511329,0.270965324260177
0.32,0.154297496575488,0.280438462408426
0.33,0.157697933381537,0.289933559847248
0.34,0.161043140763511,0.299449520890275
0.35,0.164335025216445,0.308985348318268
0.36,0.167575366169511,0.3185401347612
0.37,0.170765822077162,0.328113054195569
0.38,0.173907937171702,0.337703353654045
0.39,0.177003148730638,0.347310345231624
0.4,0.180052794721907,0.356933398460156
0.41,0.183058121699659,0.366571933111362
0.42,0.186020292832662,0.376225412477321
0.43,0.188940395956637,0.385893337166852
0.44,0.19181945155088,0.395575239446259
0.45,0.194658420548402,0.405270678143532
0.46,0.197458211897544,0.414979234126313
0.47,0.200219689801542,0.424700506355764
0.48,0.202943680570878,0.434434108510857
0.49,0.205630979031462,0.444179666170607
0.5,0.208282354439676,0.453936814535352
0.51,0.210898555863172,0.463705196662374
0.52,0.213480316993974,0.473484462185878
0.53,0.216028360367943,0.483274266486762
0.54,0.218543400971954,0.493074270273508
0.55,0.221026149227329,0.502884139532084
0.56,0.223477313344992,0.512703545799891
0.57,0.225897601054662,0.522532166716462
0.58,0.228287720716987,0.532369686802002
0.59,0.230648381834006,0.542215798413679
0.6,0.232980294979595,0.552070202829141
0.61,0.235284171177658,0.561932611406775
0.62,0.237560720761761,0.571802746772913
0.63,0.23981065175568,0.581680343987445
0.64,0.242034667819901,0.591565151641184
0.65,0.244233465814537,0.601456932840736
0.66,0.246407733034375,0.611355466039699
0.67,0.248558144176813,0.621260545678625
0.68,0.250685358108363,0.631171982600414
0.69,0.252790014500103,0.641089604212598
0.7,0.254872730407018,0.651013254373411
0.71,0.256934096870536,0.660942792984488
0.72,0.258974675627776,0.670878095279666
0.73,0.26099499601504,0.680819050806502
0.74,0.262995552156954,0.690765562104894
0.75,0.264976800536318,0.700717543095575
0.76,0.26693915804327,0.710674917200152
0.77,0.268883000605654,0.720637615223941
0.78,0.270808662505698,0.730605573042958
0.79,0.272716436491046,0.740578729147138
0.8,0.274606574791045,0.750557022103208
0.81,0.276479291151793,0.760540388012473
0.82,0.278334764005944,0.770528758051339
0.83,0.280173140895564,0.780522056195426
0.84,0.281994544268425,0.790520197241828
0.85,0.283799078770109,0.800523085258343
0.86,0.285586840156037,0.810530612603331
0.87,0.287357925949162,0.820542659675321
0.88,0.289112447970474,0.830559095567546
0.89,0.290850546870738,0.840579779819156
0.9,0.292572408792947,0.850604565472157
0.91,0.294278284295906,0.860633303660858
0.92,0.295968509670062,0.870665849979079
0.93,0.297643530777293,0.88070207288931
0.94,0.299303929546735,0.890741864457629
0.95,0.300950453258937,0.900785153718353
0.96,0.302584046750702,0.910831922993157
0.97,0.304205887672795,0.920882227510756
0.98,0.305817424932452,0.930936218695192
0.99,0.30742042045208,0.940994171513315
1,0.309016994374947,0.951056516295154
