xi,sx,sy,cx,cy,ex,ey,ne
0,-5.24606549751867e-26,-4.41362457130867e-25,0,0,-5.24606549751867e-26,-4.41362457130867e-25,4.44469277774091e-25
0.01,0.000238696065326455,-0.017567246864059,0.000431364570803284,-0.010118261020529,-0.00019266850547683,-0.00744898584353004,0.00745147711867343
0.02,0.000534336849832817,-0.0337816761364197,0.000867934531014459,-0.0202347585893573,-0.000333597681181641,-0.0135469175470624,0.0135510244055495
0.03,0.000842544780325342,-0.0488216611527026,0.00130983856422395,-0.0303494843677064,-0.000467293783898609,-0.0184721767849962,0.018478086444668
0.04,0.0011372904883633,-0.0628504270975526,0.00175721018088846,-0.040462429596541,-0.000619919692525155,-0.0223879975010116,0.0223965785898312
0.05,0.00140581705448403,-0.0760157124915313,0.00221018796254837,-0.050573585069768,-0.000804370908064335,-0.0254421274217633,0.0254548396243814
0.06,0.00164455671743515,-0.0884498303751309,0.00266891582167277,-0.0606829411053624,-0.00102435910423761,-0.0277668892697685,0.0277857778601575
0.07,0.00185590289220063,-0.100270051239962,0.00313354327834535,-0.0707904875142242,-0.00127764038614472,-0.0294795637257379,0.0295072371193264
0.08,0.00204571323116903,-0.111579238491888,0.00360422575511771,-0.0808962135665619,-0.00155851252394868,-0.0306830249253261,0.0307225809439162
0.09,0.00222143160657506,-0.122466675389957,0.00408112489147816,-0.0910001079555646,-0.0018596932849031,-0.0314665674343924,0.0315214740330632
0.1,0.00239072830969979,-0.133009030005987,0.00456440887952169,-0.101102158758108,-0.0021736805698219,-0.0319068712478787,0.0319808273821727
0.11,0.00256056847359014,-0.143271411810088,0.00505425282255748,-0.111202353392208,-0.00249368434896734,-0.0320690584178805,0.032165866527139
0.12,0.00273662875160411,-0.153308480024873,0.00555083911855888,-0.1213006785709,-0.00281421036695477,-0.0320078014539734,0.0321312796804991
0.13,0.00292299164425456,-0.163165569923073,0.00605435787054685,-0.131397120252194,-0.00313136622629229,-0.0317684496708788,0.0319224035582273
0.14,0.0031220555819613,-0.172879808787391,0.00656500732620714,-0.14149166358471,-0.00344295174424585,-0.0313881452026814,0.0315764085351362
0.15,0.00333460696177749,-0.182481198325114,0.00708299434927202,-0.151584292848541,-0.00374838738749453,-0.0308969054765729,0.0311234505804708
0.16,0.0035600078222833,-0.191993644950927,0.00760853492545816,-0.161674991390872,-0.00404852710317486,-0.0303186535600554,0.0305877643086219
0.17,0.00379645974298524,-0.201435923537002,0.00814185470604075,-0.171763741555776,-0.00434539496305551,-0.0296721819812252,0.0299886785456094
0.18,0.00404131089307514,-0.210822563997326,0.00868318959246972,-0.181850524607592,-0.00464187869939458,-0.0289720393897339,0.0293415422951859
0.19,0.00429137894963677,-0.220164653440985,0.00923278636579772,-0.191935320647164,-0.00494140741616095,-0.0282293327938203,0.0286585543465952
0.2,0.00454326787769133,-0.229470549614165,0.00979090336509949,-0.202018108520172,-0.00524763548740816,-0.0274524410939937,0.0279494937383112
0.21,0.00479366133419416,-0.238746503970701,0.0103578112195235,-0.212098865716663,-0.00556414988532935,-0.0266476382540373,0.0272223508989294
0.22,0.00503957974558545,-0.247997194983376,0.0109337936391366,-0.222177568260788,-0.00589421389355117,-0.0258196267225878,0.0264838607743792
0.23,0.00527859193410485,-0.257226174250726,0.0115191482703108,-0.232254190589596,-0.00624055633620594,-0.0249719836611295,0.0257399400029814
0.24,0.0055089755521563,-0.266436229584036,0.0121141876220659,-0.242328705419626,-0.00660521206990965,-0.0241075241644098,0.0249960306414055
0.25,0.00572982354690171,-0.275629670594363,0.0127192400705382,-0.252401083599811,-0.0069894165236365,-0.0232285869945518,0.0242573534645547
0.26,0.00594109643932353,-0.284808543357144,0.0133346509496005,-0.262471293949051,-0.00739355451027692,-0.0223372494080931,0.0235290747675252
0.27,0.00614362238357288,-0.293974781529887,0.013960783736639,-0.27253930307655,-0.00781716135306609,-0.0214354784533364,0.0228163920930396
0.28,0.00633904879386489,-0.303130301854079,0.0145980213436053,-0.282605075182748,-0.00825897254974041,-0.0205252266713306,0.0221245464922304
0.29,0.00652975080784351,-0.312277052303408,0.0152467675247374,-0.292668571838357,-0.00871701671689391,-0.0196084804650513,0.0214587717866355
0.3,0.00671870301756511,-0.321417021264129,0.0159074484138063,-0.302729751738652,-0.0091887453962412,-0.0186872695254773,0.0208241946849038
0.31,0.00690932176239382,-0.330552216067543,0.0165805142054236,-0.31278857042972,-0.00967119244302983,-0.0177636456378223,0.0202257031921325
0.32,0.00710528586251017,-0.339684618956581,0.017266440996881,-0.32284498000286,-0.0101611551343709,-0.0168396389537208,0.0196678039891703
0.33,0.00731034399775974,-0.348816128176013,0.0179657328092254,-0.332898928752739,-0.0106553888114657,-0.0159171994232741,0.0191544915934562
0.34,0.007528117024558,-0.357948491346261,0.0186789238088608,-0.3429503607942,-0.0111508067843028,-0.0149981305520611,0.0186891522546509
0.35,0.00776190339387274,-0.36708323763188,0.0194065807539678,-0.352999215631754,-0.0116446773600951,-0.0140840220001255,0.0182745228807959
0.36,0.00801449550627583,-0.376221614464914,0.0201493056935287,-0.363045427674832,-0.0121348101872529,-0.0131761867900819,0.0179127194085037
0.37,0.00828801433603949,-0.385364533748119,0.0209077389508195,-0.373088925690645,-0.01261972461478,-0.0122756080574744,0.0176053401709145
0.38,0.00858376899560218,-0.394512531561022,0.0216825624280105,-0.383129632185105,-0.0130987934324083,-0.0113828993759172,0.0173536390301043
0.39,0.00890214711479128,-0.403665744440509,0.0224745032741209,-0.39316746270054,-0.0135723561593296,-0.010498281739969,0.0171587520294297
0.4,0.0092425409963169,-0.412823904324612,0.0232843379651807,-0.403202325016872,-0.0140417969688638,-0.00962157930774021,0.0170219520176132
0.41,0.00960331350059135,-0.421986353250995,0.0241128968532641,-0.413234118240454,-0.0145095833526727,-0.00875223501054084,0.0169448997266993
0.42,0.00998180652923257,-0.431152077907805,0.0249610692503212,-0.423262731761715,-0.0149792627210886,-0.00788934614609049,0.0169298580702919
0.43,0.0103743938380265,-0.440319763161693,0.0258298091237658,-0.433288044059089,-0.0154554152857393,-0.00703171910260342,0.0169798390802911
0.44,0.010776578737003,-0.449487862753311,0.0267201414939561,-0.443309921322159,-0.0159435627569531,-0.00617794143115141,0.0170986594127037
0.45,0.011183136047973,-0.458654684472247,0.0276331696395192,-0.453328215861393,-0.0164500335915462,-0.00532646861085306,0.0172908898852951
0.46,0.0115882965087272,-0.467818486318399,0.028570083235514,-0.463342764264944,-0.0169817867267868,-0.00447572205345437,0.0175616960551608
0.47,0.0119859706584662,-0.476977579443076,0.0295321675724752,-0.473353385254419,-0.0175461969140091,-0.00362419418865695,0.01791657918416
0.48,0.0123700081312581,-0.486130433057947,0.0305208140323767,-0.483359877180805,-0.0181508059011186,-0.00277055587714242,0.0183610384980929
0.49,0.0127344872437616,-0.495275776021029,0.0315375320317389,-0.49336201508827,-0.0188030447879773,-0.00191376093275936,0.0189001845019152
0.5,0.0130740288104525,-0.504412689473696,0.0325839626840394,-0.503359547256519,-0.0195099338735869,-0.00105314221717734,0.0195383373980832
0.51,0.0133841272745073,-0.51354068472877,0.033661894485294,-0.513352191110714,-0.0202777672107867,-0.000188493618055618,0.0202786432706654
0.52,0.0136614915256592,-0.522659760614635,0.0347732813907716,-0.523339628360217,-0.0211117898651124,0.000679867745582707,0.0211227339958668
0.53,0.0139043872077424,-0.531770434680993,0.0359202637307099,-0.533321499191625,-0.0220158765229676,0.0015510645106328,0.0220704467601066
0.54,0.0141129719147601,-0.540873743079776,0.0371051925130811,-0.543297395295099,-0.022992220598321,0.00242365221532304,0.0231196085196678
0.55,0.0142896144416627,-0.549971204545616,0.038330657787851,-0.553266851442175,-0.0240410433461883,0.00329564689655948,0.0242658825028085
0.56,0.0144391891910606,-0.559064744694025,0.0395995219076539,-0.563229335253044,-0.0251603327165933,0.00416459055901952,0.025502669604062
0.57,0.0145693369328545,-0.568156577806545,0.0409149587249487,-0.573184234684532,-0.0263456217920942,0.00502765687798723,0.0268210574231301
0.58,0.0146906833628537,-0.577249044354464,0.0422805000298164,-0.583130842626781,-0.0275898166669628,0.00588179827231694,0.0282098127365789
0.59,0.0148170073015276,-0.586344403700091,0.0437000908750734,-0.593068337802392,-0.0288830835735458,0.00672393410230099,0.0296554178275828
0.6,0.0149653509077073,-0.595444582680985,0.0451781558830488,-0.602995760895891,-0.0302128049753415,0.00755117821490636,0.031142155945138
0.61,0.0151560649469683,-0.604550882101697,0.0467196792182583,-0.612911984473209,-0.03156361427129,0.00836110237151189,0.0326522553391597
0.62,0.0154127829432055,-0.613663644503487,0.048330301694046,-0.622815674735311,-0.0329175187508404,0.0091520302318242,0.0341661045200672
0.63,0.0157623189471906,-0.6227818879289,0.0500164395319958,-0.632705242419025,-0.0342541205848052,0.00992335449012505,0.0356625537696764
0.64,0.0162344846703109,-0.631902911718941,0.0517854307141441,-0.642578779107607,-0.0355509460438332,0.0106758673886661,0.0371193198902125
0.65,0.016861822847861,-0.641021881649737,0.0536457168081161,-0.652433973682573,-0.0367838939602552,0.0114120920328363,0.0385135132056947
0.66,0.0176792549068182,-0.650131402906853,0.0556070708181636,-0.66226800138264,-0.0379278159113453,0.012136598475787,0.0398223083505637
0.67,0.0187236423106222,-0.65922109048275,0.0576808853305573,-0.672077374527756,-0.0389572430199352,0.0128562840450059,0.041023783628039
0.68,0.0200332623307148,-0.66827714754006,0.0598805404295568,-0.681857738749829,-0.039847278098842,0.0135805912097685,0.042097957545388
0.69,0.0216472004441262,-0.677281963084297,0.0622218782099616,-0.691603590436357,-0.0405746777658354,0.0143216273520603,0.0430280546366282
0.7,0.0236046630708298,-0.686213740908194,0.0647238211287069,-0.701307878149789,-0.041119158057877,0.0150941372415955,0.0438020334968229
0.71,0.0259442159365804,-0.695046172179881,0.0674091861883252,-0.710961429752627,-0.0414649702517448,0.0159152575727458,0.044414402861965
0.72,0.028702954969116,-0.703748164222535,0.07030576761479,-0.72055211202663,-0.041602812645674,0.0168039478040942,0.0448683260422514
0.73,0.0319156183005799,-0.712283637947708,0.0734477887920574,-0.730063570197909,-0.0415321704914775,0.0177799322502014,0.0451779501145736
0.74,0.0356136496494352,-0.720611406032258,0.0768778595818081,-0.739473291623527,-0.0412642099323729,0.0188618855912687,0.0453707587483508
0.75,0.0398242250836342,-0.728685143243437,0.0806496106589719,-0.748749555134239,-0.0408253855753377,0.0200644118908017,0.0454894793540081
0.76,0.0445692569159931,-0.736453459292102,0.0848311817666752,-0.757846499584413,-0.0402619248506821,0.0213930402923106,0.0455925955132014
0.77,0.0498643902452483,-0.743860083204204,0.0895096139551694,-0.766695958954372,-0.0396452237099211,0.0228358757501684,0.0457517320359221
0.78,0.0557180094247565,-0.750844166419329,0.0947956251017789,-0.775193709885754,-0.0390776156770223,0.0243495434664256,0.0460430267687129
0.79,0.0621302735078881,-0.757340709626181,0.100826344654387,-0.783176336033023,-0.0386960711464985,0.0258356264068426,0.0465281153068638
0.8,0.0690922014774691,-0.76328111570224,0.107758123695572,-0.790384157368068,-0.0386659222181032,0.0271030416658284,0.0472189412049448
0.81,0.0765848298087995,-0.768593868012353,0.115728831808052,-0.796411887499274,-0.0391440019992527,0.0278180194869211,0.0480218190064914
0.82,0.0845784666344285,-0.773205329712514,0.124753364347895,-0.800681898041448,-0.0401748977134666,0.0274765683289332,0.048672211922431
0.83,0.0930320684666463,-0.777040655574499,0.134551189189479,-0.802551252891788,-0.0415191207228328,0.0255105973172891,0.0487301545357907
0.84,0.101892767083176,-0.780024803168131,0.144482816519771,-0.801646514581877,-0.042590049436595,0.0216217114137457,0.0477641153531698
0.85,0.111095575785459,-0.78208362498473,0.153832931634517,-0.798156764508189,-0.0427373558490579,0.0160731395234589,0.0456599101960306
0.86,0.120563305789851,-0.783145017231487,0.162185896495699,-0.792676661187395,-0.0416225907058483,0.00953164395590833,0.0427000268567688
0.87,0.130206725002604,-0.783140094546073,0.169472517572046,-0.785830824278376,-0.0392657925694415,0.00269072973230267,0.039357877135317
0.88,0.139924992852358,-0.782004352747564,0.175803645912277,-0.778086077970388,-0.0358786530599187,-0.00391827477717588,0.0360919744905078
0.89,0.149606406201602,-0.779678773927588,0.181335989939179,-0.769747779534814,-0.0317295837375771,-0.00993099439277334,0.0332474229646331
0.9,0.159129492623852,-0.776110819668399,0.186215255205397,-0.761008330450674,-0.0270857625815452,-0.0151024892177254,0.0310116706288995
0.91,0.16836448850875,-0.771255248926132,0.190561443652762,-0.751989611391723,-0.0221969551440113,-0.0192656375344094,0.0293916588043699
0.92,0.177175240535521,-0.765074687111779,0.194469444383256,-0.742770578856057,-0.0172942038477355,-0.0223041082557218,0.0282234429474858
0.93,0.185421570028912,-0.757539862113203,0.198013537571167,-0.733403822467067,-0.0125919675422551,-0.024136039646136,0.0272232631472616
0.94,0.192962140573493,-0.748629411402703,0.201252037335336,-0.723925369434398,-0.00828989676184258,-0.0247040419683054,0.0260578601940721
0.95,0.199657870004593,-0.738329151940101,0.204231108769031,-0.714360563545544,-0.00457323876443747,-0.023968588394557,0.0244009783087532
0.96,0.205375928509944,-0.726630691284937,0.206987686008889,-0.704727669973428,-0.00161175749894543,-0.0219030213115095,0.0219622427089731
0.97,0.209994365057779,-0.713529244146955,0.209551647876852,-0.695040142555953,0.00044271718092731,-0.018489101591002,0.0184944012107633
0.98,0.213407404707453,-0.699020503505519,0.21194743098592,-0.685308086770364,0.00145997372153256,-0.0137124167351541,0.013789920086284
0.99,0.215531459550125,-0.683096399389832,0.214195229778158,-0.675539227092369,0.00133622977196748,-0.00755717229746244,0.00767439659758512
1,0.216311896062463,-0.665739561406608,0.216311896062463,-0.665739561406607,-5.55111512312578e-17,-1.11022302462516e-16,1.24126707662364e-16
