xi,s1,s2
0,0,0
0.01,-0.00495960737247926,-0.00874019006883832
0.02,-0.0100561187604896,-0.0173997033004569
0.03,-0.0152959281356868,-0.0259717038171264
0.04,-0.020685735852299,-0.0344486260256384
0.05,-0.0262325429023,-0.0428220885677514
0.06,-0.031943637381101,-0.0510827988282474
0.07,-0.0378265707425219,-0.059220447605965
0.08,-0.0438891208487417,-0.0672235938676423
0.09,-0.0501392381587182,-0.0750795399963642
0.1,-0.056584970658552,-0.0827741986800096
0.11,-0.0632343623500987,-0.0902919536390857
0.12,-0.0700953193408969,-0.0976155178595768
0.13,-0.077175436925448,-0.104725794973421
0.14,-0.0844817806845714,-0.111601752007835
0.15,-0.092020614808199,-0.118220314961203
0.16,-0.0997970719182563,-0.12455630253481
0.17,-0.107814761083345,-0.130582417687471
0.18,-0.116075314999186,-0.136269321080413
0.19,-0.124577883971839,-0.14158581420268
0.2,-0.133318593726308,-0.146499161853042
0.21,-0.142289996082157,-0.150975582113825
0.22,-0.151480555330224,-0.154980925118161
0.23,-0.160874226741831,-0.158481548049567
0.24,-0.170450193807895,-0.161445372036882
0.25,-0.180182833311484,-0.163843077830579
0.26,-0.190041967910432,-0.165649364936245
0.27,-0.199993441861352,-0.166844169685436
0.28,-0.210000017648308,-0.167413719876311
0.29,-0.220022545102891,-0.167351304914301
0.3,-0.230021309888266,-0.166657664854641
0.31,-0.239957436367498,-0.16534094705254
0.32,-0.249794209866079,-0.163416236217585
0.33,-0.259498198118049,-0.160904719404214
0.34,-0.269040086922338,-0.157832589188615
0.35,-0.27839519094265,-0.154229808144275
0.36,-0.287543645785253,-0.150128854765759
0.37,-0.296470322911416,-0.145563550225622
0.38,-0.305164530031111,-0.140568034932994
0.39,-0.313619566407706,-0.135175931904726
0.4,-0.321832198129862,-0.129419706374372
0.41,-0.329802107251952,-0.123330210847945
0.42,-0.337531354851877,-0.116936392448612
0.43,-0.345023884495772,-0.110265133752606
0.44,-0.352285081060989,-0.10334119759674
0.45,-0.35932139103114,-0.0961872486992108
0.46,-0.366140004219111,-0.0888239288695619
0.47,-0.372748593002677,-0.0812699670182207
0.48,-0.379155103047276,-0.0735423094449363
0.49,-0.385367588627941,-0.0656562596393738
0.5,-0.391394085615179,-0.0576256199323518
0.51,-0.397242515627106,-0.0494628297900928
0.52,-0.402920615538046,-0.041179097412381
0.53,-0.408435887316534,-0.0327845226727132
0.54,-0.413795563947204,-0.0242882104224182
0.55,-0.419006587917415,-0.0156983738608757
0.56,-0.42407559939452,-0.00702242812631673
0.57,-0.429008931774934,0.00173292545254573
0.58,-0.433812612753436,0.0105616238369194
0.59,-0.438492369447753,0.0194581747991502
0.6,-0.443053636429098,0.0284175967655073
0.61,-0.447501565764412,0.0374353652699323
0.62,-0.451841038380354,0.0465073653396287
0.63,-0.456076676221534,0.0556298491780461
0.64,-0.460212854803914,0.0647993985620677
0.65,-0.464253715865147,0.0740128914236398
0.66,-0.46820317989247,0.0832674721388397
0.67,-0.47206495837003,0.0925605250977209
0.68,-0.475842565634837,0.101889651175194
0.69,-0.479539330266917,0.111252646766228
0.7,-0.483158405966916,0.120647485087634
0.71,-0.486702781895362,0.130072299483679
0.72,-0.490175292463464,0.139525368503976
0.73,-0.493578626576845,0.149005102549801
0.74,-0.49691533634202,0.158510031909425
0.75,-0.500187845251323,0.168038796024622
0.76,-0.503398455866037,0.177590133849487
0.77,-0.506549357020097,0.187162875179315
0.78,-0.509642630568231,0.196755932841922
0.79,-0.512680257703143,0.206368295656569
0.8,-0.515664124866439,0.215999022076882
0.81,-0.518596029277651,0.225647234443974
0.82,-0.521477684105088,0.235312113784606
0.83,-0.524310723301381,0.244992895096759
0.84,-0.527096706125585,0.254688863071624
0.85,-0.529837121372608,0.264399348206844
0.86,-0.53253339132962,0.274123723270907
0.87,-0.535186875477932,0.283861400083145
0.88,-0.537798873957739,0.293611826577676
0.89,-0.540370630811951,0.303374484123156
0.9,-0.542903337024341,0.313148885073256
0.91,-0.545398133366164,0.322934570525472
0.92,-0.54785611306445,0.33273110826831
0.93,-0.550278324304244,0.342538090898948
0.94,-0.55266577257622,0.352355134095389
0.95,-0.555019422880266,0.362181875028776
0.96,-0.557340201794881,0.372017970902984
0.97,-0.559628999421527,0.381863097609944
0.98,-0.56188667121241,0.391716948490302
0.99,-0.564114039689553,0.401579233190057
1,-0.566311896062463,0.411449676604731
