xi,s1,s2
0,-1.63149531081482e-24,4.5375113852456e-25
0.01,-0.0377162972446743,-0.0137465569426466
0.02,-0.066430477666319,-0.0220768263278626
0.03,-0.0897063181661186,-0.0271691903757698
0.04,-0.109574038570838,-0.030262423600429
0.05,-0.127175662544698,-0.0320509745678068
0.06,-0.143157773875951,-0.032925875746167
0.07,-0.157899579731584,-0.0331148638379299
0.08,-0.171638597150628,-0.0327597254285132
0.09,-0.184536275662248,-0.0319567117607508
0.1,-0.196710759881623,-0.0307766685431775
0.11,-0.208253083666821,-0.0292748785267949
0.12,-0.219235674325831,-0.0274960927378814
0.13,-0.229717433856912,-0.0254774073340073
0.14,-0.239747156710955,-0.0232501036633631
0.15,-0.249365944214041,-0.0208408868973048
0.16,-0.25860892214248,-0.0182727314938093
0.17,-0.267506467593004,-0.0155654707984936
0.18,-0.276085098130494,-0.0127362280353218
0.19,-0.284368134148681,-0.00979975465845595
0.2,-0.2923762117979,-0.00676871768493225
0.21,-0.300127697779441,-0.00365395939675629
0.22,-0.307639037850769,-0.000464739889105342
0.23,-0.314925057102082,0.00279103545288134
0.24,-0.321999221024904,0.00610660614426029
0.25,-0.328873861169791,0.00947616881623946
0.26,-0.335560366855342,0.012894715466893
0.27,-0.342069344017013,0.0163579000937544
0.28,-0.348410742957152,0.0198619338712898
0.29,-0.354593957683759,0.023403507009432
0.3,-0.360627900259846,0.026979733922425
0.31,-0.366521054032073,0.0305881173958231
0.32,-0.372281509791582,0.034226526999125
0.33,-0.37791698887954,0.0378931869761462
0.34,-0.383434857023056,0.0415866691785531
0.35,-0.388842132311824,0.0453058872136898
0.36,-0.394145490240405,0.0490500887796399
0.37,-0.399351268183448,0.0528188440820664
0.38,-0.404465471079648,0.0566120291924839
0.39,-0.409493779512871,0.0604298041399229
0.4,-0.414441560833756,0.0642725863514348
0.41,-0.419313883497737,0.0681410207007778
0.42,-0.42411553442908,0.0720359478448776
0.43,-0.428851038957756,0.0759583727252389
0.44,-0.433524682706679,0.0799094351140967
0.45,-0.438140534718989,0.083890383925687
0.46,-0.442702471096013,0.087902556724809
0.47,-0.447214198453941,0.0919473654810678
0.48,-0.45167927658873,0.0960262891710557
0.49,-0.456101139851744,0.100140873355461
0.5,-0.460483116870854,0.104292736386932
0.51,-0.464828448390616,0.108483581470669
0.52,-0.469140303138369,0.112715213436388
0.53,-0.47342179173845,0.116989558819988
0.54,-0.477675978784247,0.121308687721467
0.55,-0.481905893234313,0.12567483590793
0.56,-0.486114537327453,0.130090425752544
0.57,-0.49030489421817,0.134558084820535
0.58,-0.494479934523918,0.139080661209791
0.59,-0.498642621955172,0.143661235104209
0.6,-0.502795918174045,0.148303126380397
0.61,-0.506942787003092,0.153009898500715
0.62,-0.511086198088648,0.157785359305728
0.63,-0.515229130118579,0.162633559664848
0.64,-0.519374573708364,0.167558791233136
0.65,-0.523525534107805,0.172565584772989
0.66,-0.527685033948451,0.177658710612382
0.67,-0.531856116350434,0.182843182820975
0.68,-0.536041848831823,0.188124268609117
0.69,-0.540245328605524,0.193507504323788
0.7,-0.544469689998644,0.19899871926365
0.71,-0.548718114878023,0.204604068396631
0.72,-0.552993847103793,0.210330074971792
0.73,-0.55730021215123,0.216183684006693
0.74,-0.561640643130356,0.222172327735984
0.75,-0.566018714483536,0.228304004360546
0.76,-0.570438184644273,0.234587371873155
0.77,-0.574903048886424,0.241031859390507
0.78,-0.5794176034778,0.247647799332332
0.79,-0.583986522117718,0.254446585051592
0.8,-0.588614945660907,0.261440860389529
0.81,-0.593308586620378,0.2686447505192
0.82,-0.598073851256123,0.2760741478196
0.83,-0.602917984556665,0.283747072864205
0.84,-0.607849247468112,0.291684139387227
0.85,-0.612877141682276,0.299909163782793
0.86,-0.618012705523471,0.308449974771184
0.87,-0.623268915334369,0.317339497806833
0.88,-0.628661240616669,0.326617212079623
0.89,-0.634208418398736,0.336331106061548
0.9,-0.639933533968213,0.346540292942841
0.91,-0.645865536434407,0.357318531186476
0.92,-0.652041465620168,0.368759266025781
0.93,-0.658510129531506,0.380984034995367
0.94,-0.665339028956645,0.394158931496203
0.95,-0.672628271568874,0.408529100660574
0.96,-0.680538346935575,0.424489759091164
0.97,-0.689343240760258,0.442724792102909
0.98,-0.699526746196242,0.464461396598744
0.99,-0.711948276860741,0.491912312363207
1,-0.728115294937453,0.529006727063226
