xi,sx,sy,cx,cy,ex,ey,ne
0,-6.86709468561953e-28,8.53748277743412e-28,0,0,-6.86709468561953e-28,8.53748277743412e-28,1.09565323709762e-27
0.01,-0.000293464096789842,-0.0178137556851477,0.000536824023105674,-0.0101209216792793,-0.000830288119895516,-0.00769283400586842,0.00773751080153593
0.02,-0.000576005183519063,-0.034805666011332,0.00107974512383416,-0.0202399779195378,-0.00165575030735323,-0.0145656880917942,0.0146594944888197
0.03,-0.000847623260187665,-0.0509757309785527,0.00162890509833547,-0.0303571572911739,-0.00247652835852313,-0.0206185736873787,0.0207667708999843
0.04,-0.00110831832679565,-0.0663239505868099,0.00218445073993676,-0.040472447823156,-0.00329276906673241,-0.0258515027636539,0.0260603630685766
0.05,-0.00135809038334301,-0.0808503248361035,0.00274653407637916,-0.0505858369706006,-0.00410462445972217,-0.0302644878655029,0.0305415645918235
0.06,-0.00159693942982975,-0.0945548537264337,0.00331531262127928,-0.0606973115799997,-0.00491225205110903,-0.033857542146434,0.034212035607534
0.07,-0.00182486546625587,-0.1074375372578,0.00389094964084932,-0.0708068578518868,-0.00571581510710519,-0.0366306794059136,0.0370739425483375
0.08,-0.00204186849262137,-0.119498375430203,0.00447361443699885,-0.0809144613007263,-0.00651548292962023,-0.0385839141294771,0.0391301667177261
0.09,-0.00224794850892626,-0.130737368243643,0.00506348264803839,-0.0910201067117762,-0.00731143115696465,-0.0397172615318669,0.0403846244151626
0.1,-0.00244310551517052,-0.141154515698119,0.0056607365683119,-0.10112377809466,-0.00810384208348242,-0.0400307376034594,0.0408427742641344
0.11,-0.00262733951135416,-0.150749817793632,0.00626556548820442,-0.111225458633346,-0.00889290499955858,-0.0395243591602859,0.0405124514978106
0.12,-0.00280582452144928,-0.159847531280385,0.00687816605609968,-0.121325130632212,-0.00968399057754896,-0.0385224006481726,0.0397209645553124
0.13,-0.00298640242553861,-0.168939107795407,0.0074987426640074,-0.13142277545783,-0.010485145089546,-0.0375163323375767,0.0389539915748352
0.14,-0.00316915406774669,-0.178029613850419,0.00812750785873884,-0.141518373476064,-0.0112966619264855,-0.0365112403743555,0.0382189121294063
0.15,-0.00335407944807353,-0.187119049445423,0.00876468278068418,-0.15161190398405,-0.0121187622287577,-0.0355071454613729,0.0375182858986422
0.16,-0.00354117856651913,-0.196207414580417,0.00941049763244112,-0.161703345136551,-0.0129516761989602,-0.0345040694438654,0.0368548059898543
0.17,-0.00373045142308349,-0.205294709255401,0.0100651921797598,-0.171792673866149,-0.0137956436028433,-0.0335020353892524,0.0362312869994897
0.18,-0.00392189801776661,-0.214380933470377,0.0107290162875096,-0.18187986579665,-0.0146509143052762,-0.0325010676737264,0.0356506478189765
0.19,-0.0041155183505685,-0.223466087225343,0.0114022304936407,-0.191964895149042,-0.0155177488442092,-0.0315011920763002,0.0351158885893539
0.2,-0.00431131242148914,-0.232550170520299,0.0120851066244115,-0.202047734639225,-0.0163964190459007,-0.0305024358810747,0.0346300613948034
0.21,-0.00450928023052855,-0.241633183355247,0.0127779284544844,-0.212128355366673,-0.017287208685013,-0.0295048279885739,0.0341962345698254
0.22,-0.00470942177768671,-0.250715125730185,0.0134809924158661,-0.222206726693087,-0.0181904141935528,-0.0285083990370975,0.0338174508825161
0.23,-0.00491244935933813,-0.259795867842125,0.0141946083600814,-0.232282816109953,-0.0191070577194196,-0.027513051732172,0.0334969800177628
0.24,-0.00511994747149954,-0.268875120945645,0.0149191003784395,-0.242356589093819,-0.020039047849939,-0.026518531851826,0.0332384712390395
0.25,-0.00533197426081374,-0.277952874444582,0.0156548076857703,-0.252428008947942,-0.0209867819465841,-0.0255248654966393,0.033044875171424
0.26,-0.00554852972728074,-0.287029128338935,0.016402085573603,-0.262497036628787,-0.0219506153008837,-0.0245320917101488,0.0329188857004994
0.27,-0.00576961387090054,-0.296103882628706,0.0171613064394163,-0.272563630555649,-0.0229309203103169,-0.0235402520730568,0.0328629057440324
0.28,-0.00599522669167314,-0.305177137313894,0.0179328608993437,-0.282627746401482,-0.0239280875910169,-0.0225493909124124,0.0328789964306115
0.29,-0.00622536818959854,-0.314248892394499,0.0187171589925596,-0.292689336862698,-0.0249425271821582,-0.0215595555318009,0.0329688352381686
0.3,-0.00646003836467673,-0.323319147870521,0.0195146314865335,-0.302748351405478,-0.0259746698512102,-0.0205707964650425,0.0331336858964646
0.31,-0.00669923721690773,-0.33238790374196,0.0203257312934261,-0.312804735985715,-0.0270249685103339,-0.0195831677562454,0.0333743821269216
0.32,-0.00694296474629152,-0.341455160008816,0.0211509350091406,-0.322858432739358,-0.0280938997554321,-0.0185967272694579,0.0336913263111275
0.33,-0.00719122095282812,-0.350520916671089,0.0219907445879497,-0.332909379639462,-0.0291819655407778,-0.0176115370316273,0.0340845030686898
0.34,-0.00744314312341895,-0.359585299343699,0.0228456891672327,-0.342957510115666,-0.0302888322906516,-0.0166277892280324,0.0345528108283985
0.35,-0.00769592744049372,-0.368648716275133,0.0237163270586968,-0.353002752631253,-0.0314122544991905,-0.0156459636438803,0.0350931034687378
0.36,-0.00794935822577777,-0.377711198869122,0.0246032479245732,-0.363045030212152,-0.032552606150351,-0.0146661686569706,0.0357039027314182
0.37,-0.00820343547927111,-0.386772747125666,0.0255070751597047,-0.373084259921426,-0.0337105106389758,-0.0136884872042397,0.0363836942802835
0.38,-0.00845815920097375,-0.395833361044765,0.0264284685032457,-0.383120352271744,-0.0348866277042194,-0.0127130087730207,0.0371308144892583
0.39,-0.00871352939088567,-0.404893040626418,0.0273681269069266,-0.39315321056714,-0.0360816562978123,-0.0117398300592776,0.0379435044640604
0.4,-0.00896954604900688,-0.413951785870626,0.0283267916905814,-0.403182730163976,-0.0372963377395883,-0.0107690557066502,0.0388199609685323
0.41,-0.00922620917533738,-0.423009596777389,0.0293052500199858,-0.413208797639295,-0.0385314591953232,-0.00980079913809379,0.0397583829080877
0.42,-0.00948351876987717,-0.432066473346706,0.0303043387471191,-0.4232312898528,-0.0397878575169963,-0.00883518349390644,0.0407570125642667
0.43,-0.00974147483262625,-0.441122415578579,0.0313249486588706,-0.433250072886261,-0.0410664234914968,-0.00787234269231746,0.0418141712562648
0.44,-0.0100000773635846,-0.450177423473006,0.0323680291871394,-0.443265000841321,-0.0423681065507241,-0.00691242263168507,0.042928289499263
0.45,-0.0102659669094174,-0.459230981085974,0.0334345936414042,-0.453275914473192,-0.0437005605508216,-0.00595506661278278,0.0441044420758126
0.46,-0.0105712837159841,-0.468280591248462,0.0345257250344166,-0.4632826396336,-0.0450970087504007,-0.00499795161486172,0.0453731166945606
0.47,-0.0109202777331504,-0.4773259237563,0.0356425825829993,-0.473284985491258,-0.0465628603161497,-0.00404093826504209,0.0467378769616587
0.48,-0.0113129489609162,-0.486366978609488,0.0367864089793511,-0.48328274249201,-0.0480993579402672,-0.00308423611747827,0.0481981404900055
0.49,-0.0117492973992815,-0.495403755808028,0.0379585385442397,-0.493275680013287,-0.0497078359435212,-0.00212807579474095,0.0497533683359849
0.5,-0.0122293230482464,-0.504436255351917,0.039160406392548,-0.503263543658247,-0.0513897294407945,-0.00117271169367039,0.0514031083176351
0.51,-0.0127530259078109,-0.513464477241157,0.0403935587645081,-0.51324605212362,-0.053146584672319,-0.00021842511753789,0.0531470335189458
0.52,-0.013320405977975,-0.522488421475748,0.0416596647034853,-0.523222893561115,-0.0549800706814603,0.000734472085367033,0.0549849763242884
0.53,-0.0139314632587386,-0.531508088055689,0.0429605292944304,-0.533193721334674,-0.056891992553169,0.00168563327898485,0.0569169585995339
0.54,-0.0145861977501018,-0.540523476980981,0.0442981087174585,-0.543158149053776,-0.0588843064675603,0.00263467207279533,0.0589432188219877
0.55,-0.0152846094520645,-0.549534588251623,0.0456745274201734,-0.553115744735229,-0.0609591368722379,0.00358115648360569,0.0610642370784103
0.56,-0.0160068395722088,-0.558542459180769,0.0470920977725091,-0.563066023910657,-0.0630989373447179,0.00452356472988846,0.0632608767873014
0.57,-0.0166027059928733,-0.567554934449136,0.0485533426418224,-0.573008441452017,-0.0651560486346956,0.0054535070028805,0.0653838773117447
0.58,-0.0170411793509048,-0.576573634858528,0.0500610214173288,-0.582942381829841,-0.0671022007682337,0.00636874697131351,0.0674037557256638
0.59,-0.0173222596463035,-0.585598560408943,0.0516181601263841,-0.592867147444517,-0.0689404197726876,0.00726858703557431,0.0693225348348436
0.6,-0.0174459468790693,-0.594629711100382,0.0532280864265962,-0.602781944574053,-0.0706740333056654,0.00815223347367178,0.0711426587519722
0.61,-0.0174122410492021,-0.603667086932844,0.0548944704351725,-0.612685866354902,-0.0723067114843745,0.00901877942205787,0.0728669946405663
0.62,-0.017221142156702,-0.612710687906329,0.0566213725805616,-0.622577872044712,-0.0738425147372635,0.00986718413838239,0.0744988476793012
0.63,-0.016872650201569,-0.621760514020839,0.0584132999448697,-0.632456761592588,-0.0752859501464386,0.0106962475717494,0.0760419884114572
0.64,-0.016366765183803,-0.630816565276372,0.060275272926619,-0.642321144242319,-0.076642038110422,0.0115045789659474,0.0775006925317645
0.65,-0.0157034871034041,-0.639878841672928,0.0622129045158411,-0.652169399487146,-0.0779163916192452,0.0122905578142174,0.0788797939547779
0.66,-0.0148828159603724,-0.648947343210509,0.0642324950687049,-0.661999628137481,-0.0791153110290773,0.0130522849269721,0.0801847527965417
0.67,-0.0138905980050678,-0.658013718712127,0.0663411462385665,-0.671809590492367,-0.0802317442436344,0.0137958717802408,0.0814092062518288
0.68,-0.0125428344921728,-0.666969402876964,0.0685468987196805,-0.681596627528059,-0.0810897332118533,0.0146272246510942,0.082398425551482
0.69,-0.010782910423128,-0.675780990997078,0.0708588997612774,-0.69135755949383,-0.0816418101844054,0.0155765684967522,0.0831144671902581
0.7,-0.00861082579793331,-0.684448483072468,0.0732876081069662,-0.701088554125917,-0.0818984339048996,0.0166400710534486,0.0835717981183785
0.71,-0.00602658061658884,-0.692971879103135,0.075845046225048,-0.710784953534422,-0.0818716268416368,0.0178130744312878,0.0837870449555946
0.72,-0.00303017487909457,-0.701351179089077,0.0785451125586017,-0.720441044188952,-0.0815752874376963,0.0190898650998751,0.0837791768285784
0.73,0.000378391414549522,-0.709586383030296,0.0814039701851075,-0.730049747550365,-0.081025578770558,0.0204633645200692,0.0835696936848827
0.74,0.00419911826434342,-0.71767749092679,0.0844405328344007,-0.739602198541764,-0.0802414145700573,0.0219247076149734,0.0831827951935127
0.75,0.00843200567028713,-0.725624502778561,0.0876770745956903,-0.74908716326706,-0.0792450689254032,0.0234626604884989,0.0826454922315214
0.76,0.0130770536323806,-0.733427418585608,0.0911399952798494,-0.758490223043434,-0.0780629416474688,0.0250628044578259,0.0819876028796264
0.77,0.018134262150624,-0.741086238347932,0.0948607774829708,-0.767792613931212,-0.0767265153323468,0.0267063755832802,0.0812415451098763
0.78,0.023601672120939,-0.748592067815324,0.098877169159227,-0.77696955172379,-0.075275497038288,0.0283774839084656,0.0804467653006417
0.79,0.0294258979571961,-0.755702538669652,0.103234605359854,-0.785987780197403,-0.0738087074026578,0.0302852415277508,0.0797804558951962
0.8,0.0355829406344381,-0.762308696345882,0.107987817669824,-0.794801940178714,-0.0724048770353855,0.0324932438328318,0.0793616854236927
0.81,0.042072800152665,-0.768410540844014,0.113202408734878,-0.803349156464844,-0.0711296085822132,0.0349386156208297,0.079247259123322
0.82,0.0488954765118766,-0.774008072164049,0.118955760608299,-0.811540998350126,-0.0700602840964228,0.0375329261860772,0.0794805885468961
0.83,0.0560509697120731,-0.779101290305985,0.125335740480861,-0.819251836755736,-0.0692847707687874,0.0401505464497508,0.0800777487239559
0.84,0.0635392797532545,-0.783690195269824,0.132433859351996,-0.826303155521756,-0.0688945795987413,0.0426129602519323,0.0810081939035803
0.85,0.0713604066354207,-0.787774787055565,0.140326626609839,-0.832446154880156,-0.0689662199744185,0.0446713678245906,0.0821697669515969
0.86,0.0795143503585719,-0.791355065663209,0.149036650892343,-0.837353112991279,-0.069522300533771,0.0459980473280704,0.0833616856205738
0.87,0.0880011109227078,-0.794431031092754,0.158471912407488,-0.840642810181745,-0.0704708014847807,0.0462117790889909,0.0842713616151837
0.88,0.0968206883278286,-0.797002683344202,0.16837188027405,-0.84197127510868,-0.0715511919462215,0.0449685917644778,0.0845088593829386
0.89,0.105974942400406,-0.799067254330608,0.178328179853945,-0.8411731907914,-0.0723532374535398,0.0421059364607915,0.0837132059787972
0.9,0.115644276308163,-0.800356239618466,0.187912187822691,-0.838349908204654,-0.0722679115145279,0.0379936685861878,0.0816466158962434
0.91,0.12594771894527,-0.800692481643398,0.196819680033034,-0.833813959137595,-0.0708719610877638,0.0331214774941974,0.0782295796986289
0.92,0.136885270311727,-0.800075980405404,0.20491964469547,-0.827948656690246,-0.0680343743837428,0.0278726762848422,0.0735225283914182
0.93,0.148456930407533,-0.798506735904484,0.212212102489033,-0.821099723919986,-0.0637551720814999,0.0225929880155028,0.0676399665479686
0.94,0.160662699232688,-0.795984748140638,0.218764605126429,-0.813535812443053,-0.0581019058937413,0.0175510643024152,0.0606949036298163
0.95,0.173502576787193,-0.792510017113866,0.2246672901619,-0.805451583088232,-0.0511647133747071,0.0129415659743654,0.0527760554094827
0.96,0.186976563071047,-0.788082542824169,0.230009918757653,-0.796984371137428,-0.0430333556866063,0.0089018283132587,0.0439444222736937
0.97,0.201084658084251,-0.782702325271546,0.234872779504595,-0.78823072440622,-0.0337881214203443,0.00552839913467384,0.0342374114983623
0.98,0.215826861826804,-0.776369364455998,0.239324408600145,-0.779259076285907,-0.0234975467733411,0.0028897118299096,0.0236745673418813
0.99,0.231203174298706,-0.769083660377523,0.243422139917209,-0.770118603642173,-0.0122189656185028,0.00103494326464937,0.0122627170051011
1,0.247213595499958,-0.760845213036123,0.247213595499958,-0.760845213036123,-8.32667268468867e-17,0,8.32667268468867e-17
