xi,s1,s2
0,0,0
0.01,0.00313141686162226,-0.00958146606660819
0.02,0.00632053366952974,-0.0191423390331002
0.03,0.00956940856119308,-0.0286815280502651
0.04,0.012880203837545,-0.0381978599716522
0.05,0.0162551924060746,-0.0476900717176347
0.06,0.0196967646458847,-0.0571568018086814
0.07,0.0232074357150079,-0.066596580965909
0.08,0.0267898533184655,-0.0760078216634593
0.09,0.0304468059526638,-0.0853888065018383
0.1,0.0341812316374416,-0.094737675253897
0.11,0.0379962271409779,-0.10405241041534
0.12,0.0418950576943092,-0.113330821069279
0.13,0.0458811671807211,-0.122570524849155
0.14,0.0499581887699181,-0.131768927756068
0.15,0.0541299559465451,-0.140923201555037
0.16,0.0584005138560132,-0.150030258439735
0.17,0.0627741308559484,-0.159086722616978
0.18,0.0672553101168479,-0.168088898420693
0.19,0.0718488010580677,-0.177032734521005
0.2,0.0765596103318481,-0.185913783748287
0.21,0.081393011974792,-0.194727158006309
0.22,0.0863545562282524,-0.20346747770566
0.23,0.0914500763808076,-0.212128815112416
0.24,0.0966856928007619,-0.220704630983725
0.25,0.102067813096847,-0.229187703860037
0.26,0.107603127062755,-0.237570051415613
0.27,0.113298594717309,-0.24584284335149
0.28,0.119161425339116,-0.253996305471633
0.29,0.125199044906943,-0.26201961484449
0.3,0.131419048794029,-0.269900786359306
0.31,0.137829135934362,-0.277626551590971
0.32,0.144437020004497,-0.285182231752579
0.33,0.151250312492161,-0.292551607715664
0.34,0.158276371933313,-0.299716791695348
0.35,0.165522113221844,-0.306658107308759
0.36,0.172993770923713,-0.313353987374878
0.37,0.180696611230685,-0.319780902032385
0.38,0.188634588920978,-0.325913333405605
0.39,0.196809948875954,-0.331723816873784
0.4,0.205222776770653,-0.33718307247323
0.41,0.213870510857271,-0.342260252239247
0.42,0.222747436367675,-0.346923329173793
0.43,0.231844195521811,-0.351139649516476
0.44,0.241147358185521,-0.354876660568874
0.45,0.250639108608156,-0.358102810378933
0.46,0.260297109169436,-0.360788593171139
0.47,0.270094599018863,-0.362907687437396
0.48,0.28000077088042,-0.364438106363527
0.49,0.289981442220197,-0.365363259092627
0.5,0.299999999998316,-0.365672813212615
0.51,0.310018557776436,-0.365363259092627
0.52,0.319999229116213,-0.364438106363527
0.53,0.32990540097777,-0.362907687437396
0.54,0.339702890827196,-0.360788593171139
0.55,0.349360891388477,-0.358102810378933
0.56,0.358852641811112,-0.354876660568874
0.57,0.368155804474821,-0.351139649516476
0.58,0.377252563628957,-0.346923329173793
0.59,0.386129489139361,-0.342260252239247
0.6,0.39477722322598,-0.33718307247323
0.61,0.403190051120679,-0.331723816873784
0.62,0.411365411075655,-0.325913333405605
0.63,0.419303388765948,-0.319780902032385
0.64,0.42700622907292,-0.313353987374878
0.65,0.434477886774789,-0.306658107308759
0.66,0.44172362806332,-0.299716791695348
0.67,0.448749687504472,-0.292551607715664
0.68,0.455562979992136,-0.285182231752579
0.69,0.462170864062271,-0.277626551590971
0.7,0.468580951202604,-0.269900786359306
0.71,0.47480095508969,-0.26201961484449
0.72,0.480838574657517,-0.253996305471633
0.73,0.486701405279324,-0.24584284335149
0.74,0.492396872933878,-0.237570051415613
0.75,0.497932186899786,-0.229187703860037
0.76,0.503314307195871,-0.220704630983725
0.77,0.508549923615825,-0.212128815112416
0.78,0.513645443768381,-0.20346747770566
0.79,0.518606988021841,-0.194727158006309
0.8,0.523440389664785,-0.185913783748287
0.81,0.528151198938565,-0.177032734521005
0.82,0.532744689879785,-0.168088898420693
0.83,0.537225869140684,-0.159086722616978
0.84,0.54159948614062,-0.150030258439735
0.85,0.545870044050088,-0.140923201555037
0.86,0.550041811226715,-0.131768927756068
0.87,0.554118832815912,-0.122570524849155
0.88,0.558104942302324,-0.113330821069279
0.89,0.562003772855655,-0.10405241041534
0.9,0.565818768359191,-0.094737675253897
0.91,0.569553194043969,-0.0853888065018383
0.92,0.573210146678167,-0.0760078216634593
0.93,0.576792564281625,-0.0665965809659089
0.94,0.580303235350748,-0.0571568018086812
0.95,0.583744807590558,-0.0476900717176348
0.96,0.587119796159088,-0.0381978599716521
0.97,0.59043059143544,-0.0286815280502652
0.98,0.593679466327103,-0.0191423390331002
0.99,0.596868583135011,-0.00958146606660829
1,0.599999999996633,0
