xi,s1,s2
0,2.96908534282243e-27,2.08793817258687e-27
0.01,0.00403905111487855,-0.0462089450063535
0.02,0.00747308929869307,-0.0742578582415617
0.03,0.0112471917775626,-0.0955938970893344
0.04,0.0156876619391971,-0.113366870781282
0.05,0.0209851571520988,-0.128632979381167
0.06,0.0272758994507277,-0.141826199044246
0.07,0.034618114399048,-0.153085944784377
0.08,0.0429640808279748,-0.162404200145579
0.09,0.0521537646851382,-0.169723750747212
0.1,0.0619335578774243,-0.175003436233762
0.11,0.0719933799521459,-0.178257431275063
0.12,0.0820107335232608,-0.179572648340157
0.13,0.0916907369801275,-0.179107818301509
0.14,0.100795057309167,-0.177078798286265
0.15,0.109157142070223,-0.173735684966734
0.16,0.116684570244826,-0.169337531350439
0.17,0.123351438266397,-0.164129738601961
0.18,0.129184510896194,-0.15832758356093
0.19,0.134246699503812,-0.152107251247849
0.2,0.138620818755385,-0.145603884648819
0.21,0.142395819506306,-0.138914945283616
0.22,0.145656851599235,-0.13210666311403
0.23,0.14847959532619,-0.125221509590284
0.24,0.150928425190804,-0.118285235936183
0.25,0.153057330194314,-0.111312695777278
0.26,0.154912221826626,-0.104312199790047
0.27,0.156533331736824,-0.0972884944930281
0.28,0.157956811407476,-0.0902446235711954
0.29,0.159215245616737,-0.0831829616710521
0.3,0.160337313721498,-0.076105684341522
0.31,0.161347127386367,-0.0690148971755331
0.32,0.162263815977247,-0.0619125994543383
0.33,0.163101737113008,-0.0548006038713955
0.34,0.163871359691792,-0.0476804797308705
0.35,0.164580576866325,-0.0405535421406482
0.36,0.165236056803817,-0.0334208796664221
0.37,0.165844245793367,-0.0262833985662906
0.38,0.166411791117555,-0.0191418622779533
0.39,0.166945384803594,-0.0119969152229226
0.4,0.16745122835183,-0.00484909126669382
0.41,0.167934417523441,0.00230118572962421
0.42,0.168398534712953,0.00945359973924987
0.43,0.168845621703763,0.0166079318868393
0.44,0.169276534459644,0.0237640398435641
0.45,0.169691536805576,0.0309218309159371
0.46,0.170090918150858,0.0380812351374876
0.47,0.170475429352271,0.0452421847303167
0.48,0.170846415005263,0.0524046038935198
0.49,0.17120564566458,0.059568409072933
0.5,0.171554959152742,0.0667335165754832
0.51,0.171895871992736,0.0738998526871099
0.52,0.172229314578428,0.0810673615097091
0.53,0.172555580959606,0.0882360074362317
0.54,0.172874491328335,0.0954057718107382
0.55,0.17318568716466,0.102576645591678
0.56,0.173488940792717,0.109748621028717
0.57,0.173784366888002,0.116921685359161
0.58,0.174072470290087,0.124095818407068
0.59,0.174354033488191,0.131270994220359
0.6,0.174629905037151,0.138447185382935
0.61,0.17490077810411,0.14562436788374
0.62,0.175167043306175,0.152802524496016
0.63,0.175428764228992,0.159981645554746
0.64,0.175685771768049,0.167161728026833
0.65,0.175937829938216,0.174342777215424
0.66,0.176184805305196,0.181524820535056
0.67,0.176426777001192,0.188707949553327
0.68,0.176664052629035,0.195892414360026
0.69,0.176897096069961,0.203078799921287
0.7,0.177126406527239,0.210268311430568
0.71,0.177352402896732,0.217463181405417
0.72,0.177575361960744,0.224667184898222
0.73,0.177795434434418,0.231886212355249
0.74,0.17801272888323,0.239128812542711
0.75,0.178227426490082,0.246406598566667
0.76,0.178439878910066,0.253734418516603
0.77,0.178650648505935,0.261130230252967
0.78,0.178860473742431,0.26861468473191
0.79,0.179070173866074,0.276210497932408
0.8,0.179280531043953,0.283941749450982
0.81,0.179492196313582,0.291833270073933
0.82,0.179705656639099,0.299910268557404
0.83,0.179921275521841,0.308198302081564
0.84,0.180139387997504,0.316723631894036
0.85,0.180360408438029,0.325513954723073
0.86,0.180584905385943,0.334599478120546
0.87,0.180813613106594,0.344014316783246
0.88,0.181047382691702,0.353798229037766
0.89,0.181287114249322,0.363998799205991
0.9,0.18153373448684,0.374674322226892
0.91,0.181788278698945,0.385897872852039
0.92,0.182052101075794,0.397763349666574
0.93,0.182327180236766,0.410394815716353
0.94,0.182616456039284,0.423962067555496
0.95,0.182924214097758,0.43870956641056
0.96,0.183256774247576,0.455013520617124
0.97,0.183624199412156,0.473496582417917
0.98,0.184045966011132,0.495350937820169
0.99,0.184576850675049,0.523850231717978
1,0.185410196624968,0.570633909777092
