xi,s1,s2
0,-2.68562911013438e-26,1.33084833548062e-25
0.01,-0.00977470755432556,-0.0246473354103491
0.02,-0.0161599570709583,-0.0478321646130049
0.03,-0.0195706646440889,-0.0694650200945534
0.04,-0.0203908314759149,-0.0894799548646643
0.05,-0.0189747747062831,-0.107832916881791
0.06,-0.015648358242332,-0.12450012347887
0.07,-0.0107102235881352,-0.139476435789022
0.08,-0.00443302067434366,-0.152773733171248
0.09,0.00293536131217172,-0.164419287636134
0.1,0.0111705630986771,-0.174454138271549
0.11,0.0200705244969331,-0.182931465668341
0.12,0.0294542535735521,-0.189914966346043
0.13,0.0391605958203556,-0.19547722717857
0.14,0.0490470033247314,-0.199698099819916
0.15,0.0589883039399909,-0.202663075129858
0.16,0.0688754704557268,-0.204461657599654
0.17,0.0786143897681695,-0.205185739777744
0.18,0.0881246320505453,-0.204927976695447
0.19,0.0973382199234334,-0.203780160292664
0.2,0.106198397625123,-0.201831593843574
0.21,0.114658405960212,-0.199167481483416
0.22,0.122680407482477,-0.19586771036325
0.23,0.13023479304167,-0.19200662947578
0.24,0.137299638564578,-0.187653221109167
0.25,0.143860167614335,-0.182871287401911
0.26,0.149908213949726,-0.177719636897742
0.27,0.155441684084494,-0.172252271100508
0.28,0.160464019846649,-0.166518571029058
0.29,0.164983660937769,-0.160563483772135
0.3,0.169013507492316,-0.15442770904326
0.31,0.172570382636932,-0.148147885735617
0.32,0.175674495049755,-0.141756778476947
0.33,0.17834890151972,-0.13528346418443
0.34,0.180618969505868,-0.128753518619573
0.35,0.182511839696653,-0.1221892029431
0.36,0.184055888569246,-0.115609650269835
0.37,0.185280190948845,-0.109031052223593
0.38,0.186213982567982,-0.102466845492068
0.39,0.186886122625826,-0.0959278983817158
0.4,0.187324556347493,-0.0894226973726451
0.41,0.187555782716037,-0.0829575332767852
0.42,0.187604456694279,-0.0765366770813728
0.43,0.187493332843901,-0.0701625296090155
0.44,0.187243343434385,-0.0638357608630731
0.45,0.186873681724625,-0.0575554489763209
0.46,0.186401885244548,-0.0513192191596126
0.47,0.185843919076734,-0.0451233826505429
0.48,0.185214259138032,-0.0389630756621108
0.49,0.18452597546118,-0.0328323983313825
0.5,0.183790815476421,-0.0267245536681544
0.51,0.183019287293125,-0.0206319865036158
0.52,0.182220742981404,-0.014546522439012
0.53,0.181403461853733,-0.00845950679430747
0.54,0.180574733746568,-0.00236194355684854
0.55,0.179740942301961,0.00375536566997359
0.56,0.178907648249183,0.00990168271805983
0.57,0.178079672686342,0.0160861939059402
0.58,0.177261180361997,0.0223178710901113
0.59,0.17645576295678,0.0286053327163725
0.6,0.175666522365015,0.0349567048711638
0.61,0.174896153270239,0.0413794844460941
0.62,0.174147007362205,0.0478804572454487
0.63,0.173421110951509,0.0544657555643367
0.64,0.172720164225695,0.0611409707098174
0.65,0.172045539799265,0.0679112676352178
0.66,0.171398281263687,0.0747814995744506
0.67,0.170779101737409,0.0817563226763322
0.68,0.170188382415867,0.0888403106389
0.69,0.169626171121495,0.0960380693437308
0.7,0.169092180853737,0.103354351490258
0.71,0.168585788339053,0.110794171230091
0.72,0.168106032580934,0.118362918801331
0.73,0.167651613409908,0.126066475162889
0.74,0.167220890033554,0.133911326628804
0.75,0.166811879586508,0.141904679502564
0.76,0.166422255680478,0.150054574711417
0.77,0.166049346954249,0.158370002440696
0.78,0.165690135623695,0.166861016768131
0.79,0.165341256031792,0.175538850298172
0.8,0.164998993198624,0.184416028796301
0.81,0.164659282571769,0.193506497102475
0.82,0.16431774098639,0.202826038301637
0.83,0.163969776849975,0.21239343731606
0.84,0.163610731536783,0.222231937754767
0.85,0.163236021982666,0.232370710042067
0.86,0.162841283279887,0.242846319546097
0.87,0.162422511271946,0.253704194707361
0.88,0.161976205148395,0.265000095167268
0.89,0.161499510039664,0.27680157989667
0.9,0.160990359611877,0.289189475324404
0.91,0.160447618661676,0.302259343465831
0.92,0.159871225711041,0.31612295005137
0.93,0.159262335602111,0.330909732655043
0.94,0.158623462092002,0.346768268823012
0.95,0.157958620447635,0.363867744202119
0.96,0.157273470040546,0.382399420668421
0.97,0.156575456941719,0.402578104455734
0.98,0.155873956516396,0.424643614284171
0.99,0.155180416018904,0.448862249488678
1,0.154508497187474,0.475528258147577
