xi,s1,s2
0,-8.27940723638641e-26,2.63630598712004e-26
0.01,0.00868450292978168,-0.0371026603604534
0.02,0.015733948138922,-0.0654648719773456
0.03,0.021749347870967,-0.0883097095221899
0.04,0.0271064639205785,-0.107595184742664
0.05,0.0320370263685945,-0.124493414548992
0.06,0.0366830480668095,-0.139703317812246
0.07,0.0411320990268971,-0.153647446120439
0.08,0.0454394953107548,-0.166590915812824
0.09,0.0496417917193515,-0.178710089603689
0.1,0.0537647117244592,-0.190130419245082
0.11,0.0578276668730242,-0.200946469194211
0.12,0.0618462765079283,-0.211232358376725
0.13,0.0658337622820928,-0.221047446102509
0.14,0.0698017257858263,-0.2304398122271
0.15,0.0737605868505988,-0.239448703990102
0.16,0.0777198299286666,-0.248106405847414
0.17,0.0816881417533473,-0.256439698549928
0.18,0.0856734932323225,-0.264470992015876
0.19,0.0896832004832164,-0.272219196082296
0.2,0.0937239862050943,-0.279700381853291
0.21,0.0978020518650128,-0.28692827688324
0.22,0.101923163132935,-0.293914629451538
0.23,0.106092745324571,-0.300669470556448
0.24,0.110315982013446,-0.30720129683459
0.25,0.114597908154249,-0.313517193255028
0.26,0.118943488722656,-0.319622910998185
0.27,0.123357674725921,-0.325522913265373
0.28,0.127845430176952,-0.331220399730014
0.29,0.13241172595586,-0.336717318792092
0.3,0.137061499110534,-0.342014375588402
0.31,0.141799578775763,-0.347111042698573
0.32,0.146630582237246,-0.352005579533228
0.33,0.151558786529995,-0.35669506539721
0.34,0.156587982281547,-0.361175450158269
0.35,0.161721317322244,-0.365441625335527
0.36,0.166961137940659,-0.369487517277341
0.37,0.172308835616096,-0.373306202950523
0.38,0.177764706666108,-0.376890047737722
0.39,0.183327831559198,-0.380230863562733
0.4,0.188995979715487,-0.383320084660166
0.41,0.194765544505173,-0.386148957401732
0.42,0.200631511910197,-0.388708739812117
0.43,0.206587464992796,-0.390990905778398
0.44,0.212625624969637,-0.392987348503897
0.45,0.218736928376051,-0.394690577505778
0.46,0.22491113857457,-0.396093903429779
0.47,0.231136988760028,-0.39719160516994
0.48,0.237402352663638,-0.397979074226612
0.49,0.243694438366572,-0.398452931882426
0.5,0.25,-0.398611115587219
0.51,0.256305561633428,-0.398452931882426
0.52,0.262597647336362,-0.397979074226612
0.53,0.268863011239972,-0.39719160516994
0.54,0.27508886142543,-0.396093903429779
0.55,0.281263071623949,-0.394690577505778
0.56,0.287374375030363,-0.392987348503896
0.57,0.293412535007204,-0.390990905778398
0.58,0.299368488089803,-0.388708739812117
0.59,0.305234455494827,-0.386148957401732
0.6,0.311004020284513,-0.383320084660166
0.61,0.316672168440802,-0.380230863562733
0.62,0.322235293333892,-0.376890047737722
0.63,0.327691164383904,-0.373306202950523
0.64,0.333038862059341,-0.369487517277341
0.65,0.338278682677756,-0.365441625335527
0.66,0.343412017718453,-0.361175450158269
0.67,0.348441213470005,-0.35669506539721
0.68,0.353369417762754,-0.352005579533228
0.69,0.358200421224237,-0.347111042698573
0.7,0.362938500889466,-0.342014375588402
0.71,0.36758827404414,-0.336717318792092
0.72,0.372154569823048,-0.331220399730014
0.73,0.37664232527408,-0.325522913265373
0.74,0.381056511277344,-0.319622910998185
0.75,0.385402091845751,-0.313517193255028
0.76,0.389684017986554,-0.30720129683459
0.77,0.393907254675429,-0.300669470556448
0.78,0.398076836867065,-0.293914629451538
0.79,0.402197948134987,-0.28692827688324
0.8,0.406276013794906,-0.279700381853291
0.81,0.410316799516784,-0.272219196082296
0.82,0.414326506767678,-0.264470992015876
0.83,0.418311858246653,-0.256439698549928
0.84,0.422280170071334,-0.248106405847414
0.85,0.426239413149401,-0.239448703990102
0.86,0.430198274214174,-0.2304398122271
0.87,0.434166237717907,-0.221047446102509
0.88,0.438153723492072,-0.211232358376725
0.89,0.442172333126976,-0.200946469194211
0.9,0.446235288275541,-0.190130419245081
0.91,0.450358208280648,-0.178710089603689
0.92,0.454560504689245,-0.166590915812824
0.93,0.458867900973103,-0.153647446120439
0.94,0.463316951933191,-0.139703317812246
0.95,0.467962973631405,-0.124493414548992
0.96,0.472893536079422,-0.107595184742664
0.97,0.478250652129033,-0.08830970952219
0.98,0.484266051861078,-0.0654648719773457
0.99,0.491315497070218,-0.0371026603604535
1,0.5,7.04196423715014e-26
