xi,s1,s2
0,-2.72402191216705e-24,8.14888674525231e-25
0.01,-0.00719065364917241,-0.0134253556547902
0.02,-0.0145339189862479,-0.0263562465481815
0.03,-0.0220224715919288,-0.0387981051689543
0.04,-0.0296489870469172,-0.0507563640058893
0.05,-0.0374061409319153,-0.062236455547767
0.06,-0.0452866088276252,-0.0732438122833679
0.07,-0.0532830663147493,-0.0837838667014725
0.08,-0.0613881889739897,-0.0938620512908615
0.09,-0.0695946523860485,-0.103483798540315
0.1,-0.077895132131628,-0.112654540938615
0.11,-0.0862823037914303,-0.12137971097454
0.12,-0.0947488429461577,-0.129664741136872
0.13,-0.103287425176512,-0.13751506391439
0.14,-0.111890726063196,-0.144936111795877
0.15,-0.120551421186912,-0.151933317270111
0.16,-0.129262186128362,-0.158512112825875
0.17,-0.138015696468247,-0.164677930951947
0.18,-0.146804627787271,-0.17043620413711
0.19,-0.155621655666135,-0.175792364870142
0.2,-0.164459455685542,-0.180751845639826
0.21,-0.173310703426193,-0.185320078934941
0.22,-0.182168074468791,-0.189502497244268
0.23,-0.191024244394039,-0.193304533056587
0.24,-0.199871888782638,-0.19673161886068
0.25,-0.20870368321529,-0.199789187145326
0.26,-0.217512303272698,-0.202482670399306
0.27,-0.226290424535564,-0.204817501111401
0.28,-0.235030722584591,-0.206799111770392
0.29,-0.243725873000479,-0.208432934865058
0.3,-0.252368551363932,-0.209724402884181
0.31,-0.260951433255652,-0.21067894831654
0.32,-0.26946719425634,-0.211302003650917
0.33,-0.2779085099467,-0.211599001376092
0.34,-0.286268055907433,-0.211575373980845
0.35,-0.294538507719241,-0.211236553953958
0.36,-0.302712540962827,-0.21058797378421
0.37,-0.310782831218892,-0.209635065960383
0.38,-0.31874205406814,-0.208383262971256
0.39,-0.326582885091272,-0.20683799730561
0.4,-0.334297999868991,-0.205004701452227
0.41,-0.341880073981998,-0.202888807899885
0.42,-0.349321783010995,-0.200495749137367
0.43,-0.356615802536686,-0.197830957653452
0.44,-0.363754808139772,-0.194899865936921
0.45,-0.370731475400956,-0.191707906476555
0.46,-0.377538479900938,-0.188260511761134
0.47,-0.384168497220423,-0.184563114279438
0.48,-0.390614202940112,-0.180621146520249
0.49,-0.396868272640706,-0.176440040972347
0.5,-0.402923381902909,-0.172025230124511
0.51,-0.408773121298444,-0.167381608377056
0.52,-0.414414741363116,-0.16251191777642
0.53,-0.419846407623753,-0.157418362280576
0.54,-0.425066285607182,-0.152103145847495
0.55,-0.430072540840231,-0.146568472435149
0.56,-0.434863338849727,-0.140816546001511
0.57,-0.439436845162496,-0.134849570504551
0.58,-0.443791225305367,-0.128669749902242
0.59,-0.447924644805167,-0.122279288152555
0.6,-0.451835269188722,-0.115680389213463
0.61,-0.45552126398286,-0.108875257042937
0.62,-0.458980794714408,-0.101866095598949
0.63,-0.462212026910194,-0.0946551088394703
0.64,-0.465213126097045,-0.0872445007224737
0.65,-0.467982257801788,-0.0796364752059306
0.66,-0.47051758755125,-0.0718332362478128
0.67,-0.472817280872258,-0.0638369878060922
0.68,-0.47487950329164,-0.0556499338387407
0.69,-0.476702420336224,-0.04727427830373
0.7,-0.478284197532835,-0.0387122251590319
0.71,-0.479623000408302,-0.0299659783626183
0.72,-0.480716994489452,-0.021037741872461
0.73,-0.481564345303111,-0.011929719646532
0.74,-0.482163218376109,-0.00264411564280286
0.75,-0.48251177923527,0.00681686618075446
0.76,-0.482608193407423,0.0164510218661681
0.77,-0.482450626419395,0.0262561474554663
0.78,-0.482037243798014,0.0362300389906771
0.79,-0.481366211070106,0.0463704925138288
0.8,-0.480435693762498,0.0566753040669495
0.81,-0.479243857402019,0.0671422696920674
0.82,-0.477788867515495,0.0777691854312105
0.83,-0.476068889629754,0.0885538473264073
0.84,-0.474082089271622,0.0994940514196858
0.85,-0.471826631967927,0.110587593753074
0.86,-0.469300683245496,0.1218322703686
0.87,-0.466502408631157,0.133225877308293
0.88,-0.463429973651737,0.14476621061418
0.89,-0.460081543834063,0.156451066328289
0.9,-0.456455284704962,0.16827824049265
0.91,-0.452549361791261,0.180245529149289
0.92,-0.448361940619788,0.192350728340235
0.93,-0.44389118671737,0.204591634107516
0.94,-0.439135265610834,0.21696604249316
0.95,-0.434092342827008,0.229471749539197
0.96,-0.428760583892719,0.242106551287653
0.97,-0.423138154334794,0.254868243780556
0.98,-0.417223219680059,0.267754623059936
0.99,-0.411013945455344,0.28076348516782
1,-0.404508497187474,0.293892626146237
