xi,s1,s2
0,-1.55079903637821e-26,-4.79485116842664e-27
0.01,-0.0030432324037626,-0.0208923929300543
0.02,-0.00604724835729888,-0.0407370307649215
0.03,-0.00901134627242616,-0.0595797436277735
0.04,-0.0119348245609618,-0.0774663616417823
0.05,-0.014816981634723,-0.09444271493012
0.06,-0.0176571159055271,-0.110554633615958
0.07,-0.0204545257851916,-0.12584794782247
0.08,-0.0232085096855335,-0.140368487672826
0.09,-0.0259183660183704,-0.154162083290199
0.1,-0.0285833931955195,-0.16727456479776
0.11,-0.0312028896287981,-0.179751762318683
0.12,-0.0337761537300235,-0.191639505976138
0.13,-0.0363024839110131,-0.202983625893297
0.14,-0.0387811785835841,-0.213829952193334
0.15,-0.0412115361595539,-0.224224314999419
0.16,-0.0435928550507397,-0.234212544434725
0.17,-0.045924433668959,-0.243840470622424
0.18,-0.048205570426029,-0.253153923685687
0.19,-0.0504355637337671,-0.262198733747687
0.2,-0.0526137120039904,-0.271020730931596
0.21,-0.0547406859469608,-0.279659387366894
0.22,-0.0568226454667166,-0.288128743208299
0.23,-0.0588671227657408,-0.296436480616838
0.24,-0.0608816500465162,-0.304590281753536
0.25,-0.0628737595115257,-0.31259782877942
0.26,-0.0648509833632521,-0.320466803855516
0.27,-0.0668208538041783,-0.32820488914285
0.28,-0.0687909030367871,-0.33581976680245
0.29,-0.0707686632635614,-0.34331911899534
0.3,-0.072761666686984,-0.350710627882547
0.31,-0.0747774455095379,-0.358001975625099
0.32,-0.0768235319337058,-0.36520084438402
0.33,-0.0789074581619706,-0.372314916320337
0.34,-0.0810367563968151,-0.379351873595077
0.35,-0.0832189588407223,-0.386319398369266
0.36,-0.0854615976961749,-0.39322517280393
0.37,-0.0877722051656558,-0.400076879060095
0.38,-0.0901583134516479,-0.406882199298788
0.39,-0.092627454756634,-0.413648815681035
0.4,-0.095187161283097,-0.420384410367863
0.41,-0.0978446574285374,-0.427093781626222
0.42,-0.100605936370527,-0.43377019214677
0.43,-0.103476683481656,-0.440404020726088
0.44,-0.106462584134514,-0.446985646160757
0.45,-0.10956932370169,-0.453505447247358
0.46,-0.112802587555774,-0.459953802782474
0.47,-0.116168061069356,-0.466321091562686
0.48,-0.119671429615026,-0.472597692384575
0.49,-0.123318378565373,-0.478773984044722
0.5,-0.127114593292986,-0.48484034533971
0.51,-0.131065759170456,-0.49078715506612
0.52,-0.135177561570372,-0.496604792020533
0.53,-0.139455685865324,-0.502283634999531
0.54,-0.143905817427901,-0.507814062799695
0.55,-0.148533641630694,-0.513186454217607
0.56,-0.153344843846291,-0.518391188049849
0.57,-0.158345109447283,-0.523418643093001
0.58,-0.163540123806259,-0.528259198143646
0.59,-0.168935572295809,-0.532903231998365
0.6,-0.174537140288523,-0.53734112345374
0.61,-0.180348347393303,-0.54156243052116
0.62,-0.186364050164306,-0.545553428071252
0.63,-0.192576939392001,-0.54929957018945
0.64,-0.198979705866858,-0.55278631096119
0.65,-0.205565040379346,-0.555999104471904
0.66,-0.212325633719936,-0.558923404807029
0.67,-0.219254176679095,-0.561544666051999
0.68,-0.226343360047295,-0.563848342292248
0.69,-0.233585874615004,-0.565819887613211
0.7,-0.240974411172692,-0.567444756100323
0.71,-0.248501660510829,-0.568708401839018
0.72,-0.256160313419884,-0.569596278914732
0.73,-0.263943060690326,-0.570093841412898
0.74,-0.271842593112626,-0.570186543418951
0.75,-0.279851601477252,-0.569859839018326
0.76,-0.287962776574675,-0.569099182296457
0.77,-0.296168809195363,-0.56789002733878
0.78,-0.304462390129786,-0.566217828230728
0.79,-0.312836210168415,-0.564068039057737
0.8,-0.321282960101718,-0.561426113905241
0.81,-0.329794222362996,-0.558273735959255
0.82,-0.338357145956877,-0.554577504808119
0.83,-0.346957771530819,-0.550300249140752
0.84,-0.355582139732283,-0.545404797646074
0.85,-0.364216291208726,-0.539853979013005
0.86,-0.372846266607607,-0.533610621930465
0.87,-0.381458106576385,-0.526637555087373
0.88,-0.39003785176252,-0.518897607172649
0.89,-0.39857154281347,-0.510353606875213
0.9,-0.407045220376695,-0.500968382883985
0.91,-0.415444925099652,-0.490704763887884
0.92,-0.423756697629801,-0.479525578575831
0.93,-0.4319665786146,-0.467393655636745
0.94,-0.44006060870151,-0.454271823759546
0.95,-0.448024828537988,-0.440122911633153
0.96,-0.455845278771493,-0.424909747946487
0.97,-0.463508000049485,-0.408595161388468
0.98,-0.470999033019422,-0.391141980648014
0.99,-0.478304418328764,-0.372513034414046
1,-0.485410196624968,-0.352671151375484
