xi,sx,sy,cx,cy,ex,ey,ne
0,-2.61027324604866e-25,-1.97991958081441e-24,0,0,-2.61027324604866e-25,-1.97991958081441e-24,1.99705203003895e-24
0.01,0.0313908495660047,-0.0280361161591986,0.00740235525261042,-0.00688875623606775,0.0239884943133942,-0.0211473599231309,0.0319790351815403
0.02,0.0547859039246594,-0.0475891097332844,0.0148736135647364,-0.0137011706016211,0.039912290359923,-0.0338879391316633,0.0523582213254625
0.03,0.073681594099902,-0.0624131694819274,0.0224142907571324,-0.0204351129436584,0.0512673033427696,-0.0419780565382689,0.066260800046254
0.04,0.0899209078756762,-0.0744615544808836,0.0300248719629132,-0.0270883971923915,0.059896035912763,-0.0473731572884921,0.0763659030559006
0.05,0.104464933154889,-0.084735829971404,0.0377058086677885,-0.0336587811373963,0.0667591244871006,-0.0510770488340077,0.0840573947959119
0.06,0.117825786337611,-0.0937599425400424,0.0454575156026435,-0.0401439663584596,0.0723682707349678,-0.0536159761815828,0.0900657510437439
0.07,0.130294745839451,-0.101827937648654,0.0532803674889175,-0.046541598328146,0.0770143783505333,-0.0552863393205081,0.0948039755927011
0.08,0.142054476120889,-0.10912406534388,0.0611746956384399,-0.0528492667040124,0.0808797804824494,-0.0562747986398675,0.0985311719855541
0.09,0.153230847199561,-0.115776845095644,0.0691407844107325,-0.0590645058292354,0.0840900627888282,-0.0567123392664082,0.101426959359419
0.1,0.163916283636148,-0.121882421978892,0.0771788675323173,-0.0651847954611824,0.0867374161038312,-0.0566976265177097,0.103624322459116
0.11,0.174181070486951,-0.127515297655732,0.08528912428427,-0.0712075617481233,0.0888919462026807,-0.0563077359076092,0.105225183405596
0.12,0.184079856768509,-0.132734314670153,0.0934716755661424,-0.0771301784748239,0.0906081812023669,-0.0556041361953286,0.106309277407146
0.13,0.193655984924488,-0.137586665576629,0.101726579846436,-0.0829499685981407,0.0919294050780513,-0.0546366969784882,0.106940096197467
0.14,0.202944509367145,-0.142110761826728,0.11005382901206,-0.0886642060939425,0.0928906803550848,-0.0534465557327859,0.10716908517165
0.15,0.211974301502925,-0.146338305902745,0.118453344131615,-0.0942701181366597,0.0935209573713103,-0.0520681877660849,0.107038617540076
0.16,0.220769516274257,-0.150295797313126,0.126924971149946,-0.0997648876324826,0.0938445451243115,-0.0505309096806429,0.106584105206838
0.17,0.229350622237343,-0.154005641251064,0.135468476534119,-0.105145656126664,0.0938821457032243,-0.0488599851243998,0.105835511186926
0.18,0.237735139474674,-0.15748698033488,0.144083542893872,-0.110409527104474,0.0936515965808025,-0.0470774532304058,0.104818453264654
0.19,0.245938184730527,-0.160756332509979,0.152769764602529,-0.115553569704078,0.093168420127998,-0.0452027628059002,0.103555030174461
0.2,0.253972889406785,-0.163828090435948,0.161526643447438,-0.120574822857946,0.0924462459593473,-0.0432532675780017,0.102064457810495
0.21,0.261850731815296,-0.166714918048952,0.170353584342022,-0.125470299877253,0.0914971474732734,-0.0412446181716991,0.10036357169748
0.22,0.269581808702002,-0.16942806701927,0.179249891134627,-0.130236993491166,0.0903319175673746,-0.0391910735281039,0.0984672309739855
0.23,0.277175060887494,-0.171977628056793,0.188214762552264,-0.134871881349799,0.08896029833523,-0.0371057467069934,0.0963886462119719
0.24,0.284638462258926,-0.17437272799395,0.19724728832021,-0.13937193199601,0.0873911739387165,-0.0350007959979398,0.0941396462861232
0.25,0.291979178660663,-0.176621681846101,0.206346445501006,-0.14373411130709,0.0856327331596572,-0.032887570539011,0.0917308960184707
0.26,0.299203701967049,-0.178732108291867,0.215511095098725,-0.147955389402699,0.0836926068683247,-0.0307767188891678,0.0891720744964409
0.27,0.306317963798459,-0.180711016379296,0.224739978976287,-0.152032748010263,0.0815779848221714,-0.0286782683690327,0.0864720225523417
0.28,0.313327432630433,-0.182564870490273,0.234031717135078,-0.155963188273313,0.0792957154953544,-0.0266016822169596,0.0836388665196528
0.29,0.320237197402086,-0.184299639690022,0.243384805407001,-0.159743738982197,0.076852391995085,-0.0245559007078242,0.0806801240389398
0.3,0.327052040151271,-0.185920836592051,0.252797613609355,-0.163371465200041,0.0742544265419153,-0.02254937139201,0.0776027964138117
0.31,0.33377649968871,-0.187433549824142,0.262268384212427,-0.166843477250043,0.0715081154762829,-0.020590072574099,0.0744134508511471
0.32,0.340414927869954,-0.188842473130453,0.271795231568353,-0.17015694002317,0.0686196963016018,-0.0186855331072825,0.0711182948897638
0.33,0.346971539631072,-0.190151933131044,0.281376141747628,-0.173309082558186,0.0655953978834442,-0.0168428505728578,0.0677232444505353
0.34,0.353450457619921,-0.191365916825698,0.29100897302645,-0.176297207838883,0.0624414845934707,-0.0150687089868146,0.0642339862437787
0.35,0.359855751978213,-0.192488099116297,0.300691457063954,-0.179118702746488,0.0591642949142584,-0.0133693963698084,0.060656034753307
0.36,0.366191475608806,-0.193521869973453,0.310421200803255,-0.181771048098668,0.0557702748055512,-0.0117508218747851,0.0569947836790318
0.37,0.372461695095896,-0.19447036042528,0.320195689124036,-0.184251828700545,0.0522660059718605,-0.0102185317247341,0.0532555515496738
0.38,0.37867051732999,-0.195336466313118,0.330012288267342,-0.186558743327808,0.0486582290626473,-0.00877772298530957,0.0494436211893899
0.39,0.384822111819722,-0.196122868722557,0.339868250045214,-0.188689614557554,0.0449538617745078,-0.00743325416500296,0.0455642728014295
0.4,0.390920728642961,-0.196832050123893,0.34976071683898,-0.190642398359104,0.0411600118039807,-0.00618965176478839,0.0416228105811366
0.41,0.396970711994213,-0.197466305507568,0.35968672738056,-0.192415193354828,0.0372839846136527,-0.00505111215274034,0.0376245829565014
0.42,0.402976509318218,-0.198027748140179,0.369643223301129,-0.194006249660167,0.0333332860170885,-0.00402149848001207,0.0335749967493932
0.43,0.408942676074667,-0.198518309958405,0.379627056421145,-0.19541397721265,0.0293156196535218,-0.00310433274575456,0.0294795257334021
0.44,0.414873876250425,-0.198939737024905,0.389634996745311,-0.196636953501833,0.025238879505114,-0.00230278352307237,0.0253437142232112
0.45,0.420774878817327,-0.199293580854847,0.399663741115686,-0.197673930615823,0.0211111377016412,-0.00161965023902369,0.021173176472944
0.46,0.426650550419702,-0.199581186747427,0.409709922466145,-0.198523841525357,0.0169406279535572,-0.00105734522206988,0.0169735928541802
0.47,0.432505844660233,-0.199803680486881,0.419770119611969,-0.199185805533248,0.0127357250482644,-0.000617874953632164,0.0127507043712618
0.48,0.438345788430004,-0.199961954878892,0.429840867499739,-0.199659132825353,0.008504920930265,-0.000302822053538571,0.00851031028965272
0.49,0.444175465794462,-0.200056657545348,0.439918667835145,-0.199943328068789,0.00425679795931733,-0.000113329476559176,0.00425830628732896
0.5,0.45,-0.200088181224852,0.45,-0.200038093013984,-5.55111512312578e-17,-5.00882108676881e-05,5.00882108676881e-05
0.51,0.455824534205538,-0.200056657545348,0.460081332164855,-0.199943328068789,-0.00425679795931705,-0.000113329476559204,0.00425830628732868
0.52,0.461654211569996,-0.199961954878892,0.470159132500261,-0.199659132825353,-0.00850492093026478,-0.000302822053538571,0.0085103102896525
0.53,0.467494155339767,-0.199803680486881,0.480229880388031,-0.199185805533248,-0.0127357250482643,-0.000617874953632164,0.0127507043712617
0.54,0.473349449580298,-0.199581186747427,0.490290077533855,-0.198523841525357,-0.0169406279535565,-0.00105734522206982,0.0169735928541795
0.55,0.479225121182673,-0.199293580854847,0.500336258884314,-0.197673930615823,-0.021111137701641,-0.00161965023902372,0.0211731764729437
0.56,0.485126123749575,-0.198939737024905,0.510365003254689,-0.196636953501833,-0.0252388795051138,-0.00230278352307237,0.025343714223211
0.57,0.491057323925333,-0.198518309958405,0.520372943578855,-0.19541397721265,-0.0293156196535218,-0.00310433274575453,0.0294795257334021
0.58,0.497023490681782,-0.198027748140179,0.53035677669887,-0.194006249660167,-0.0333332860170881,-0.00402149848001207,0.0335749967493928
0.59,0.503029288005787,-0.197466305507568,0.54031327261944,-0.192415193354828,-0.0372839846136525,-0.00505111215274009,0.0376245829565011
0.6,0.50907927135704,-0.196832050123893,0.55023928316102,-0.190642398359104,-0.0411600118039802,-0.00618965176478842,0.0416228105811361
0.61,0.515177888180278,-0.196122868722557,0.560131749954785,-0.188689614557554,-0.0449538617745079,-0.00743325416500293,0.0455642728014296
0.62,0.52132948267001,-0.195336466313118,0.569987711732658,-0.186558743327808,-0.0486582290626473,-0.00877772298530957,0.0494436211893899
0.63,0.527538304904104,-0.19447036042528,0.579804310875964,-0.184251828700545,-0.0522660059718605,-0.0102185317247342,0.0532555515496737
0.64,0.533808524391194,-0.193521869973453,0.589578799196745,-0.181771048098668,-0.0557702748055511,-0.0117508218747851,0.0569947836790317
0.65,0.540144248021787,-0.192488099116296,0.599308542936046,-0.179118702746488,-0.0591642949142585,-0.0133693963698082,0.060656034753307
0.66,0.54654954238008,-0.191365916825698,0.60899102697355,-0.176297207838883,-0.0624414845934703,-0.0150687089868146,0.0642339862437783
0.67,0.553028460368928,-0.190151933131044,0.618623858252372,-0.173309082558186,-0.065595397883444,-0.0168428505728578,0.0677232444505352
0.68,0.559585072130046,-0.188842473130453,0.628204768431647,-0.17015694002317,-0.0686196963016018,-0.0186855331072825,0.0711182948897639
0.69,0.56622350031129,-0.187433549824142,0.637731615787573,-0.166843477250043,-0.0715081154762829,-0.0205900725740991,0.074413450851147
0.7,0.572947959848729,-0.185920836592051,0.647202386390645,-0.163371465200041,-0.0742544265419153,-0.02254937139201,0.0776027964138116
0.71,0.579762802597914,-0.184299639690022,0.656615194592999,-0.159743738982197,-0.0768523919950848,-0.0245559007078243,0.0806801240389397
0.72,0.586672567369567,-0.182564870490273,0.665968282864921,-0.155963188273313,-0.0792957154953542,-0.0266016822169595,0.0836388665196525
0.73,0.593682036201541,-0.180711016379296,0.675260021023712,-0.152032748010263,-0.0815779848221713,-0.0286782683690327,0.0864720225523416
0.74,0.600796298032951,-0.178732108291867,0.684488904901275,-0.147955389402699,-0.0836926068683244,-0.0307767188891678,0.0891720744964406
0.75,0.608020821339337,-0.176621681846101,0.693653554498994,-0.14373411130709,-0.0856327331596574,-0.032887570539011,0.0917308960184708
0.76,0.615361537741073,-0.17437272799395,0.70275271167979,-0.13937193199601,-0.0873911739387163,-0.0350007959979397,0.0941396462861231
0.77,0.622824939112506,-0.171977628056792,0.711785237447736,-0.134871881349799,-0.0889602983352299,-0.0371057467069933,0.0963886462119717
0.78,0.630418191297998,-0.16942806701927,0.720750108865373,-0.130236993491166,-0.0903319175673745,-0.0391910735281037,0.0984672309739853
0.79,0.638149268184704,-0.166714918048952,0.729646415657978,-0.125470299877253,-0.0914971474732734,-0.0412446181716991,0.10036357169748
0.8,0.646027110593215,-0.163828090435948,0.738473356552562,-0.120574822857946,-0.0924462459593471,-0.0432532675780016,0.102064457810495
0.81,0.654061815269473,-0.160756332509979,0.747230235397471,-0.115553569704078,-0.093168420127998,-0.0452027628059002,0.103555030174461
0.82,0.662264860525326,-0.15748698033488,0.755916457106128,-0.110409527104474,-0.0936515965808026,-0.0470774532304057,0.104818453264654
0.83,0.670649377762657,-0.154005641251064,0.764531523465881,-0.105145656126664,-0.0938821457032243,-0.0488599851243997,0.105835511186926
0.84,0.679230483725743,-0.150295797313126,0.773075028850054,-0.0997648876324826,-0.0938445451243115,-0.0505309096806429,0.106584105206838
0.85,0.688025698497074,-0.146338305902745,0.781546655868385,-0.0942701181366597,-0.0935209573713104,-0.0520681877660849,0.107038617540076
0.86,0.697055490632855,-0.142110761826728,0.78994617098794,-0.0886642060939425,-0.0928906803550843,-0.0534465557327858,0.107169085171649
0.87,0.706344015075513,-0.137586665576629,0.798273420153564,-0.0829499685981407,-0.091929405078051,-0.0546366969784882,0.106940096197467
0.88,0.715920143231491,-0.132734314670153,0.806528324433857,-0.0771301784748239,-0.0906081812023668,-0.0556041361953286,0.106309277407146
0.89,0.725818929513049,-0.127515297655732,0.81471087571573,-0.0712075617481233,-0.0888919462026805,-0.0563077359076091,0.105225183405596
0.9,0.736083716363852,-0.121882421978892,0.822821132467683,-0.0651847954611824,-0.086737416103831,-0.0566976265177096,0.103624322459116
0.91,0.746769152800439,-0.115776845095643,0.830859215589267,-0.0590645058292354,-0.084090062788828,-0.0567123392664081,0.101426959359419
0.92,0.757945523879111,-0.10912406534388,0.83882530436156,-0.0528492667040124,-0.0808797804824493,-0.0562747986398675,0.098531171985554
0.93,0.769705254160549,-0.101827937648654,0.846719632511083,-0.0465415983281459,-0.0770143783505334,-0.0552863393205082,0.0948039755927011
0.94,0.782174213662389,-0.0937599425400424,0.854542484397356,-0.0401439663584596,-0.0723682707349678,-0.0536159761815828,0.0900657510437439
0.95,0.795535066845111,-0.084735829971404,0.862294191332211,-0.0336587811373963,-0.0667591244871004,-0.0510770488340077,0.0840573947959118
0.96,0.810079092124324,-0.0744615544808836,0.869975128037087,-0.0270883971923915,-0.0598960359127629,-0.0473731572884921,0.0763659030559006
0.97,0.826318405900098,-0.0624131694819274,0.877585709242867,-0.0204351129436584,-0.0512673033427693,-0.041978056538269,0.0662608000462538
0.98,0.845214096075341,-0.0475891097332845,0.885126386435263,-0.0137011706016211,-0.0399122903599226,-0.0338879391316634,0.0523582213254623
0.99,0.868609150433995,-0.0280361161591986,0.892597644747389,-0.00688875623606775,-0.0239884943133943,-0.0211473599231309,0.0319790351815403
1,0.9,1.45752264368497e-24,0.9,0,2.22044604925031e-16,1.45752264368497e-24,2.22044604925031e-16
