xi,s1,s2
0,0,0
0.01,0.000431364570803284,-0.010118261020529
0.02,0.000867934531014459,-0.0202347585893573
0.03,0.00130983856422395,-0.0303494843677064
0.04,0.00175721018088846,-0.040462429596541
0.05,0.00221018796254837,-0.050573585069768
0.06,0.00266891582167277,-0.0606829411053624
0.07,0.00313354327834535,-0.0707904875142242
0.08,0.00360422575511771,-0.0808962135665619
0.09,0.00408112489147816,-0.0910001079555646
0.1,0.00456440887952169,-0.101102158758108
0.11,0.00505425282255748,-0.111202353392208
0.12,0.00555083911855888,-0.1213006785709
0.13,0.00605435787054685,-0.131397120252194
0.14,0.00656500732620714,-0.14149166358471
0.15,0.00708299434927202,-0.151584292848541
0.16,0.00760853492545816,-0.161674991390872
0.17,0.00814185470604075,-0.171763741555776
0.18,0.00868318959246972,-0.181850524607592
0.19,0.00923278636579772,-0.191935320647164
0.2,0.00979090336509949,-0.202018108520172
0.21,0.0103578112195235,-0.212098865716663
0.22,0.0109337936391366,-0.222177568260788
0.23,0.0115191482703108,-0.232254190589596
0.24,0.0121141876220659,-0.242328705419626
0.25,0.0127192400705382,-0.252401083599811
0.26,0.0133346509496005,-0.262471293949051
0.27,0.013960783736639,-0.27253930307655
0.28,0.0145980213436053,-0.282605075182748
0.29,0.0152467675247374,-0.292668571838357
0.3,0.0159074484138063,-0.302729751738652
0.31,0.0165805142054236,-0.31278857042972
0.32,0.017266440996881,-0.32284498000286
0.33,0.0179657328092254,-0.332898928752739
0.34,0.0186789238088608,-0.3429503607942
0.35,0.0194065807539678,-0.352999215631754
0.36,0.0201493056935287,-0.363045427674832
0.37,0.0209077389508195,-0.373088925690645
0.38,0.0216825624280105,-0.383129632185105
0.39,0.0224745032741209,-0.39316746270054
0.4,0.0232843379651807,-0.403202325016872
0.41,0.0241128968532641,-0.413234118240454
0.42,0.0249610692503212,-0.423262731761715
0.43,0.0258298091237658,-0.433288044059089
0.44,0.0267201414939561,-0.443309921322159
0.45,0.0276331696395192,-0.453328215861393
0.46,0.028570083235514,-0.463342764264944
0.47,0.0295321675724752,-0.473353385254419
0.48,0.0305208140323767,-0.483359877180805
0.49,0.0315375320317389,-0.49336201508827
0.5,0.0325839626840394,-0.503359547256519
0.51,0.033661894485294,-0.513352191110714
0.52,0.0347732813907716,-0.523339628360217
0.53,0.0359202637307099,-0.533321499191625
0.54,0.0371051925130811,-0.543297395295099
0.55,0.038330657787851,-0.553266851442175
0.56,0.0395995219076539,-0.563229335253044
0.57,0.0409149587249487,-0.573184234684532
0.58,0.0422805000298164,-0.583130842626781
0.59,0.0437000908750734,-0.593068337802392
0.6,0.0451781558830488,-0.602995760895891
0.61,0.0467196792182583,-0.612911984473209
0.62,0.048330301694046,-0.622815674735311
0.63,0.0500164395319958,-0.632705242419025
0.64,0.0517854307141441,-0.642578779107607
0.65,0.0536457168081161,-0.652433973682573
0.66,0.0556070708181636,-0.66226800138264
0.67,0.0576808853305573,-0.672077374527756
0.68,0.0598805404295568,-0.681857738749829
0.69,0.0622218782099616,-0.691603590436357
0.7,0.0647238211287069,-0.701307878149789
0.71,0.0674091861883252,-0.710961429752627
0.72,0.07030576761479,-0.72055211202663
0.73,0.0734477887920574,-0.730063570197909
0.74,0.0768778595818081,-0.739473291623527
0.75,0.0806496106589719,-0.748749555134239
0.76,0.0848311817666752,-0.757846499584413
0.77,0.0895096139551694,-0.766695958954372
0.78,0.0947956251017789,-0.775193709885754
0.79,0.100826344654387,-0.783176336033023
0.8,0.107758123695572,-0.790384157368068
0.81,0.115728831808052,-0.796411887499274
0.82,0.124753364347895,-0.800681898041448
0.83,0.134551189189479,-0.802551252891788
0.84,0.144482816519771,-0.801646514581877
0.85,0.153832931634517,-0.798156764508189
0.86,0.162185896495699,-0.792676661187395
0.87,0.169472517572046,-0.785830824278376
0.88,0.175803645912277,-0.778086077970388
0.89,0.181335989939179,-0.769747779534814
0.9,0.186215255205397,-0.761008330450674
0.91,0.190561443652762,-0.751989611391723
0.92,0.194469444383256,-0.742770578856057
0.93,0.198013537571167,-0.733403822467067
0.94,0.201252037335336,-0.723925369434398
0.95,0.204231108769031,-0.714360563545544
0.96,0.206987686008889,-0.704727669973428
0.97,0.209551647876852,-0.695040142555953
0.98,0.21194743098592,-0.685308086770364
0.99,0.214195229778158,-0.675539227092369
1,0.216311896062463,-0.665739561406607
