xi,sx,sy,cx,cy,ex,ey,ne
0,4.10891928251767e-26,-1.65776820158026e-27,0,0,4.10891928251767e-26,-1.65776820158026e-27,4.11226210550194e-26
0.01,-0.0229930815987849,0.00605977238162171,-0.00984741288924258,0.00246921842343925,-0.0131456687095423,0.00359055395818246,0.0136272038051707
0.02,-0.0431725235852569,0.0117487974993978,-0.0196705659197588,0.00503476076698469,-0.0235019576654981,0.00671403673241316,0.0244421828680472
0.03,-0.0610568784838865,0.0171132902400941,-0.0294686633080839,0.0076959050880957,-0.0315882151758026,0.00941738515199836,0.0329621370832336
0.04,-0.0770718370220027,0.0221961093818907,-0.0392409296223771,0.0104519102957397,-0.0378309073996256,0.0117441990861509,0.0396119144558073
0.05,-0.0915655816314205,0.0270366938597288,-0.0489866101100075,0.0133020170948342,-0.0425789715214131,0.0137346767648946,0.0447393580827602
0.06,-0.104821898481479,0.0316710705777511,-0.0587049709843576,0.0162454489354113,-0.0461169274971214,0.0154256216423398,0.0486283950467973
0.07,-0.117071322565669,0.0361319200679545,-0.0683952996713302,0.0192814129641087,-0.0486760228943389,0.0168505071038458,0.0515101426368338
0.08,-0.128500564067545,0.0404486878980963,-0.078056905016183,0.0224091009756691,-0.050443659051362,0.0180395869224272,0.0535722823372484
0.09,-0.139260439681876,0.0446477312178432,-0.0876891174514194,0.0256276903622048,-0.051571322230457,0.0190200408556384,0.0549669285184081
0.1,-0.149472509703712,0.0487524912044181,-0.0972912891265851,0.0289363450580919,-0.0521812205771272,0.0198161461463262,0.0558171965348615
0.11,-0.159234600460892,0.0527836834318803,-0.106862794000911,0.0323342164784393,-0.0523718064599815,0.0204494669534411,0.0562226538911286
0.12,-0.168625371994291,0.0567594993459697,-0.116403027899838,0.0358204444491904,-0.0522223440944536,0.0209390548967793,0.0562638182377436
0.13,-0.177708072724405,0.0606958130834475,-0.125911408536546,0.0393941581270176,-0.0517966641878598,0.0213016549564299,0.0560058472382367
0.14,-0.186533606122496,0.0646063888353778,-0.135387375499669,0.0430544769072804,-0.0511462306228276,0.0215519119280974,0.055501547858415
0.15,-0.195143019069136,0.0685030848221052,-0.144830390208461,0.04680051131843,-0.0503126288606748,0.0217025735036752,0.0547938164353828
0.16,-0.203569507572317,0.0723960507280998,-0.154239935836717,0.0506313639013582,-0.0493295717356008,0.0217646868267416,0.0539176060325746
0.17,-0.211840022771044,0.0762939161416493,-0.163615517206803,0.054546130072303,-0.0482245055642409,0.0217477860693463,0.0529015040980269
0.18,-0.219976548608195,0.080203968161884,-0.172956660655205,0.0585438989680361,-0.04701988795299,0.0216600691938478,0.0517689913036174
0.19,-0.227997112158187,0.0841323168781183,-0.182262913870998,0.0626237542721806,-0.0457341982871889,0.0215085626059376,0.0505394416109384
0.2,-0.235916578280226,0.0880840478982728,-0.191533845708704,0.0667847750216061,-0.0443827325715213,0.0212992728766667,0.0492289140200135
0.21,-0.243747271976478,0.092063361508514,-0.200769045976987,0.0710260363919787,-0.0429782259994908,0.0210373251165354,0.0478507780304785
0.22,-0.251499464506011,0.0960736983894979,-0.209968125204656,0.0753466104616389,-0.0415313393013545,0.020727087927859,0.0464162074940794
0.23,-0.259181752879524,0.100117852100034,-0.219130714385447,0.0797455669530944,-0.0400510384940762,0.0203722851469393,0.0449345711736763
0.24,-0.266801356776504,0.104198068770892,-0.228256464703047,0.0842219739515186,-0.0385448920734568,0.0199760948193735,0.0434137428608388
0.25,-0.274364352125103,0.108316134634158,-0.237345047237803,0.0887748985997431,-0.0370193048872997,0.0195412360344146,0.0418603492590728
0.26,-0.281875856505546,0.112473452151277,-0.246396152656561,0.0934034077693372,-0.0354797038489851,0.0190700443819401,0.0402799699347064
0.27,-0.289340178119914,0.116671105600068,-0.255409490887041,0.0981065687074487,-0.0339306872328733,0.0185645368926192,0.0386773003987157
0.28,-0.296760937254376,0.120909917041729,-0.264384790778126,0.102883449659181,-0.0323761464762494,0.0180264673825483,0.0370562867398453
0.29,-0.304141166884173,0.125190493617643,-0.273321799747437,0.107733120465356,-0.0308193671367358,0.0174573731522868,0.0354202381144889
0.3,-0.311483397276502,0.129513267126739,-0.282220283417486,0.112654653135603,-0.029263113859016,0.0168586139911359,0.0337719217461467
0.31,-0.318789728071659,0.133878526811759,-0.291080025241721,0.117647122396771,-0.0277097028299378,0.0162314044149879,0.0321136438325886
0.32,-0.326061890308096,0.138286446241153,-0.29990082612167,0.122709606216758,-0.0261610641864252,0.015576840024395,0.0304473188394619
0.33,-0.333301300142144,0.142737105116887,-0.308682504016414,0.127841186303885,-0.0246187961257296,0.0148959188130016,0.028774529013761
0.34,-0.340509105537692,0.147230506771451,-0.317424893545515,0.133040948582039,-0.0230842119921766,0.0141895581894114,0.0270965755199885
0.35,-0.347686226904909,0.151766592044074,-0.326127845586526,0.138307983641823,-0.0215583813183832,0.0134586084022504,0.0254145223286596
0.36,-0.354833392490074,0.156345250150934,-0.33479122686813,0.143641387168052,-0.0200421656219438,0.0127038629828821,0.023729233816229
0.37,-0.361951169204803,0.160966327090871,-0.343414919559926,0.149040260343927,-0.0185362496448778,0.0119260667469449,0.0220414069185661
0.38,-0.36903998949381,0.165629632059579,-0.351998820859813,0.154503710232315,-0.0170411686339971,0.0111259218272645,0.0203515985838639
0.39,-0.376100174761291,0.170334942282255,-0.360542842579903,0.160030850134554,-0.0155573321813886,0.0103040921477006,0.0186602491835017
0.4,-0.383131955804901,0.17508200661734,-0.369046910731795,0.16562079992727,-0.0140850450731063,0.00946120669006967,0.0169677024591915
0.41,-0.390135490642649,0.179870548232042,-0.377510965112059,0.1712726863777,-0.0126245255305897,0.00859786185434247,0.0152742225117637
0.42,-0.397110880061667,0.184700266603744,-0.385934958888661,0.17698564343806,-0.0111759211730058,0.00771462316568425,0.0135800082714905
0.43,-0.404058181168417,0.189570839059941,-0.394318858189061,0.182758812519505,-0.00973932297935565,0.00681202654043522,0.0118852058326223
0.44,-0.410977419177205,0.194481922032946,-0.402662641690655,0.188591342746254,-0.0083147774865508,0.00589057928669198,0.0101899189880811
0.45,-0.417868597637609,0.199433152174041,-0.410966300214164,0.194482391190459,-0.00690229742344534,0.00495076098358202,0.00849421827116881
0.46,-0.424731707271339,0.204424147444929,-0.419229836320569,0.200431123088433,-0.00550187095077026,0.00399302435649626,0.00679814882673968
0.47,-0.431566733564845,0.209454508282114,-0.427453263912099,0.206436712038829,-0.00411346965274584,0.00301779624328508,0.00510173762065891
0.48,-0.438373663245391,0.214523818912025,-0.435636607837777,0.212498340183397,-0.00273705540761388,0.00202547872862774,0.00340500167172819
0.49,-0.445152489755085,0.219631648881194,-0.443779903503966,0.218615198370934,-0.00137258625111891,0.00101645051026061,0.00170797091795198
0.5,-0.451903217829169,0.224777554856435,-0.451883196490312,0.224786486305042,-2.00213388570347e-05,-8.93144860716899e-06,2.19231563386915e-05
0.51,-0.45862586728153,0.229961082744598,-0.459946542171462,0.231011412676335,0.00132067488993171,-0.00105032993173632,0.00168741670324711
0.52,-0.465320476101547,0.235181770179992,-0.467970005344886,0.237289195279693,0.00264952924333878,-0.00210742509970077,0.00338544616884631
0.53,-0.471987102971803,0.240439149429716,-0.47595365986509,0.243619061117188,0.00396655689328707,-0.003179911687472,0.00508383830661481
0.54,-0.478625829325615,0.245732750772968,-0.483897588284486,0.250000246487291,0.00527175895887066,-0.00426749571432283,0.00678254835531578
0.55,-0.485236761076455,0.25106210641954,-0.491801881501149,0.256431997060966,0.00656512042469393,-0.00536989064142523,0.00848154064375097
0.56,-0.491820030167884,0.256426755045161,-0.499666638413652,0.262913567945227,0.00784660824576877,-0.00648681290006609,0.010180766305295
0.57,-0.498375796112381,0.261826247036965,-0.507491965583159,0.269444223734772,0.00911616947077792,-0.00761797669780662,0.0118801563452788
0.58,-0.504904247710063,0.267260150560897,-0.515277976902899,0.276023238552234,0.0103737291928361,-0.00876308799133696,0.0135796159190978
0.59,-0.511405605163556,0.27272805858427,-0.523024793275163,0.282649896077638,0.0116191881116069,-0.00992183749336772,0.0152790180187637
0.6,-0.517880122832889,0.278229597010788,-0.530732542295883,0.289323489567588,0.0128524194629943,-0.0110938925567998,0.0169781959617202
0.61,-0.524328092903989,0.283764434111986,-0.538401357946893,0.296043321864744,0.014073265042905,-0.0122788877527584,0.0186769342616151
0.62,-0.530749850275839,0.289332291468053,-0.546031380295897,0.30280870539809,0.0152815300200582,-0.0134764139300373,0.0203749574764622
0.63,-0.537145779004426,0.294932956662315,-0.553622755204177,0.309618962174509,0.0164769761997514,-0.0146860055121947,0.0220719166043955
0.64,-0.543516320675895,0.300566298007032,-0.561175634042061,0.31647342376216,0.0176593133661658,-0.015907125755128,0.0237673725589073
0.65,-0.54986198511665,0.306232281613541,-0.568690173412123,0.323371431266126,0.0188281882954731,-0.0171391496525848,0.0254607762117239
0.66,-0.556183363884142,0.31193099115693,-0.576166534880108,0.330312335296805,0.0199831709959656,-0.0183813441398745,0.0271514444448633
0.67,-0.562481147018597,0.317662650724294,-0.583604884713539,0.33729549593148,0.0211237376949419,-0.0196328452071858,0.028838531605025
0.68,-0.568756143572537,0.323427651175993,-0.591005393627947,0.344320282669511,0.0222492500554093,-0.0208926314935178,0.0305209957038113
0.69,-0.575009306471611,0.329226580491145,-0.598368236540667,0.351386074381551,0.0233589300690559,-0.0221594938904064,0.0321975586566746
0.7,-0.581241762297586,0.335060258613528,-0.60569359233213,0.358492259253203,0.0244518300345442,-0.023432000639675,0.0338666598001038
0.71,-0.587454846630043,0.340929777374517,-0.612981643614547,0.365638234723484,0.0255267969845048,-0.0247084573489663,0.0355264018562788
0.72,-0.593650145658071,0.346836546179784,-0.620232576507916,0.372823407418481,0.0265824308498448,-0.0259868612386971,0.0371744883882223
0.73,-0.599829544907377,0.352782344355588,-0.627446580423225,0.380047193080553,0.0276170355158479,-0.0272648487249655,0.0388081515493699
0.74,-0.605995286154263,0.35876938141167,-0.634623847852765,0.387309016493401,0.0286285616985018,-0.0285396350817306,0.0404240685176947
0.75,-0.612150033948503,0.364800367044317,-0.641764574167413,0.394608311403356,0.0296145402189101,-0.0298079443590393,0.0420182643536002
0.76,-0.618296953674997,0.370878593528337,-0.648868957420781,0.401944520437181,0.0305720037457839,-0.0310659269088439,0.0435859980697685
0.77,-0.624439803781815,0.377008034283894,-0.655937198160103,0.409317095016684,0.0314973943782879,-0.0323090607327898,0.045121627387058
0.78,-0.630583045722565,0.383193463906508,-0.662969499243713,0.416725495270433,0.032386453521148,-0.0335320313639254,0.0466184459100553
0.79,-0.636731976336641,0.389440606869523,-0.669966065665001,0.424169189942838,0.0332340893283599,-0.0347285830733157,0.048068484225796
0.8,-0.642892888854411,0.395756324501119,-0.676927104382694,0.431647656300856,0.0340342155282828,-0.0358913317997364,0.0494622636459794
0.81,-0.649073270498562,0.402148852755889,-0.683852824157334,0.439160380038562,0.0347795536587722,-0.0370115272826725,0.0507884879131032
0.82,-0.655282046790215,0.408628106797354,-0.690743435393797,0.446706855179828,0.0354613886035814,-0.0380787483824736,0.0520336541102962
0.83,-0.661529885191841,0.415206072535909,-0.697599149989722,0.454286583979319,0.0360692647978812,-0.0390805114434096,0.0531815591886712
0.84,-0.66782957366097,0.421897310079768,-0.704420181189704,0.461899076822015,0.0365906075287342,-0.0400017667422461,0.0542126728894908
0.85,-0.67419649308205,0.428719599607961,-0.711206743445101,0.469543852121465,0.0370102503630511,-0.0408242525135045,0.055103341325387
0.86,-0.680649206421045,0.435694766517423,-0.71795905227931,0.477220436216955,0.0373098458582647,-0.0415256696995316,0.0558247780287756
0.87,-0.68721019184137,0.442849729884247,-0.724677324158381,0.484928363269759,0.0374671323170109,-0.0420786333855119,0.0563417908097775
0.88,-0.693906751962963,0.45021782636525,-0.731361776366802,0.492667175158653,0.0374550244038384,-0.042449348793403,0.0566111832244841
0.89,-0.700772136971623,0.457840470703745,-0.738012626888331,0.500436421374841,0.0372404899167079,-0.0425959506710962,0.0565797587730002
0.9,-0.707846925425639,0.465769224045798,-0.744630094291725,0.508235658916435,0.036783168866086,-0.0424664348706368,0.0561818440641907
0.91,-0.71518071339405,0.474068352373859,-0.751214397621223,0.516064452182643,0.0360336842271727,-0.041996099808784,0.055336234043644
0.92,-0.722834170028178,0.482817969576532,-0.757765756291649,0.523922372867778,0.0349315862634711,-0.0411044032912463,0.0539424479312141
0.93,-0.730881525848071,0.492117873049916,-0.764284389987991,0.531808999855223,0.0334028641399197,-0.0396911268053066,0.0518761687080384
0.94,-0.739413568950889,0.502092194320511,-0.770770518569321,0.539723919111457,0.0313569496184323,-0.037631724790946,0.0489837217870835
0.95,-0.748541234051658,0.512895003045544,-0.777224361976933,0.547666723580255,0.0286831279252749,-0.0347717205347118,0.0450754298539879
0.96,-0.758399879780961,0.524717019937044,-0.783646140146544,0.555637013077161,0.0252462603655829,-0.0309199931401168,0.0399176607309556
0.97,-0.769154361021654,0.537793612724234,-0.790036072924456,0.563634394184316,0.0208817119028016,-0.025840781460082,0.0332233634429045
0.98,-0.781005015300277,0.552414269268311,-0.796394379987525,0.571658480145749,0.0153893646872482,-0.0192442108774377,0.0246408643876876
0.99,-0.794194695391159,0.568933763427567,-0.802721280766837,0.579708890763187,0.00852658537567819,-0.0107751273356201,0.0137406705537815
1,-0.809016994374947,0.587785252292473,-0.809016994374947,0.587785252292473,-1.11022302462516e-16,-1.11022302462516e-16,1.57009245868378e-16
