xi,sx,sy,cx,cy,ex,ey,ne
0,0,-0,0,0,0,-0,0
0.01,-0.0093720513,-0.0036553749,-0.0092490845,-0.0039562431,-0.0001229668,0.0003008682,0.000325027
0.02,-0.0187910278,-0.0071853207,-0.0185893916,-0.0076904166,-0.0002016362,0.0005050959,0.0005438557
0.03,-0.0282652536,-0.0105628137,-0.0280172513,-0.0111960566,-0.0002480024,0.0006332429,0.0006800748
0.04,-0.0378001309,-0.0137641265,-0.0375285737,-0.0144668627,-0.0002715571,0.0007027362,0.00075338
0.05,-0.0473985267,-0.0167685539,-0.0471188481,-0.0174967444,-0.0002796786,0.0007281905,0.0007800523
0.06,-0.0570611252,-0.0195581577,-0.0567831451,-0.020279869,-0.0002779801,0.0007217112,0.0007733951
0.07,-0.0667867457,-0.0221175314,-0.0665161258,-0.0228107105,-0.0002706199,0.0006931791,0.000744132
0.08,-0.07657263,-0.0244335812,-0.0763120548,-0.0250840989,-0.0002605752,0.0006505177,0.0007007658
0.09,-0.0864147019,-0.0264953243,-0.0861648199,-0.0270952679,-0.000249882,0.0005999436,0.0006499026
0.1,-0.0963077993,-0.0282937017,-0.0960679569,-0.0288399019,-0.0002398424,0.0005462002,0.0005965392
0.11,-0.1062458824,-0.0298214054,-0.1060146803,-0.0303141795,-0.0002312021,0.0004927741,0.0005443167
0.12,-0.1162222195,-0.031072719,-0.1159979194,-0.0315148141,-0.0002243001,0.0004420952,0.0004957405
0.13,-0.1262295521,-0.0320433699,-0.1260103593,-0.0324390894,-0.0002191927,0.0003957195,0.0004523709
0.14,-0.1362602403,-0.0327303939,-0.1360444864,-0.0330848897,-0.0002157539,0.0003544958,0.0004149904
0.15,-0.146306392,-0.033132009,-0.1460926371,-0.0334507237,-0.0002137549,0.0003187147,0.000383758
0.16,-0.1563599751,-0.0332475001,-0.1561470506,-0.0335357419,-0.0002129245,0.0002882418,0.0003583576
0.17,-0.1664129157,-0.0330771123,-0.1661999217,-0.0333397464,-0.000212994,0.0002626341,0.0003381466
0.18,-0.1764571828,-0.0326219526,-0.1762434564,-0.0328631931,-0.0002137264,0.0002412405,0.0003222979
0.19,-0.1864848614,-0.0318838995,-0.1862699259,-0.0321071867,-0.0002149355,0.0002232872,0.0003099265
0.2,-0.1964882139,-0.0308655196,-0.1962717198,-0.0310734675,-0.0002164941,0.0002079479,0.0003001866
0.21,-0.2064597326,-0.0295699908,-0.2062413973,-0.0297643917,-0.0002183353,0.0001944009,0.0002923388
0.22,-0.2163921825,-0.0280010319,-0.2161717347,-0.0281829048,-0.0002204478,0.0001818729,0.0002857883
0.23,-0.2262786367,-0.0261628376,-0.2260557693,-0.0263325091,-0.0002228674,0.0001696715,0.0002801041
0.24,-0.2361125043,-0.0240600189,-0.2358868386,-0.0242172263,-0.0002256657,0.0001572074,0.0002750258
0.25,-0.2458875522,-0.0216975479,-0.245658614,-0.0218415554,-0.0002289382,0.0001440075,0.0002704641
0.26,-0.2555979209,-0.0190807075,-0.2553651295,-0.0192104278,-0.0002327914,0.0001297202,0.0002664943
0.27,-0.265238136,-0.0162150453,-0.2650008042,-0.01632916,-0.0002373317,0.0001141147,0.0002633411
0.28,-0.2748031141,-0.0131063303,-0.2745604598,-0.0132034051,-0.0002426543,9.70748e-05,0.0002613515
0.29,-0.2842881662,-0.0097605142,-0.2840393315,-0.0098391032,-0.0002488347,7.8589e-05,0.0002609501
0.3,-0.293688997,-0.0061836955,-0.2934330747,-0.0062424336,-0.0002559222,5.87381e-05,0.0002625764
0.31,-0.3030017009,-0.0023820861,-0.3027377658,-0.0024197665,-0.000263935,3.76804e-05,0.0002666112
0.32,-0.3122227566,0.0016380185,-0.3119498992,0.0016223818,-0.0002728574,1.56367e-05,0.0002733051
0.33,-0.3213490189,0.0058702674,-0.3210663797,0.005877393,-0.0002826392,-7.1255e-06,0.000282729
0.34,-0.3303777084,0.0103082793,-0.3300845116,0.0103385865,-0.0002931968,-3.03072e-05,0.000294759
0.35,-0.3393064005,0.0149456659,-0.3390019851,0.0149992575,-0.0003044153,-5.35916e-05,0.0003090967
0.36,-0.3481330127,0.0197760532,-0.34781686,0.0198527108,-0.0003161527,-7.66577e-05,0.0003253135
0.37,-0.356855791,0.0247931007,-0.3565275473,0.0248922918,-0.0003282437,-9.91911e-05,0.0003429035
0.38,-0.3654732954,0.0299905192,-0.3651327895,0.0301114136,-0.0003405059,-0.0001208945,0.0003613305
0.39,-0.3739843852,0.0353620864,-0.3736316406,0.0355035814,-0.0003527446,-0.000141495,0.0003800653
0.4,-0.3823882035,0.040901662,-0.3820234443,0.041062413,-0.0003647592,-0.000160751,0.0003986103
0.41,-0.3906841615,0.0466032,-0.3903078129,0.0467816565,-0.0003763486,-0.0001784565,0.0004165153
0.42,-0.3988719228,0.0524607608,-0.3984846062,0.0526552051,-0.0003873166,-0.0001944443,0.0004333852
0.43,-0.4069513874,0.0584685215,-0.40655391,0.0586771091,-0.0003974775,-0.0002085876,0.0004488843
0.44,-0.4149226763,0.0646207853,-0.4145160162,0.0648415856,-0.0004066601,-0.0002208003,0.0004627366
0.45,-0.4227861151,0.0709119892,-0.422371403,0.0711430251,-0.0004147121,-0.0002310359,0.0004747249
0.46,-0.4305422191,0.0773367115,-0.430120716,0.0775759976,-0.0004215031,-0.0002392861,0.0004846883
0.47,-0.4381916779,0.0838896775,-0.4377647502,0.0841352553,-0.0004269276,-0.0002455778,0.0004925197
0.48,-0.4457353403,0.0905657646,-0.4453044337,0.0908157347,-0.0004309065,-0.0002499701,0.0004981621
0.49,-0.4531741996,0.0973600066,-0.4527408111,0.097612557,-0.0004333885,-0.0002525504,0.0005016047
0.5,-0.4605093797,0.1042675967,-0.4600750295,0.1045210271,-0.0004343502,-0.0002534304,0.0005028788
0.51,-0.4677421207,0.1112838903,-0.4673083242,0.1115366321,-0.0004337966,-0.0002527418,0.0005020537
0.52,-0.4748737659,0.1184044062,-0.4744420066,0.1186550382,-0.0004317593,-0.000250632,0.0004992319
0.53,-0.4819057482,0.1256248279,-0.4814774524,0.1258720876,-0.0004282958,-0.0002472596,0.0004945448
0.54,-0.4888395781,0.1329410039,-0.488416091,0.1331837945,-0.0004234871,-0.0002427906,0.0004881481
0.55,-0.4956768312,0.1403489466,-0.4952593957,0.1405863405,-0.0004174355,-0.0002373939,0.0004802169
0.56,-0.5024191366,0.1478448318,-0.5020088752,0.1480760699,-0.0004102614,-0.000231238,0.000470941
0.57,-0.5090681659,0.1554249971,-0.5086660655,0.1556494845,-0.0004021004,-0.0002244874,0.0004605208
0.58,-0.5156256224,0.1630859391,-0.5152325227,0.1633032387,-0.0003930997,-0.0002172996,0.000449162
0.59,-0.5220932312,0.170824311,-0.5217098167,0.1710341334,-0.0003834144,-0.0002098224,0.0004370722
0.6,-0.5284727293,0.1786369196,-0.5280995257,0.1788391114,-0.0003732037,-0.0002021918,0.0004244555
0.61,-0.5347658572,0.1865207214,-0.5344032303,0.1867152511,-0.0003626269,-0.0001945298,0.0004115096
0.62,-0.54097435,0.1944728183,-0.5406225101,0.1946597618,-0.0003518399,-0.0001869435,0.0003984209
0.63,-0.5470999297,0.2024904538,-0.5467589386,0.2026699777,-0.0003409911,-0.0001795239,0.0003853619
0.64,-0.5531442985,0.2105710079,-0.5528140807,0.2107433529,-0.0003302178,-0.000172345,0.000372487
0.65,-0.5591091318,0.2187119925,-0.5587894888,0.2188774564,-0.000319643,-0.0001654639,0.0003599304
0.66,-0.5649960726,0.2269110456,-0.5646867006,0.2270699665,-0.000309372,-0.0001589209,0.0003478029
0.67,-0.5708067267,0.2351659266,-0.5705072368,0.2353186664,-0.0002994899,-0.0001527398,0.0003361899
0.68,-0.5765426581,0.2434745104,-0.5762525989,0.2436214392,-0.0002900592,-0.0001469287,0.0003251498
0.69,-0.5822053854,0.2518347822,-0.5819242676,0.2519762634,-0.0002811177,-0.0001414812,0.0003147127
0.7,-0.5877963793,0.2602448312,-0.5875237016,0.2603812082,-0.0002726777,-0.000136377,0.00030488
0.71,-0.5933170608,0.2687028455,-0.5930523362,0.2688344298,-0.0002647246,-0.0001315843,0.000295624
0.72,-0.5987687996,0.2772071064,-0.5985115823,0.2773341668,-0.0002572173,-0.0001270604,0.0002868886
0.73,-0.6041529146,0.2857559824,-0.6039028259,0.2858787362,-0.0002500887,-0.0001227539,0.0002785909
0.74,-0.6094706742,0.2943479239,-0.6092274275,0.2944665303,-0.0002432468,-0.0001186065,0.0002706224
0.75,-0.6147232981,0.3029814579,-0.6144867211,0.3030960125,-0.000236577,-0.0001145546,0.0002628524
0.76,-0.6199119597,0.3116551825,-0.6196820148,0.3117657139,-0.0002299449,-0.0001105314,0.000255131
0.77,-0.6250377898,0.3203677618,-0.6248145897,0.3204742305,-0.0002232001,-0.0001064686,0.0002472931
0.78,-0.6301018811,0.329117921,-0.6298857007,0.3292202196,-0.0002161804,-0.0001022986,0.0002391631
0.79,-0.6351052931,0.3379044412,-0.6348965756,0.338002397,-0.0002087175,-9.79558e-05,0.0002305609
0.8,-0.6400490585,0.3467261551,-0.6398484159,0.3468195343,-0.0002006426,-9.33792e-05,0.0002213077
0.81,-0.6449341902,0.3555819421,-0.6447423966,0.355670456,-0.0001917936,-8.85139e-05,0.0002112333
0.82,-0.6497616893,0.3644707242,-0.6495796666,0.3645540371,-0.0001820228,-8.33129e-05,0.0002001832
0.83,-0.6545325533,0.3733914611,-0.6543613487,0.3734692005,-0.0001712046,-7.77394e-05,0.0001880277
0.84,-0.6592477852,0.3823431463,-0.6590885403,0.3824149149,-0.0001592449,-7.17686e-05,0.0001746702
0.85,-0.6639084035,0.3913248025,-0.6637623133,0.3913901925,-0.0001460902,-6.539e-05,0.0001600568
0.86,-0.668515452,0.4003354771,-0.668383715,0.4003940869,-0.0001317369,-5.86097e-05,0.0001441864
0.87,-0.6730700099,0.4093742377,-0.672953768,0.409425691,-0.0001162419,-5.14533e-05,0.0001271206
0.88,-0.6775732028,0.4184401667,-0.6774734709,0.4184841356,-9.97319e-05,-4.39688e-05,0.0001089941
0.89,-0.682026212,0.4275323565,-0.6819437987,0.4275685869,-8.24133e-05,-3.62304e-05,9.00255e-05
0.9,-0.6864302851,0.4366499029,-0.6863657033,0.4366782455,-6.45818e-05,-2.83426e-05,7.05274e-05
0.91,-0.6907867446,0.4457918989,-0.6907401139,0.4458123443,-4.66306e-05,-2.04454e-05,5.09159e-05
0.92,-0.6950969964,0.4549574266,-0.6950679375,0.4549701472,-2.90589e-05,-1.27207e-05,3.17212e-05
0.93,-0.6993625367,0.4641455489,-0.6993500594,0.4641509477,-1.24773e-05,-5.3988e-06,1.35952e-05
0.94,-0.7035849572,0.4733552992,-0.7035873437,0.4733540673,2.3865e-06,1.2319e-06,2.6857e-06
0.95,-0.7077659479,0.4825856695,-0.7077806337,0.4825788545,1.46858e-05,6.8149e-06,1.619e-05
0.96,-0.7119072982,0.4918355968,-0.7119307524,0.4918246833,2.34542e-05,1.09135e-05,2.5869e-05
0.97,-0.7160108939,0.5011039474,-0.7160385033,0.5010909522,2.76094e-05,1.29952e-05,3.05148e-05
0.98,-0.7200787108,0.5103894981,-0.7201046702,0.5103770829,2.59594e-05,1.24152e-05,2.87754e-05
0.99,-0.7241128047,0.5196909146,-0.7241300185,0.5196825194,1.72138e-05,8.3952e-06,1.91519e-05
1,-0.7281152949,0.5290067271,-0.7281152949,0.5290067271,-0,0,0
