xi,s1,s2
0,-1.40677476809323e-25,-1.65914241557657e-25
0.01,-0.00391439645396302,-0.00999626553204399
0.02,-0.00819572146288088,-0.0195572832198943
0.03,-0.0128163947109033,-0.0287312805797927
0.04,-0.0177491473047636,-0.0375640085688056
0.05,-0.0229670334136169,-0.0460987886462089
0.06,-0.0284434419088789,-0.0543765598348718
0.07,-0.0341521080040638,-0.0624359257826411
0.08,-0.0400671248946227,-0.0703132018237256
0.09,-0.0461629553977821,-0.0780424620400802
0.1,-0.0524144435923825,-0.0856555863227905
0.11,-0.058796826458716,-0.0931823074334567
0.12,-0.0652857455183656,-0.100650258065578
0.13,-0.0718572584740428,-0.108085017905937
0.14,-0.0784878508494263,-0.115510160695983
0.15,-0.0851544476290005,-0.122947301293218
0.16,-0.0918344248978932,-0.130416142732581
0.17,-0.0985056214817151,-0.137934523287828
0.18,-0.105146350586397,-0.145518463532923
0.19,-0.111735411438028,-0.153182213403417
0.2,-0.118252100922696,-0.160938299257835
0.21,-0.124676225226324,-0.168797570939058
0.22,-0.130988111474508,-0.17676924883571
0.23,-0.137168619372358,-0.18486097094354
0.24,-0.143199152844333,-0.193078839926808
0.25,-0.149061671674082,-0.201427470179667
0.26,-0.154738703144282,-0.209910034887551
0.27,-0.160213353676474,-0.218528313088553
0.28,-0.165469320470905,-0.227282736734818
0.29,-0.170490903146364,-0.236172437753919
0.3,-0.17526301538002,-0.245195295110245
0.31,-0.179771196547262,-0.254347981866387
0.32,-0.184001623361537,-0.263626012244518
0.33,-0.187941121514186,-0.273023788687781
0.34,-0.191577177314287,-0.282534648921671
0.35,-0.194897949328489,-0.292150913015419
0.36,-0.197892280020851,-0.301863930443379
0.37,-0.200549707392684,-0.31166412714641
0.38,-0.202860476622385,-0.321541052593261
0.39,-0.204815551705276,-0.331483426841955
0.4,-0.206406627093447,-0.341479187601172
0.41,-0.207626139335587,-0.351515537291636
0.42,-0.208467278716829,-0.361578990107497
0.43,-0.208924000898583,-0.371655419077718
0.44,-0.208991038558378,-0.381730103127454
0.45,-0.208663913029699,-0.391787774139442
0.46,-0.207938945941828,-0.401812664015384
0.47,-0.206813270859675,-0.411788551737326
0.48,-0.205284844923626,-0.421698810429051
0.49,-0.203352460489373,-0.431526454417455
0.5,-0.201015756767759,-0.441254186293938
0.51,-0.198275231464612,-0.450864443975782
0.52,-0.195132252420583,-0.460339447767542
0.53,-0.19158906925099,-0.469661247422423
0.54,-0.187648824985648,-0.478811769203671
0.55,-0.183315567708715,-0.487772862945953
0.56,-0.178594262198527,-0.496526349116741
0.57,-0.173490801567434,-0.505054065877701
0.58,-0.168012018901642,-0.513337916146072
0.59,-0.162165698901052,-0.521359914656052
0.6,-0.155960589519095,-0.529102235020183
0.61,-0.149406413602572,-0.536547256790736
0.62,-0.142513880531491,-0.543677612521092
0.63,-0.13529469785891,-0.550476234827129
0.64,-0.127761582950768,-0.556926403448607
0.65,-0.119928274625731,-0.563011792310548
0.66,-0.111809544795023,-0.568716516584627
0.67,-0.103421210102272,-0.574025179750548
0.68,-0.0947801435633414,-0.578922920657436
0.69,-0.0859042862061727,-0.583395460585217
0.7,-0.076812658710622,-0.587429150306002
0.71,-0.0675253730482991,-0.591011017145473
0.72,-0.0580636441224059,-0.594128812044268
0.73,-0.048449801407574,-0.596771056619362
0.74,-0.0387073005897039,-0.598927090225455
0.75,-0.0288607352058029,-0.600587117016353
0.76,-0.0189358482838235,-0.601742253006354
0.77,-0.00895954398250181,-0.602384573131631
0.78,0.00104010076880386,-0.602507158311621
0.79,0.0110338246302751,-0.602104142510402
0.8,0.0209911702117947,-0.601170759798081
0.81,0.0308804724331085,-0.599703391412179
0.82,0.0406688468839866,-0.597699612819014
0.83,0.0503221781843861,-0.595158240775086
0.84,0.0598051083446111,-0.592079380388461
0.85,0.0690810251254759,-0.588464472180153
0.86,0.0781120503984654,-0.584316339145512
0.87,0.0868590285058978,-0.579639233815608
0.88,0.0952815146210854,-0.57443888531861
0.89,0.103337763108497,-0.568722546441178
0.9,0.110984715883919,-0.562499040689841
0.91,0.118177990774616,-0.555778809352385
0.92,0.124871869879496,-0.548573958559234
0.93,0.131019287929268,-0.540898306344839
0.94,0.136571820646605,-0.532767429709057
0.95,0.141479673106308,-0.524198711678539
0.96,0.145691668095464,-0.515211388368112
0.97,0.149155234473608,-0.505826596042164
0.98,0.151816395532889,-0.496067418176031
0.99,0.153619757358226,-0.485958932517376
1,0.154508497187474,-0.475528258147577
