%!TEX root=../../../thesis.tex
%!TEX file=figures/wave-equation/statics/varying-wavespeed.tikz

\begin{tikzpicture}[%
    wave solution/.style={%
      % decoration={%
      %   markings,%
      %   mark=at position 0 with {%
      %     \arrow{Circle[open]};%
      %   },%
      %   mark=at position 1 with {%
      %     \arrow{Circle[open]};%
      %   },%
      % },%
      % % postaction={%
      % %   decorate%
      % % },%
    },%
    direct line/.style={%
      draw opacity=0.5,%
    },%s
  ]

\begin{axis}[%
  % Axes configuration
  line plot,%
  % cycle list name=black lines evenly marked,%
  % no markers,%
  % axis on top,%
  domain=0:1,%
  samples=100,%
  % X-axis
  xmin=0,%
  xmax=1,%
  xlabel={Path abscissae $\pathcoord / \parentheses{}$},%
  % Y-axis
  ymin=-1,%
  ymax=1,%
  ylabel={Pertubation $\wavepertubation \of{\pathcoord} / \si{\meter}$},%
  % Legend
  legend columns=3,%
  /tikz/every even column/.append style={%
    column sep=1.00ex,%
  },%
]

\pgfmathsetmacro\g{1};
\pgfmathsetmacro\gp{0};
\pgfmathsetmacro\gd{-0.2};

% Loop over a set of distal points
\foreach \c in {0.4,0.6,0.8,1.0,1.5,2.0}{
  \addplot+[wave solution] {\g / (2 * \c^2) * x^2 + (\gd - \gp - \g / ( 2 * \c^2 ) ) * x + \gp};
  \addlegendentryexpanded{$\bar{\wavespeed} = \c$};
  % \pgfplotsset{cycle list shift=-1}
  % \addplot+[direct line] table[col sep=comma, row sep=\\]{
  %   x, y\\
  %   0, \gp\\
  %   1, \gd\\
  % };
};

% Nodes for the decrase of c
\node[%
    coordinate,%
  ]%
  at (axis cs:0.5,0)%
  (source)%
  {};
\node[%
    coordinate,%
  ]%
  at (rel axis cs:0.5,0)%
  (destination)%
  {};

\end{axis}

% % Decrease of c
% \draw[%
%     ->,%
%     /phlpptmpl/thin,%
%   ]%
%   (source)%
%   -- (destination)%
%   node[%
%       pos=0.5,%
%       anchor=south,%
%       sloped,%
%       /phlpptmpl/tight padding,%
%       /phlpptmpl/tight margin,%
%     ]%
%     % {$c--$};
%     {$c \to 0$};

\end{tikzpicture}
