xi,sx,sy,cx,cy,ex,ey,ne
0,0,0,0,0,0,0,0
0.01,-0.0049500869,-0.0166665249,-0.0028956072,-0.0096986,-0.0020544797,-0.0069679249,0.0072644934
0.02,-0.0096942697,-0.0322255626,-0.0058263322,-0.0193851045,-0.0038679375,-0.0128404581,0.0134103804
0.03,-0.0142483433,-0.0468077254,-0.0087930072,-0.0290591179,-0.0054553361,-0.0177486075,0.0185680845
0.04,-0.0186287358,-0.0605301633,-0.0117964923,-0.0387202248,-0.0068322436,-0.0218099384,0.0228550425
0.05,-0.0228522084,-0.0734976914,-0.0148376772,-0.0483679892,-0.0080145311,-0.0251297022,0.0263767822
0.06,-0.0269355927,-0.0858038474,-0.0179174825,-0.0580019531,-0.0090181101,-0.0278018943,0.0292279257
0.07,-0.0308955662,-0.0975318791,-0.0210368607,-0.0676216349,-0.0098587055,-0.0299102442,0.0314931228
0.08,-0.0347484605,-0.108755667,-0.0241967977,-0.0772265284,-0.0105516628,-0.0315291386,0.0332479198
0.09,-0.0385101011,-0.1195405841,-0.0273983144,-0.0868161008,-0.0111117868,-0.0327244832,0.0345595661
0.1,-0.0421956766,-0.129944295,-0.030642468,-0.0963897915,-0.0115532086,-0.0335545035,0.0354877632
0.11,-0.0458196341,-0.1400174986,-0.0339303538,-0.1059470096,-0.0118892803,-0.034070489,0.03608536
0.12,-0.0493955995,-0.1498046151,-0.0372631067,-0.1154871325,-0.0121324929,-0.0343174826,0.0363989972
0.13,-0.05293632,-0.1593444217,-0.040641903,-0.1250095035,-0.012294417,-0.0343349182,0.0364697038
0.14,-0.0564536263,-0.1686706384,-0.0440679624,-0.1345134299,-0.0123856639,-0.0341572085,0.0363334496
0.15,-0.0599584138,-0.1778124665,-0.0475425496,-0.1439981801,-0.0124158642,-0.0338142864,0.0360216553
0.16,-0.0634606396,-0.1867950829,-0.0510669765,-0.153462981,-0.0123936631,-0.0333321019,0.0355616633
0.17,-0.0669693337,-0.1956400919,-0.0546426041,-0.1629070157,-0.0123267297,-0.0327330762,0.0349771717
0.18,-0.0704926239,-0.2043659369,-0.0582708449,-0.1723294198,-0.012221779,-0.0320365171,0.0342886324
0.19,-0.0740377702,-0.2129882745,-0.0619531652,-0.1817292783,-0.012084605,-0.0312589961,0.0335136169
0.2,-0.0776112095,-0.2215203127,-0.0656910871,-0.1911056223,-0.0119201223,-0.0304146904,0.0326671503
0.21,-0.0812186078,-0.2299731163,-0.0694861914,-0.2004574246,-0.0117324165,-0.0295156917,0.0317620159
0.22,-0.0848649191,-0.2383558804,-0.0733401196,-0.2097835958,-0.0115247995,-0.0285722845,0.0308090319
0.23,-0.0885544481,-0.2466761746,-0.0772545772,-0.21908298,-0.0112998709,-0.0275931946,0.0298173015
0.24,-0.0922909181,-0.25494016,-0.0812313359,-0.2283543492,-0.0110595822,-0.0265858108,0.0287944386
0.25,-0.0960775399,-0.2631527805,-0.0852722365,-0.2375963986,-0.0108053034,-0.0255563819,0.0277467698
0.26,-0.0999170826,-0.2713179307,-0.0893791921,-0.2468077406,-0.0105378905,-0.0245101901,0.0266795156
0.27,-0.1038119447,-0.2794386014,-0.0935541906,-0.2559868983,-0.0102577541,-0.0234517031,0.0255969509
0.28,-0.1077642236,-0.2875170053,-0.0977992981,-0.2651322991,-0.0099649255,-0.0223847062,0.0245025471
0.29,-0.1117757838,-0.2955546844,-0.1021166614,-0.2742422668,-0.0096591224,-0.0213124176,0.023399098
0.3,-0.1158483228,-0.3035525995,-0.1065085118,-0.2833150141,-0.0093398109,-0.0202375854,0.0222888297
0.31,-0.1199834325,-0.3115112059,-0.1109771676,-0.2923486335,-0.0090062649,-0.0191625723,0.0211734973
0.32,-0.1241826578,-0.3194305132,-0.115525037,-0.3013410879,-0.0086576207,-0.0180894252,0.0200544684
0.33,-0.1284475491,-0.3273101347,-0.1201546218,-0.3102902004,-0.0082929274,-0.0170199343,0.0189327971
0.34,-0.1327797109,-0.3351493241,-0.1248685191,-0.3191936429,-0.0079111918,-0.0159556812,0.0178092874
0.35,-0.1371808433,-0.3429470032,-0.129669425,-0.3280489242,-0.0075114184,-0.0148980791,0.0166845487
0.36,-0.1416527784,-0.350701781,-0.1345601361,-0.3368533766,-0.0070926423,-0.0138484044,0.015559045
0.37,-0.1461975097,-0.3584119649,-0.1395435521,-0.3456041418,-0.0066539577,-0.0128078231,0.0144331385
0.38,-0.1508172151,-0.3660755666,-0.144622677,-0.3542981553,-0.0061945381,-0.0117774114,0.0133071305
0.39,-0.1555142726,-0.3736903019,-0.1498006203,-0.3629321292,-0.0057136522,-0.0107581726,0.0121813013
0.4,-0.1602912697,-0.3812535869,-0.1550805975,-0.3715025349,-0.0052106723,-0.009751052,0.0110559541
0.41,-0.1651510055,-0.3887625312,-0.1604659287,-0.3800055825,-0.0046850768,-0.0087569487,0.00993147
0.42,-0.1700964857,-0.3962139282,-0.1659600381,-0.3884372002,-0.0041364476,-0.007776728,0.0088083879
0.43,-0.1751309117,-0.4036042443,-0.1715664499,-0.3967930113,-0.0035644617,-0.006811233,0.0076875407
0.44,-0.1802576621,-0.4109296077,-0.1772887846,-0.4050683099,-0.0029688774,-0.0058612978,0.0065703154
0.45,-0.1854802691,-0.4181857968,-0.1831307518,-0.4132580346,-0.0023495173,-0.0049277622,0.005459219
0.46,-0.1908023884,-0.4253682297,-0.1890961416,-0.4213567409,-0.0017062468,-0.0040114888,0.0043592798
0.47,-0.1962277642,-0.4324719545,-0.1951888133,-0.4293585713,-0.0010389509,-0.0031133832,0.00328216
0.48,-0.2017601888,-0.4394916425,-0.2014126801,-0.4372572251,-0.0003475088,-0.0022344173,0.0022612791
0.49,-0.2074034588,-0.4464215823,-0.2077716908,-0.4450459253,0.000368232,-0.001375657,0.0014240881
0.5,-0.2131613272,-0.4532556782,-0.2142698069,-0.4527173856,0.0011084797,-0.0005382927,0.0012322687
0.51,-0.2190374529,-0.459987451,-0.2209109742,-0.460263776,0.0018735213,0.000276325,0.0018937892
0.52,-0.2250353486,-0.4666100419,-0.2276990892,-0.4676766889,0.0026637406,0.001066647,0.002869364
0.53,-0.2311583274,-0.4731162212,-0.234637958,-0.4749471049,0.0034796307,0.0018308837,0.0039319162
0.54,-0.2374094492,-0.4794983999,-0.2417312489,-0.4820653606,0.0043217997,0.0025669607,0.0050266529
0.55,-0.2437914687,-0.4857486462,-0.2489824353,-0.4890211193,0.0051909666,0.0032724731,0.0061363845
0.56,-0.2503067841,-0.4918587048,-0.2563947306,-0.4958033452,0.0060879465,0.0039446403,0.0072541905
0.57,-0.2569573893,-0.4978200216,-0.2639710128,-0.5024002839,0.0070136235,0.0045802622,0.0083767366
0.58,-0.263744829,-0.503623771,-0.2717137387,-0.5087994513,0.0079689097,0.0051756803,0.0095021675
0.59,-0.2706701581,-0.5092608866,-0.2796248477,-0.5149876326,0.0089546896,0.0057267459,0.0106293031
0.6,-0.2777339061,-0.514722096,-0.2877056553,-0.5209508952,0.0099717492,0.0062287992,0.0117572837
0.61,-0.2849360473,-0.5199979571,-0.2959567362,-0.5266746187,0.0110206889,0.0066766616,0.0128853946
0.62,-0.2922759768,-0.5250788969,-0.3043777999,-0.5321435447,0.012101823,0.0070646477,0.0140129714
0.63,-0.2997524945,-0.5299552517,-0.3129675595,-0.5373418508,0.013215065,0.0073865991,0.0151393457
0.64,-0.3073637958,-0.5346173079,-0.3217235983,-0.5422532522,0.0143598024,0.0076359442,0.0162638117
0.65,-0.3151074711,-0.5390553427,-0.330642237,-0.5468611331,0.0155347659,0.0078057904,0.0173856066
0.66,-0.3229805138,-0.5432596635,-0.3397184095,-0.5511487114,0.0167378957,0.0078890478,0.0185038976
0.67,-0.3309793383,-0.5472206454,-0.3489455511,-0.5550992364,0.0179662128,0.007878591,0.0196177726
0.68,-0.3390998066,-0.5509287654,-0.3583155097,-0.55869622,0.0192157031,0.0077674547,0.0207262297
0.69,-0.3473372671,-0.5543746321,-0.3678184864,-0.5619236973,0.0204812194,0.0075490652,0.0218281638
0.7,-0.3556866018,-0.5575490099,-0.3774430144,-0.5647665116,0.0217564125,0.0072175017,0.0229223432
0.71,-0.3641422874,-0.560442836,-0.387175984,-0.5672106164,0.0230336966,0.0067677804,0.0240073746
0.72,-0.3726984653,-0.5630472287,-0.3970027203,-0.5692433815,0.0243042549,0.0061961528,0.025081649
0.73,-0.3813490257,-0.5653534857,-0.4069071151,-0.5708538916,0.0255580895,0.0055004058,0.0261432668
0.74,-0.3900877023,-0.5673530709,-0.4168718166,-0.5720332224,0.0267841143,0.0046801515,0.0271899356
0.75,-0.3989081809,-0.5690375869,-0.4268784699,-0.5727746783,0.027970289,0.0037370914,0.0282188398
0.76,-0.4078042195,-0.5703987331,-0.4369080029,-0.5730739785,0.0291037835,0.0026752454,0.0292264803
0.77,-0.4167697821,-0.5714282457,-0.4469409458,-0.5729293791,0.0301711637,0.0015011334,0.0302084843
0.78,-0.425799186,-0.5721178187,-0.4569577691,-0.5723417237,0.0311585831,0.000223905,0.0311593875
0.79,-0.4348872613,-0.5724590035,-0.4669392243,-0.571314419,0.032051963,-0.0011445846,0.0320723932
0.8,-0.4440295252,-0.572443085,-0.4768666723,-0.5698533368,0.0328371471,-0.0025897482,0.0329391109
0.81,-0.4532223687,-0.5720609309,-0.4867223815,-0.567966649,0.0335000128,-0.004094282,0.0337492816
0.82,-0.4624632578,-0.571302814,-0.496489786,-0.5656646063,0.0340265282,-0.0056382077,0.0344904916
0.83,-0.471750948,-0.5701582024,-0.5061536931,-0.5629592742,0.0344027452,-0.0071989282,0.0351478796
0.84,-0.4810857122,-0.5686155172,-0.5157004359,-0.5598642401,0.0346147237,-0.008751277,0.0357038366
0.85,-0.490469583,-0.5666618533,-0.5251179695,-0.5563943084,0.0346483865,-0.010267545,0.0361376973
0.86,-0.4999066077,-0.5642826626,-0.5343959135,-0.5525651954,0.0344893058,-0.0117174672,0.0364254205
0.87,-0.5094031172,-0.561461394,-0.5435255467,-0.548393238,0.0341224294,-0.0130681559,0.0365392513
0.88,-0.5189680088,-0.5581790898,-0.5524997596,-0.5438951232,0.0335317509,-0.0142839666,0.0364473596
0.89,-0.5286130407,-0.5544139345,-0.5613129754,-0.5390876462,0.0326999347,-0.0153262883,0.0361134441
0.9,-0.5383531415,-0.5501407519,-0.5699610449,-0.5339875012,0.0316079034,-0.0161532506,0.0354962965
0.91,-0.5482067309,-0.5453304492,-0.578441126,-0.5286111051,0.0302343951,-0.0167193441,0.0345493142
0.92,-0.5581960536,-0.5399494033,-0.5867515529,-0.5229744544,0.0285554994,-0.0169749489,0.0332199553
0.93,-0.5683475255,-0.5339587864,-0.594891703,-0.5170930139,0.0265441775,-0.0168657725,0.0314491278
0.94,-0.5786920921,-0.5273138274,-0.6028618639,-0.5109816333,0.0241697718,-0.0163321941,0.0291705062
0.95,-0.5892655976,-0.5199630058,-0.6106631064,-0.5046544893,0.0213975087,-0.0153085165,0.0263097711
0.96,-0.6001091666,-0.5118471735,-0.618297165,-0.4981250492,0.0181879984,-0.0137221242,0.0227837657
0.97,-0.6112695952,-0.5028986021,-0.6257663277,-0.4914060525,0.0144967324,-0.0114925495,0.0184995661
0.98,-0.6227997538,-0.4930399505,-0.6330733357,-0.4845095072,0.0102735819,-0.0085304433,0.0133534621
0.99,-0.6347589991,-0.4821831501,-0.6402212948,-0.4774466977,0.0054622957,-0.0047364524,0.0072298448
1,-0.6472135955,-0.4702282018,-0.6472135955,-0.4702282018,0,0,0
