xi,sx,sy,cx,cy,ex,ey,ne
0,-0,0,0,0,-0,0,0
0.01,-0.0094120946,-0.0310994046,-0.0028956072,-0.0096986,-0.0065164874,-0.0214008046,0.022370942
0.02,-0.0173590777,-0.0564884331,-0.0058263322,-0.0193851045,-0.0115327455,-0.0371033286,0.0388543589
0.03,-0.0242452465,-0.0777829797,-0.0087930072,-0.0290591179,-0.0154522393,-0.0487238618,0.0511154224
0.04,-0.0303598678,-0.0961230806,-0.0117964923,-0.0387202248,-0.0185633755,-0.0574028558,0.0603298165
0.05,-0.0359083066,-0.1123052457,-0.0148376772,-0.0483679892,-0.0210706294,-0.0639372564,0.0673197161
0.06,-0.041035565,-0.1268818655,-0.0179174825,-0.0580019531,-0.0231180825,-0.0688799124,0.0726559569
0.07,-0.0458438214,-0.1402346778,-0.0210368607,-0.0676216349,-0.0248069607,-0.0726130429,0.0767335605
0.08,-0.0504052915,-0.1526280939,-0.0241967977,-0.0772265284,-0.0262084938,-0.0754015656,0.0798265698
0.09,-0.054771499,-0.1642471459,-0.0273983144,-0.0868161008,-0.0273731846,-0.0774310451,0.0821270843
0.1,-0.0589798355,-0.1752239077,-0.030642468,-0.0963897915,-0.0283373675,-0.0788341163,0.0837724554
0.11,-0.0630581159,-0.1856554609,-0.0339303538,-0.1059470096,-0.0291277621,-0.0797084513,0.0848637952
0.12,-0.0670276814,-0.1956158058,-0.0372631067,-0.1154871325,-0.0297645747,-0.0801286733,0.0854782674
0.13,-0.070905475,-0.2051635593,-0.040641903,-0.1250095035,-0.0302635719,-0.0801540558,0.0856770474
0.14,-0.0747054104,-0.2143468122,-0.0440679624,-0.1345134299,-0.0306374479,-0.0798333822,0.0855103627
0.15,-0.0784392665,-0.2232061402,-0.0475425496,-0.1439981801,-0.0308967168,-0.0792079602,0.0850206332
0.16,-0.0821172737,-0.2317764668,-0.0510669765,-0.153462981,-0.0310502972,-0.0783134858,0.0842444242
0.17,-0.0857485035,-0.240088238,-0.0546426041,-0.1629070157,-0.0311058994,-0.0771812223,0.0832136891
0.18,-0.089341135,-0.2481682046,-0.0582708449,-0.1723294198,-0.0310702901,-0.0758387849,0.0819565996
0.19,-0.0929026425,-0.2560399823,-0.0619531652,-0.1817292783,-0.0309494773,-0.074310704,0.0804981421
0.2,-0.0964399315,-0.2637244822,-0.0656910871,-0.1911056223,-0.0307488443,-0.0726188599,0.0788605747
0.21,-0.0999594373,-0.2712402586,-0.0694861914,-0.2004574246,-0.030473246,-0.0707828341,0.0770637938
0.22,-0.1034671971,-0.278603796,-0.0733401196,-0.2097835958,-0.0301270775,-0.0688202002,0.0751256331
0.23,-0.1069688999,-0.2858297475,-0.0772545772,-0.21908298,-0.0297143227,-0.0667467675,0.0730621102
0.24,-0.1104699216,-0.2929311345,-0.0812313359,-0.2283543492,-0.0292385857,-0.0645767853,0.07088763
0.25,-0.1139753485,-0.2999195157,-0.0852722365,-0.2375963986,-0.028703112,-0.0623231171,0.0686151555
0.26,-0.1174899927,-0.3068051313,-0.0893791921,-0.2468077406,-0.0281108006,-0.0599973907,0.0662563506
0.27,-0.1210184029,-0.3135970265,-0.0935541906,-0.2559868983,-0.0274642122,-0.0576101282,0.0638217034
0.28,-0.1245648719,-0.3203031609,-0.0977992981,-0.2651322991,-0.0267655739,-0.0551708618,0.0613206322
0.29,-0.1281334444,-0.3269305034,-0.1021166614,-0.2742422668,-0.026016783,-0.0526882366,0.0587615799
0.3,-0.1317279234,-0.3334851186,-0.1065085118,-0.2833150141,-0.0252194115,-0.0501701045,0.0561520979
0.31,-0.1353518789,-0.3399722435,-0.1109771676,-0.2923486335,-0.0243747113,-0.04762361,0.0534989231
0.32,-0.1390086581,-0.3463963573,-0.115525037,-0.3013410879,-0.023483621,-0.0450552693,0.0508080481
0.33,-0.1427013969,-0.352761245,-0.1201546218,-0.3102902004,-0.0225467751,-0.0424710446,0.0480847865
0.34,-0.1464330337,-0.3590700553,-0.1248685191,-0.3191936429,-0.0215645146,-0.0398764125,0.0453338346
0.35,-0.1502063252,-0.3653253532,-0.129669425,-0.3280489242,-0.0205369002,-0.037276429,0.0425593284
0.36,-0.1540238625,-0.371529167,-0.1345601361,-0.3368533766,-0.0194637264,-0.0346757904,0.0397648977
0.37,-0.1578880896,-0.3776830317,-0.1395435521,-0.3456041418,-0.0183445376,-0.0320788899,0.0369537175
0.38,-0.1618013215,-0.383788027,-0.144622677,-0.3542981553,-0.0171786445,-0.0294898718,0.0341285564
0.39,-0.1657657624,-0.3898448112,-0.1498006203,-0.3629321292,-0.015965142,-0.026912682,0.0312918234
0.4,-0.169783524,-0.3958536516,-0.1550805975,-0.3715025349,-0.0147029266,-0.0243511167,0.0284456136
0.41,-0.1738566429,-0.4018144507,-0.1604659287,-0.3800055825,-0.0133907141,-0.0218088682,0.0255917556
0.42,-0.177987096,-0.4077267697,-0.1659600381,-0.3884372002,-0.012027058,-0.0192895695,0.0227318634
0.43,-0.1821768158,-0.4135898493,-0.1715664499,-0.3967930113,-0.0106103659,-0.016796838,0.0198674013
0.44,-0.1864277025,-0.4194026284,-0.1772887846,-0.4050683099,-0.0091389178,-0.0143343185,0.0169997796
0.45,-0.1907416347,-0.4251637605,-0.1831307518,-0.4132580346,-0.0076108829,-0.0119057258,0.0141305289
0.46,-0.1951204788,-0.43087163,-0.1890961416,-0.4213567409,-0.0060243371,-0.0095148892,0.0112616941
0.47,-0.1995660951,-0.4365243672,-0.1951888133,-0.4293585713,-0.0043772818,-0.0071657959,0.0083969772
0.48,-0.2040803431,-0.4421198626,-0.2014126801,-0.4372572251,-0.002667663,-0.0048626375,0.0055463203
0.49,-0.2086650845,-0.4476557818,-0.2077716908,-0.4450459253,-0.0008933937,-0.0026098565,0.0027585328
0.5,-0.2133221852,-0.4531295802,-0.2142698069,-0.4527173856,0.0009476217,-0.0004121946,0.0010333883
0.51,-0.2180535156,-0.4585385173,-0.2209109742,-0.460263776,0.0028574586,0.0017252587,0.0033379017
0.52,-0.2228609516,-0.4638796724,-0.2276990892,-0.4676766889,0.0048381376,0.0037970166,0.0061501959
0.53,-0.2277463741,-0.4691499587,-0.234637958,-0.4749471049,0.0068915839,0.0057971461,0.0090056
0.54,-0.23271167,-0.4743461386,-0.2417312489,-0.4820653606,0.0090195789,0.007719222,0.0118717813
0.55,-0.2377587337,-0.4794648368,-0.2489824353,-0.4890211193,0.0112237016,0.0095562825,0.0147408959
0.56,-0.2428894706,-0.4845025539,-0.2563947306,-0.4958033452,0.01350526,0.0113007913,0.0176096545
0.57,-0.248105803,-0.4894556765,-0.2639710128,-0.5024002839,0.0158652098,0.0129446074,0.0204760285
0.58,-0.2534096783,-0.4943204866,-0.2717137387,-0.5087994513,0.0183040604,0.0144789647,0.0233383599
0.59,-0.2588030816,-0.4990931668,-0.2796248477,-0.5149876326,0.0208217661,0.0158944657,0.0261950374
0.6,-0.2642880511,-0.5037698022,-0.2877056553,-0.5209508952,0.0234176042,0.017181093,0.0290443478
0.61,-0.2698666987,-0.5083463772,-0.2959567362,-0.5266746187,0.0260900375,0.0183282415,0.0318843926
0.62,-0.2755412343,-0.5128187683,-0.3043777999,-0.5321435447,0.0288365655,0.0193247763,0.0347130306
0.63,-0.2813139957,-0.5171827294,-0.3129675595,-0.5373418508,0.0316535638,0.0201591214,0.0375278334
0.64,-0.2871874815,-0.5214338714,-0.3217235983,-0.5422532522,0.0345361168,0.0208193808,0.0403260459
0.65,-0.2931643897,-0.5255676349,-0.330642237,-0.5468611331,0.0374778474,0.0212934982,0.0431045486
0.66,-0.2992476584,-0.5295792551,-0.3397184095,-0.5511487114,0.0404707511,0.0215694563,0.0458598206
0.67,-0.3054405102,-0.5334637191,-0.3489455511,-0.5550992364,0.0435050409,0.0216355173,0.0485879017
0.68,-0.3117464977,-0.5372157161,-0.3583155097,-0.55869622,0.0465690121,0.0214805039,0.0512843537
0.69,-0.31816955,-0.5408295787,-0.3678184864,-0.5619236973,0.0496489365,0.0210941186,0.0539442187
0.7,-0.3247140179,-0.5442992176,-0.3774430144,-0.5647665116,0.0527289965,0.020467294,0.0565619766
0.71,-0.3313847176,-0.5476180483,-0.387175984,-0.5672106164,0.0557912664,0.0195925681,0.0591314986
0.72,-0.3381869712,-0.5507789097,-0.3970027203,-0.5692433815,0.0588157491,0.0184644717,0.0616459979
0.73,-0.3451266418,-0.5537739758,-0.4069071151,-0.5708538916,0.0617804733,0.0170799158,0.0640979751
0.74,-0.3522101654,-0.5565946582,-0.4168718166,-0.5720332224,0.0646616513,0.0154385642,0.0664791577
0.75,-0.3594445755,-0.5592315009,-0.4268784699,-0.5727746783,0.0674338945,0.0135431775,0.0687804316
0.76,-0.366837524,-0.5616740641,-0.4369080029,-0.5730739785,0.0700704789,0.0113999144,0.0709917605
0.77,-0.3743972977,-0.5639107975,-0.4469409458,-0.5729293791,0.0725436481,0.0090185816,0.0731020909
0.78,-0.3821328324,-0.5659288985,-0.4569577691,-0.5723417237,0.0748249367,0.0064128252,0.0750992375
0.79,-0.3900537289,-0.5677141539,-0.4669392243,-0.571314419,0.0768854955,0.0036002651,0.0769697429
0.8,-0.398170275,-0.5692507596,-0.4768666723,-0.5698533368,0.0786963973,0.0006025772,0.0786987043
0.81,-0.4064934796,-0.5705211131,-0.4867223815,-0.567966649,0.0802289019,-0.0025544641,0.0802695583
0.82,-0.4150351277,-0.5715055724,-0.496489786,-0.5656646063,0.0814546583,-0.0058409661,0.0816638123
0.83,-0.4238078661,-0.5721821713,-0.5061536931,-0.5629592742,0.0823458271,-0.0092228971,0.0828607088
0.84,-0.4328253349,-0.5725262807,-0.5157004359,-0.5598642401,0.082875101,-0.0126620406,0.0838368036
0.85,-0.4421023647,-0.5725101952,-0.5251179695,-0.5563943084,0.0830156048,-0.0161158869,0.084565433
0.86,-0.4516552734,-0.572102605,-0.5343959135,-0.5525651954,0.0827406401,-0.0195374096,0.0850160215
0.87,-0.461502327,-0.5712678753,-0.5435255467,-0.548393238,0.0820232196,-0.0228746373,0.085153142
0.88,-0.4716644674,-0.5699649902,-0.5524997596,-0.5438951232,0.0808352923,-0.026069867,0.0849351661
0.89,-0.4821664795,-0.568145917,-0.5613129754,-0.5390876462,0.0791464959,-0.0290582708,0.0843122228
0.9,-0.4930388625,-0.5657530117,-0.5699610449,-0.5339875012,0.0769221825,-0.0317655105,0.0832230125
0.91,-0.5043207917,-0.5627148912,-0.578441126,-0.5286111051,0.0741203343,-0.0341037861,0.0815897799
0.92,-0.5160647219,-0.5589399586,-0.5867515529,-0.5229744544,0.070686831,-0.0359655042,0.079310438
0.93,-0.5283433815,-0.5543064548,-0.594891703,-0.5170930139,0.0665483215,-0.0372134409,0.0762464378
0.94,-0.5412601568,-0.5486475321,-0.6028618639,-0.5109816333,0.0616017071,-0.0376658988,0.0722045029
0.95,-0.5549641639,-0.5417293856,-0.6106631064,-0.5046544893,0.0556989424,-0.0370748963,0.066909791
0.96,-0.5696716606,-0.533219935,-0.618297165,-0.4981250492,0.0486255044,-0.0350948858,0.0599674135
0.97,-0.5856958643,-0.5226449084,-0.6257663277,-0.4914060525,0.0400704633,-0.0312388559,0.0508085441
0.98,-0.6034877248,-0.5093274443,-0.6330733357,-0.4845095072,0.0295856109,-0.0248179371,0.0386165557
0.99,-0.6236907481,-0.4923064758,-0.6402212948,-0.4774466977,0.0165305467,-0.0148597782,0.02222773
1,-0.6472135955,-0.4702282018,-0.6472135955,-0.4702282018,0,0,0
