xi,s1,s2
0,2.52797621187315e-26,1.93315768834369e-26
0.01,0.000262844317151048,-0.023049391503929
0.02,0.000674915722082254,-0.0439268519646006
0.03,0.00115429970484304,-0.0629308326874535
0.04,0.00164434467711405,-0.0803230937630333
0.05,0.00210852870381818,-0.0963324666660879
0.06,0.00252602147089154,-0.111158320687454
0.07,0.00288788326858227,-0.124973748983444
0.08,0.00319384509824873,-0.13792848959971
0.09,0.00344961633923117,-0.15015159639882
0.1,0.00366466874097464,-0.161753874393067
0.11,0.00385044783418355,-0.172830093556273
0.12,0.00401896518339185,-0.183460994760641
0.13,0.00418172723193552,-0.19371510105695
0.14,0.00434895881891763,-0.203650347088687
0.15,0.00452908177635886,-0.213315539002941
0.16,0.00472841134332999,-0.222751656793175
0.17,0.00495103546246562,-0.231993010581254
0.18,0.00519884435286175,-0.241068261918362
0.19,0.00547168008196277,-0.250001320756727
0.2,0.00576757818764687,-0.258812128316325
0.21,0.00608307573032145,-0.267517335643001
0.22,0.00641356248344401,-0.276130887226725
0.23,0.00675365429948635,-0.284664518620947
0.24,0.00709757001696346,-0.293128176576308
0.25,0.00743949560275182,-0.301530369774198
0.26,0.0077739215525242,-0.309878457817955
0.27,0.00809594190073205,-0.318178885711732
0.28,0.00840150552016917,-0.326437370629351
0.29,0.00868761271975354,-0.334659047347713
0.3,0.00895245247776753,-0.342848578291616
0.31,0.00919547797639952,-0.351010233709072
0.32,0.00941742043203355,-0.359147947068525
0.33,0.00962024354433614,-0.367265350341585
0.34,0.00980704321579009,-0.375365793407208
0.35,0.0099818995173601,-0.383452351385682
0.36,0.0101496900440105,-0.391527823289875
0.37,0.0103158750619242,-0.399594724998943
0.38,0.0104862647231331,-0.407655279236202
0.39,0.0106667779037768,-0.41571140493462
0.4,0.0108632014418815,-0.42376470807768
0.41,0.0110809577694555,-0.431816475807717
0.42,0.0113248881526024,-0.439867675298175
0.43,0.0115990579722556,-0.447918958590585
0.44,0.011906589697045,-0.455970674301379
0.45,0.0122495284187088,-0.464022886808053
0.46,0.0126287440393688,-0.47207540322847
0.47,0.0130438734188906,-0.480127808211513
0.48,0.0134933050094574,-0.488179506261564
0.49,0.013974207723386,-0.49622977102371
0.5,0.0144826049991234,-0.504277800660849
0.51,0.015013494249261,-0.512322778158269
0.52,0.0155610110933122,-0.52036393509559
0.53,0.016118636996902,-0.528400617130301
0.54,0.0166794481579207,-0.536432349141498
0.55,0.0172364026990989,-0.544458897686728
0.56,0.0177826624453667,-0.552480328129246
0.57,0.018311944783262,-0.560497053497273
0.58,0.0188188993185572,-0.568509871841246
0.59,0.0192995032671822,-0.576519988559361
0.6,0.0197514687334187,-0.584529019866061
0.61,0.0201746542482523,-0.592538973282478
0.62,0.020571472159669,-0.600552200732166
0.63,0.0209472826855873,-0.608571319529828
0.64,0.0213107646590241,-0.616599096255053
0.65,0.0216742522139942,-0.624638288207464
0.66,0.0220540258795479,-0.632691436843984
0.67,0.0224705457682581,-0.640760607303311
0.68,0.022948613764939,-0.648847067827906
0.69,0.0235174508859063,-0.656950902671592
0.7,0.0242106756830035,-0.665070552565346
0.71,0.0250661702956348,-0.673202278947506
0.72,0.0261258221568682,-0.681339551382034
0.73,0.0274351308780207,-0.689472360991839
0.74,0.0290426713578661,-0.697586466142913
0.75,0.0309994056843361,-0.705662580023775
0.76,0.0333578379183169,-0.713675513173513
0.77,0.0361710073708724,-0.721593287420441
0.78,0.0394913175069564,-0.729376241102174
0.79,0.0433691991304086,-0.736976148846684
0.8,0.0478516080267553,-0.744335382602639
0.81,0.0529803587620712,-0.751386144016121
0.82,0.0587902978578863,-0.758049801659554
0.83,0.0653073210838527,-0.76423637002745
0.84,0.0725462411316169,-0.769844170622333
0.85,0.0805085134550754,-0.774759718862981
0.86,0.0891798295839186,-0.77885788395585
0.87,0.0985275887391017,-0.782002372279351
0.88,0.10849826010061,-0.784046588239384
0.89,0.119014649599615,-0.784834929963299
0.9,0.129973086628858,-0.784204580608218
0.91,0.141240547586808,-0.781987859468421
0.92,0.152651734692897,-0.778015200475248
0.93,0.164006130032842,-0.772118829091734
0.94,0.175065046314816,-0.764137212012964
0.95,0.185548697338941,-0.753920357491887
0.96,0.195133312704318,-0.741336047519094
0.97,0.203448322799536,-0.726277086493823
0.98,0.21007364164434,-0.708669654432221
0.99,0.214537076671847,-0.688482856167654
1,0.216311896062463,-0.665739561406608
