xi,sx,sy,cx,cy,ex,ey,ne
0,0,-0,0,0,0,-0,0
0.01,0.0189457468,-0.0064552858,0.0096130487,-0.0034810041,0.0093326981,-0.0029742817,0.0097951828
0.02,0.03709974,-0.0124936667,0.0192479707,-0.0068994454,0.0178517693,-0.0055942214,0.0187077786
0.03,0.0545013516,-0.0181369586,0.0289044685,-0.0102549005,0.0255968831,-0.0078820582,0.026782966
0.04,0.0711888567,-0.0234063213,0.0385822367,-0.0135469498,0.03260662,-0.0098593715,0.0340646279
0.05,0.0871994337,-0.0283222584,0.0482809625,-0.0167751781,0.0389184712,-0.0115470803,0.0405953503
0.06,0.1025691639,-0.0329046177,0.0580003256,-0.0199391744,0.0445688383,-0.0129654433,0.0464164202
0.07,0.1173330319,-0.0371725907,0.0677399981,-0.0230385325,0.0495930338,-0.0141340581,0.0515678252
0.08,0.1315249255,-0.0411447128,0.0774996448,-0.026072851,0.0540252807,-0.0150718618,0.0560882517
0.09,0.1451776355,-0.0448388636,0.0872789228,-0.0290417336,0.0578987126,-0.01579713,0.0600150835
0.1,0.1583228558,-0.0482722664,0.097077482,-0.0319447893,0.0612453737,-0.0163274771,0.0633844012
0.11,0.1709911836,-0.0514614885,0.106894965,-0.0347816327,0.0640962186,-0.0166798558,0.0662309809
0.12,0.1832121192,-0.0544224411,0.1167310068,-0.0375518843,0.0664811124,-0.0168705568,0.0685882934
0.13,0.1950140659,-0.0571703794,0.1265852356,-0.0402551704,0.0684288304,-0.016915209,0.0704885035
0.14,0.2064243304,-0.0597199023,0.136457272,-0.0428911237,0.0699670584,-0.0168287786,0.0719624698
0.15,0.2174691223,-0.062084953,0.1463467299,-0.0454593833,0.0711223924,-0.0166255697,0.0730397444
0.16,0.2281735543,-0.0642788184,0.1562532159,-0.0479595952,0.0719203384,-0.0163192232,0.0737485737
0.17,0.2385616426,-0.0663141292,0.16617633,-0.0503914121,0.0723853125,-0.0159227171,0.0741158984
0.18,0.2486563061,-0.0682028604,0.1761156652,-0.052754494,0.0725406409,-0.0154483664,0.0741673554
0.19,0.2584793671,-0.0699563306,0.1860708077,-0.0550485081,0.0724085595,-0.0149078224,0.0739272795
0.2,0.2680515511,-0.0715852024,0.1960413372,-0.0572731296,0.0720102138,-0.0143120728,0.0734187055
0.21,0.2773924864,-0.0730994825,0.2060268272,-0.0594280412,0.0713656592,-0.0136714413,0.072663372
0.22,0.2865207049,-0.0745085213,0.2160268444,-0.0615129336,0.0704938605,-0.0129955877,0.0716817248
0.23,0.2954536412,-0.0758210133,0.2260409496,-0.0635275061,0.0694126916,-0.0122935073,0.0704929222
0.24,0.3042076333,-0.0770449968,0.2360686973,-0.065471466,0.0681389361,-0.0115735308,0.0691148408
0.25,0.3127979224,-0.0781878542,0.2461096363,-0.0673445297,0.0666882861,-0.0108433245,0.0675640821
0.26,0.3212386525,-0.0792563115,0.2561633095,-0.0691464222,0.065075343,-0.0101098893,0.0658559802
0.27,0.3295428711,-0.0802564391,0.2662292542,-0.0708768777,0.063313617,-0.0093795614,0.0640046113
0.28,0.3377225287,-0.0811936508,0.2763070022,-0.0725356395,0.0614155265,-0.0086580113,0.0620228027
0.29,0.3457884789,-0.0820727049,0.2863960802,-0.0741224605,0.0593923987,-0.0079502443,0.0599221445
0.3,0.3537504785,-0.0828977031,0.2964960096,-0.0756371033,0.0572544688,-0.0072605998,0.0577130012
0.31,0.3616171873,-0.0836720913,0.3066063071,-0.07707934,0.0550108802,-0.0065927513,0.0554045243
0.32,0.3693961685,-0.0843986593,0.3167264844,-0.078448953,0.0526696841,-0.0059497064,0.0530046661
0.33,0.3770938882,-0.0850795409,0.3268560489,-0.0797457345,0.0502378393,-0.0053338064,0.0505201938
0.34,0.3847157248,-0.0857162186,0.3369945037,-0.0809694874,0.0477212211,-0.0047467312,0.0479567138
0.35,0.3922662764,-0.0863096921,0.3471413477,-0.0821200246,0.0451249287,-0.0041896676,0.0453190082
0.36,0.3997499987,-0.0868608276,0.3572960758,-0.0831971699,0.0424539229,-0.0036636577,0.0426117115
0.37,0.407171347,-0.0873704348,0.3674581794,-0.0842007577,0.0397131676,-0.0031696771,0.0398394595
0.38,0.4145347767,-0.0878392679,0.3776271465,-0.0851306333,0.0369076302,-0.0027086346,0.0370068895
0.39,0.4218447431,-0.088268025,0.3878024617,-0.0859866528,0.0340422813,-0.0022813721,0.0341186397
0.4,0.4291057013,-0.0886573484,0.3979836067,-0.0867686837,0.0311220946,-0.0018886647,0.0311793494
0.41,0.4363221067,-0.0890078247,0.4081700603,-0.0874766044,0.0281520464,-0.0015312203,0.028193658
0.42,0.4434984146,-0.0893199844,0.4183612989,-0.0881103046,0.0251371156,-0.0012096798,0.0251662057
0.43,0.4506390802,-0.0895943024,0.4285567968,-0.0886696856,0.0220822834,-0.0009246168,0.0221016325
0.44,0.4577485588,-0.0898311975,0.4387560258,-0.0891546598,0.018992533,-0.0006765377,0.0190045787
0.45,0.4648313058,-0.0900310328,0.4489584565,-0.0895651515,0.0158728493,-0.0004658813,0.0158796848
0.46,0.4718917763,-0.0901941155,0.4591635574,-0.0899010962,0.0127282189,-0.0002930193,0.0127315913
0.47,0.4789344257,-0.0903206969,0.4693707961,-0.0901624412,0.0095636296,-0.0001582557,0.0095649389
0.48,0.4859637093,-0.0904109726,0.4795796391,-0.0903491456,0.0063840702,-6.1827e-05,0.0063843695
0.49,0.4929840823,-0.0904650822,0.489789552,-0.09046118,0.0031945303,-3.9022e-06,0.0031945327
0.5,0.5,-0.0904831094,0.5,-0.0904985267,0,1.54174e-05,1.54174e-05
0.51,0.5070159177,-0.0904650822,0.510210448,-0.09046118,-0.0031945303,-3.9022e-06,0.0031945326
0.52,0.5140362907,-0.0904109726,0.5204203609,-0.0903491456,-0.0063840702,-6.1827e-05,0.0063843695
0.53,0.5210655743,-0.0903206969,0.5306292038,-0.0901624412,-0.0095636296,-0.0001582557,0.0095649388
0.54,0.5281082237,-0.0901941155,0.5408364426,-0.0899010962,-0.0127282189,-0.0002930193,0.0127315913
0.55,0.5351686942,-0.0900310328,0.5510415435,-0.0895651515,-0.0158728493,-0.0004658813,0.0158796848
0.56,0.5422514412,-0.0898311975,0.5612439741,-0.0891546598,-0.018992533,-0.0006765377,0.0190045787
0.57,0.5493609198,-0.0895943024,0.5714432032,-0.0886696856,-0.0220822834,-0.0009246168,0.0221016324
0.58,0.5565015854,-0.0893199844,0.5816387011,-0.0881103046,-0.0251371156,-0.0012096798,0.0251662057
0.59,0.5636778933,-0.0890078247,0.5918299397,-0.0874766044,-0.0281520464,-0.0015312203,0.028193658
0.6,0.5708942987,-0.0886573484,0.6020163933,-0.0867686837,-0.0311220946,-0.0018886647,0.0311793494
0.61,0.5781552569,-0.088268025,0.6121975383,-0.0859866528,-0.0340422813,-0.0022813721,0.0341186397
0.62,0.5854652233,-0.0878392679,0.6223728535,-0.0851306333,-0.0369076302,-0.0027086346,0.0370068895
0.63,0.592828653,-0.0873704348,0.6325418205,-0.0842007577,-0.0397131676,-0.0031696771,0.0398394595
0.64,0.6002500013,-0.0868608276,0.6427039242,-0.0831971699,-0.0424539229,-0.0036636577,0.0426117115
0.65,0.6077337236,-0.0863096921,0.6528586523,-0.0821200246,-0.0451249287,-0.0041896676,0.0453190082
0.66,0.6152842752,-0.0857162186,0.6630054963,-0.0809694874,-0.0477212211,-0.0047467312,0.0479567138
0.67,0.6229061118,-0.0850795409,0.6731439511,-0.0797457345,-0.0502378393,-0.0053338064,0.0505201938
0.68,0.6306038315,-0.0843986593,0.6832735156,-0.078448953,-0.0526696841,-0.0059497064,0.0530046661
0.69,0.6383828127,-0.0836720913,0.6933936929,-0.07707934,-0.0550108802,-0.0065927513,0.0554045243
0.7,0.6462495215,-0.0828977031,0.7035039903,-0.0756371033,-0.0572544688,-0.0072605998,0.0577130012
0.71,0.6542115211,-0.0820727049,0.7136039198,-0.0741224605,-0.0593923987,-0.0079502443,0.0599221445
0.72,0.6622774713,-0.0811936508,0.7236929978,-0.0725356395,-0.0614155265,-0.0086580113,0.0620228027
0.73,0.6704571289,-0.0802564391,0.7337707458,-0.0708768777,-0.0633136169,-0.0093795614,0.0640046113
0.74,0.6787613475,-0.0792563115,0.7438366905,-0.0691464222,-0.065075343,-0.0101098893,0.0658559802
0.75,0.6872020776,-0.0781878542,0.7538903637,-0.0673445297,-0.0666882861,-0.0108433245,0.0675640821
0.76,0.6957923667,-0.0770449968,0.7639313027,-0.065471466,-0.068138936,-0.0115735308,0.0691148408
0.77,0.7045463588,-0.0758210133,0.7739590504,-0.0635275061,-0.0694126916,-0.0122935073,0.0704929222
0.78,0.7134792951,-0.0745085213,0.7839731556,-0.0615129336,-0.0704938605,-0.0129955877,0.0716817248
0.79,0.7226075136,-0.0730994825,0.7939731728,-0.0594280412,-0.0713656592,-0.0136714413,0.072663372
0.8,0.7319484489,-0.0715852024,0.8039586627,-0.0572731296,-0.0720102138,-0.0143120728,0.0734187055
0.81,0.7415206329,-0.0699563306,0.8139291923,-0.0550485081,-0.0724085595,-0.0149078224,0.0739272795
0.82,0.7513436939,-0.0682028604,0.8238843348,-0.052754494,-0.0725406409,-0.0154483664,0.0741673554
0.83,0.7614383574,-0.0663141292,0.83382367,-0.0503914121,-0.0723853125,-0.0159227171,0.0741158984
0.84,0.7718264457,-0.0642788184,0.843746784,-0.0479595952,-0.0719203384,-0.0163192232,0.0737485736
0.85,0.7825308777,-0.062084953,0.8536532701,-0.0454593833,-0.0711223924,-0.0166255697,0.0730397444
0.86,0.7935756696,-0.0597199023,0.863542728,-0.0428911237,-0.0699670584,-0.0168287786,0.0719624697
0.87,0.8049859341,-0.0571703794,0.8734147644,-0.0402551704,-0.0684288304,-0.016915209,0.0704885035
0.88,0.8167878808,-0.0544224411,0.8832689932,-0.0375518843,-0.0664811124,-0.0168705568,0.0685882934
0.89,0.8290088164,-0.0514614885,0.893105035,-0.0347816327,-0.0640962186,-0.0166798558,0.0662309809
0.9,0.8416771442,-0.0482722664,0.9029225179,-0.0319447893,-0.0612453737,-0.0163274771,0.0633844012
0.91,0.8548223645,-0.0448388636,0.9127210772,-0.0290417336,-0.0578987126,-0.01579713,0.0600150835
0.92,0.8684750745,-0.0411447128,0.9225003552,-0.026072851,-0.0540252807,-0.0150718618,0.0560882517
0.93,0.8826669681,-0.0371725907,0.9322600019,-0.0230385325,-0.0495930338,-0.0141340581,0.0515678252
0.94,0.8974308361,-0.0329046177,0.9419996744,-0.0199391744,-0.0445688383,-0.0129654433,0.0464164202
0.95,0.9128005663,-0.0283222584,0.9517190375,-0.0167751781,-0.0389184712,-0.0115470803,0.0405953503
0.96,0.9288111433,-0.0234063213,0.9614177633,-0.0135469498,-0.03260662,-0.0098593715,0.0340646279
0.97,0.9454986484,-0.0181369586,0.9710955315,-0.0102549005,-0.0255968831,-0.0078820582,0.026782966
0.98,0.96290026,-0.0124936667,0.9807520293,-0.0068994454,-0.0178517693,-0.0055942214,0.0187077786
0.99,0.9810542532,-0.0064552858,0.9903869513,-0.0034810041,-0.0093326981,-0.0029742817,0.0097951828
1,1,-0,1,0,0,-0,0
