xi,s1,s2
0,9.01877162253382e-26,-3.58522582603686e-25
0.01,0.000238696065316523,-0.0175672468640596
0.02,0.000534336849827747,-0.03378167613642
0.03,0.000842544780331121,-0.0488216611527021
0.04,0.00113729048838042,-0.0628504270975514
0.05,0.00140581705450992,-0.0760157124915295
0.06,0.00164455671746592,-0.0884498303751287
0.07,0.00185590289223226,-0.10027005123996
0.08,0.00204571323119811,-0.111579238491886
0.09,0.00222143160659917,-0.122466675389955
0.1,0.00239072830971767,-0.133009030005985
0.11,0.00256056847360167,-0.143271411810087
0.12,0.00273662875161014,-0.153308480024872
0.13,0.00292299164425671,-0.163165569923072
0.14,0.0031220555819617,-0.172879808787391
0.15,0.00333460696177852,-0.182481198325113
0.16,0.00356000782228737,-0.191993644950926
0.17,0.00379645974299456,-0.201435923537
0.18,0.00404131089309153,-0.210822563997324
0.19,0.00429137894966161,-0.220164653440982
0.2,0.00454326787772538,-0.229470549614162
0.21,0.00479366133423762,-0.238746503970697
0.22,0.00503957974563791,-0.247997194983371
0.23,0.00527859193416538,-0.257226174250721
0.24,0.00550897555222349,-0.266436229584031
0.25,0.00572982354697381,-0.275629670594357
0.26,0.00594109643939854,-0.284808543357138
0.27,0.00614362238364867,-0.293974781529881
0.28,0.00633904879393934,-0.303130301854073
0.29,0.00652975080791462,-0.312277052303402
0.3,0.00671870301763112,-0.321417021264124
0.31,0.00690932176245328,-0.330552216067537
0.32,0.00710528586256206,-0.339684618956576
0.33,0.00731034399780349,-0.348816128176009
0.34,0.00752811702459352,-0.357948491346257
0.35,0.00776190339390047,-0.367083237631876
0.36,0.00801449550629666,-0.376221614464911
0.37,0.00828801433605479,-0.385364533748116
0.38,0.00858376899561369,-0.394512531561019
0.39,0.00890214711480108,-0.403665744440506
0.4,0.0092425409963273,-0.412823904324609
0.41,0.0096033135006048,-0.421986353250991
0.42,0.00998180652925158,-0.431152077907802
0.43,0.0103743938380535,-0.440319763161688
0.44,0.0107765787370403,-0.449487862753306
0.45,0.0111831360480227,-0.458654684472241
0.46,0.0115882965087909,-0.467818486318392
0.47,0.0119859706585454,-0.476977579443068
0.48,0.0123700081313537,-0.486130433057939
0.49,0.012734487243874,-0.49527577602102
0.5,0.0130740288105818,-0.504412689473686
0.51,0.013384127274653,-0.513540684728758
0.52,0.0136614915258206,-0.522659760614622
0.53,0.013904387207918,-0.531770434680979
0.54,0.0141129719149486,-0.540873743079762
0.55,0.0142896144418623,-0.549971204545602
0.56,0.0144391891912694,-0.55906474469401
0.57,0.0145693369330706,-0.568156577806531
0.58,0.0146906833630753,-0.57724904435445
0.59,0.0148170073017531,-0.586344403700078
0.6,0.0149653509079354,-0.595444582680972
0.61,0.0151560649471979,-0.604550882101684
0.62,0.015412782943436,-0.613663644503475
0.63,0.0157623189474218,-0.622781887928888
0.64,0.0162344846705433,-0.631902911718929
0.65,0.0168618228480953,-0.641021881649725
0.66,0.0176792549070557,-0.65013140290684
0.67,0.0187236423108646,-0.659221090482737
0.68,0.0200332623309641,-0.668277147540045
0.69,0.0216472004443847,-0.677281963084279
0.7,0.0236046630710998,-0.686213740908172
0.71,0.0259442159368642,-0.695046172179856
0.72,0.0287029549694159,-0.703748164222505
0.73,0.0319156183008977,-0.712283637947671
0.74,0.0356136496497723,-0.720611406032216
0.75,0.0398242250839916,-0.728685143243387
0.76,0.044569256916371,-0.736453459292043
0.77,0.0498643902456461,-0.743860083204136
0.78,0.0557180094251731,-0.750844166419252
0.79,0.0621302735083215,-0.757340709626094
0.8,0.0690922014779168,-0.763281115702145
0.81,0.0765848298092583,-0.768593868012249
0.82,0.084578466634895,-0.773205329712404
0.83,0.0930320684671172,-0.777040655574383
0.84,0.101892767083648,-0.780024803168011
0.85,0.111095575785929,-0.78208362498461
0.86,0.120563305790317,-0.783145017231369
0.87,0.130206725003066,-0.78314009454596
0.88,0.139924992852816,-0.78200435274746
0.89,0.149606406202057,-0.779678773927497
0.9,0.159129492624308,-0.776110819668326
0.91,0.168364488509212,-0.771255248926079
0.92,0.177175240535992,-0.765074687111749
0.93,0.185421570029398,-0.7575398621132
0.94,0.192962140573994,-0.748629411402727
0.95,0.199657870005105,-0.738329151940149
0.96,0.205375928510454,-0.726630691285005
0.97,0.209994365058261,-0.713529244147033
0.98,0.21340740470786,-0.699020503505594
0.99,0.215531459550385,-0.683096399389884
1,0.216311896062463,-0.665739561406608
