xi,s1,s2
0,-7.22179292017982e-25,-9.99701934311742e-25
0.01,-0.00360941146355513,-0.0155903475848181
0.02,-0.0071862971639112,-0.0308548440456953
0.03,-0.0107306571010682,-0.0457934893826316
0.04,-0.0142424912750262,-0.0604062835956269
0.05,-0.0177217996857851,-0.0746932266846814
0.06,-0.0211685823333449,-0.088654318649795
0.07,-0.0245828392177057,-0.102289559490968
0.08,-0.0279645703388674,-0.115598949208199
0.09,-0.0313137756968301,-0.12858248780149
0.1,-0.0346304552915937,-0.14124017527084
0.11,-0.0379146091231583,-0.153572011616249
0.12,-0.0411662371915238,-0.165577996837717
0.13,-0.0443853394966903,-0.177258130935245
0.14,-0.0475719160386576,-0.188612413908831
0.15,-0.050725966817426,-0.199640845758476
0.16,-0.0538474918329953,-0.210343426484181
0.17,-0.0569364910853655,-0.220720156085944
0.18,-0.0599929645745366,-0.230771034563767
0.19,-0.0630169123005088,-0.240496061917649
0.2,-0.0660083342632818,-0.24989523814759
0.21,-0.0689672304628558,-0.25896856325359
0.22,-0.0718936008992307,-0.267716037235649
0.23,-0.0747874455724066,-0.276137660093767
0.24,-0.0776487644823834,-0.284233431827944
0.25,-0.0804775576291612,-0.29200335243818
0.26,-0.083348586775759,-0.299576312019667
0.27,-0.0863366136851958,-0.307081200667595
0.28,-0.0894416383574717,-0.314518018381965
0.29,-0.0926636607925866,-0.321886765162776
0.3,-0.0960026809905405,-0.329187441010029
0.31,-0.0994586989513335,-0.336420045923724
0.32,-0.103031714674966,-0.34358457990386
0.33,-0.106721728161437,-0.350681042950437
0.34,-0.110528739410747,-0.357709435063456
0.35,-0.114452748422896,-0.364669756242917
0.36,-0.118493755197884,-0.371562006488819
0.37,-0.122651759735712,-0.378386185801163
0.38,-0.126926762036378,-0.385142294179948
0.39,-0.131318762099883,-0.391830331625175
0.4,-0.135827759926228,-0.398450298136844
0.41,-0.140453755515411,-0.405002193714953
0.42,-0.145196748867434,-0.411486018359505
0.43,-0.150056739982295,-0.417901772070498
0.44,-0.155033728859996,-0.424249454847933
0.45,-0.160127715500536,-0.430529066691809
0.46,-0.165338699903914,-0.436740607602127
0.47,-0.170666682070132,-0.442884077578886
0.48,-0.176111661999189,-0.448959476622087
0.49,-0.181673639691085,-0.454966804731729
0.5,-0.18735261514582,-0.460906061907813
0.51,-0.193140736944895,-0.466719092747285
0.52,-0.199030153669813,-0.472347741847092
0.53,-0.205020865320574,-0.477792009207233
0.54,-0.211112871897177,-0.483051894827709
0.55,-0.217306173399623,-0.488127398708519
0.56,-0.223600769827911,-0.493018520849664
0.57,-0.229996661182041,-0.497725261251143
0.58,-0.236493847462014,-0.502247619912957
0.59,-0.24309232866783,-0.506585596835106
0.6,-0.249792104799488,-0.510739192017589
0.61,-0.256593175856988,-0.514708405460406
0.62,-0.263495541840331,-0.518493237163558
0.63,-0.270499202749517,-0.522093687127045
0.64,-0.277604158584545,-0.525509755350866
0.65,-0.284810409345415,-0.528741441835022
0.66,-0.292117955032128,-0.531788746579513
0.67,-0.299526795644683,-0.534651669584338
0.68,-0.307036931183081,-0.537330210849497
0.69,-0.314648361647321,-0.539824370374991
0.7,-0.322361087037404,-0.54213414816082
0.71,-0.33017510735333,-0.544259544206983
0.72,-0.338090422595097,-0.546200558513481
0.73,-0.346107032762708,-0.547957191080313
0.74,-0.35422493785616,-0.54952944190748
0.75,-0.362444137875456,-0.550917310994981
0.76,-0.370838822590583,-0.552032059509286
0.77,-0.379483181771531,-0.552784948616861
0.78,-0.3883772154183,-0.553175978317708
0.79,-0.39752092353089,-0.553205148611826
0.8,-0.406914306109302,-0.552872459499216
0.81,-0.416557363153534,-0.552177910979877
0.82,-0.426450094663587,-0.551121503053809
0.83,-0.436592500639462,-0.549703235721012
0.84,-0.446984581081158,-0.547923108981487
0.85,-0.457626335988675,-0.545781122835233
0.86,-0.468517765362013,-0.54327727728225
0.87,-0.479658869201172,-0.540411572322539
0.88,-0.491049647506152,-0.537184007956099
0.89,-0.502690100276953,-0.53359458418293
0.9,-0.514580227513575,-0.529643301003032
0.91,-0.526720029216019,-0.525330158416406
0.92,-0.539109505384283,-0.520655156423051
0.93,-0.551748656018369,-0.515618295022968
0.94,-0.564637481118275,-0.510219574216155
0.95,-0.577775980684003,-0.504458994002614
0.96,-0.591164154715552,-0.498336554382344
0.97,-0.604802003212922,-0.491852255355346
0.98,-0.618689526176113,-0.485006096921619
0.99,-0.632826723605125,-0.477798079081163
1,-0.647213595499958,-0.470228201833978
