xi,s1,s2
0,-2.2441791014739e-29,-6.97335230951303e-29
0.01,0.0219509641498117,-0.0154209849452795
0.02,0.0428159054442262,-0.0272823286528558
0.03,0.0625614984981591,-0.0359791097507252
0.04,0.0811622138996864,-0.0418816348088833
0.05,0.0986003182100446,-0.0453354383393253
0.06,0.114865873963631,-0.0466612827960457
0.07,0.129956739668002,-0.0461551585750384
0.08,0.143878569803877,-0.044088284014297
0.09,0.156644814825134,-0.0407071053938142
0.1,0.168276721158811,-0.0362332969355823
0.11,0.178803331205108,-0.030863760803593
0.12,0.188261483337385,-0.0247706271038374
0.13,0.196695811902162,-0.0181012538843062
0.14,0.20415874721912,-0.0109782271349894
0.15,0.210710410781772,-0.00349955658357052
0.16,0.216415662263876,0.00425580725182088
0.17,0.221338584391851,0.0122176691967257
0.18,0.225541396217652,0.0203225590973251
0.19,0.229084450435902,0.0285137268080704
0.2,0.232026233383896,0.0367411421916836
0.21,0.2344233650416,0.0449614951191567
0.22,0.236330599031651,0.0531381954697523
0.23,0.237800822619358,0.0612413731310031
0.24,0.238885056712699,0.0692478779987126
0.25,0.239632455862324,0.0771412799769543
0.26,0.240090308261554,0.0849118689780721
0.27,0.24030403574638,0.0925566549226804
0.28,0.240317193795467,0.100079367739664
0.29,0.240171468922488,0.107490445959773
0.3,0.239906369781231,0.114805685549573
0.31,0.239558121936748,0.122041405426637
0.32,0.239159237730411,0.129212565966101
0.33,0.238738508038429,0.136332732950793
0.34,0.238321002271842,0.143414077571231
0.35,0.237928068376525,0.150467376425626
0.36,0.237577332833185,0.15750201151988
0.37,0.237282700657363,0.164525970267587
0.38,0.237054355399432,0.171545845490032
0.39,0.2368987591446,0.178566835416194
0.4,0.236818652512908,0.18559274368274
0.41,0.236813054659229,0.192625979334031
0.42,0.236877263273272,0.199667556822119
0.43,0.237002854666059,0.206717096035097
0.44,0.237178037569537,0.213772938270247
0.45,0.237390261014165,0.220833001078916
0.46,0.237628123947378,0.227895404226709
0.47,0.237881487314819,0.234958506432965
0.48,0.238141474060334,0.242020905370758
0.49,0.238400469125975,0.249081437666897
0.5,0.238652119451998,0.256139178901927
0.51,0.238891333976866,0.263193443610126
0.52,0.239114283637243,0.27024378527951
0.53,0.239318401368003,0.277289996351827
0.54,0.239502382102221,0.284332108222562
0.55,0.239666182771178,0.291370391240934
0.56,0.239811022304361,0.298405354709898
0.57,0.23993938162946,0.305437746886142
0.58,0.240054964348022,0.312468564854956
0.59,0.24016202673468,0.319499222776264
0.6,0.240264462748118,0.326531781650456
0.61,0.24036567989841,0.333568980489739
0.62,0.240468599216683,0.340614236325752
0.63,0.240575655255114,0.347671644209567
0.64,0.24068879608693,0.354745977211691
0.65,0.240809483306409,0.361842686422065
0.66,0.240938692028879,0.368967900950065
0.67,0.24107691089072,0.376128427924498
0.68,0.241224142049361,0.383331752493607
0.69,0.241379901183283,0.390586037825068
0.7,0.241543217492016,0.397900125105991
0.71,0.241712633696141,0.405283533542921
0.72,0.241886209740476,0.412746461397555
0.73,0.242061716068467,0.420299840042453
0.74,0.242237130239457,0.427955472856812
0.75,0.24241077572577,0.435726074045752
0.76,0.242581323084418,0.44362526896803
0.77,0.242747789957106,0.451667594136034
0.78,0.242909541070227,0.459868497215785
0.79,0.243066288234865,0.46824433702694
0.8,0.243218090346794,0.476812383542787
0.81,0.243365353386479,0.485590817890249
0.82,0.243508830419075,0.494598732349882
0.83,0.243649621594425,0.503856130355876
0.84,0.243789174147067,0.513383926496054
0.85,0.243929282396225,0.523203946511873
0.86,0.24407208755922,0.533338933321536
0.87,0.244220002169374,0.543814986757898
0.88,0.244375326497727,0.554673945210068
0.89,0.244540043171723,0.565980015190477
0.9,0.244715809886389,0.577820006612798
0.91,0.24490395940434,0.590303332791944
0.92,0.245105499555775,0.603562010444068
0.93,0.24532111323848,0.617750659686565
0.94,0.245551158417827,0.63304650403807
0.95,0.245795668126771,0.649649370418458
0.96,0.246054350465856,0.667781689148845
0.97,0.246326588603211,0.687688493951587
0.98,0.246611440774548,0.709637421950282
0.99,0.246907640283169,0.733918713669768
1,0.247213595499958,0.760845213036123
