xi,sx,sy,cx,cy,ex,ey,ne
0,-0,0,0,0,-0,0,0
0.01,-0.0212622379,0.0057602631,-0.0098474129,0.0024692184,-0.0114148251,0.0032910447,0.0118797814
0.02,-0.0409480041,0.0113763422,-0.0196705659,0.0050347608,-0.0212774382,0.0063415815,0.0222023654
0.03,-0.0592116638,0.0168554455,-0.0294686633,0.0076959051,-0.0297430005,0.0091595404,0.0311214276
0.04,-0.0761948973,0.0222048006,-0.0392409296,0.0104519103,-0.0369539677,0.0117528903,0.0387779082
0.05,-0.0920274501,0.0274316312,-0.0489866101,0.0133020171,-0.04304084,0.0141296141,0.0453007715
0.06,-0.1068278587,0.0325431339,-0.058704971,0.0162454489,-0.0481228877,0.0162976849,0.0508077441
0.07,-0.1207041544,0.0375464567,-0.0683952997,0.019281413,-0.0523088548,0.0182650438,0.0554060295
0.08,-0.1337545422,0.042448679,-0.078056905,0.022409101,-0.0556976371,0.020039578,0.0591930019
0.09,-0.1460680565,0.0472567917,-0.0876891175,0.0256276904,-0.0583789391,0.0216291013,0.0622568755
0.1,-0.1577251942,0.0519776796,-0.0972912891,0.0289363451,-0.0604339051,0.0230413345,0.0646773529
0.11,-0.1687985227,0.0566181041,-0.106862794,0.0323342165,-0.0619357287,0.0242838876,0.0665262481
0.12,-0.1793532657,0.0611846873,-0.1164030279,0.0358204444,-0.0629502378,0.0253642428,0.0678680872
0.13,-0.1894478646,0.0656838975,-0.1259114085,0.0393941581,-0.0635364561,0.0262897394,0.0687606839
0.14,-0.1991345171,0.0701220354,-0.1353873755,0.0430544769,-0.0637471416,0.0270675584,0.0692556913
0.15,-0.2084596914,0.0745052216,-0.1448303902,0.0468005113,-0.0636293012,0.0277047103,0.0693991279
0.16,-0.2174646179,0.0788393855,-0.1542399358,0.0506313639,-0.063224682,0.0282080216,0.0692318778
0.17,-0.2261857561,0.083130255,-0.1636155172,0.0545461301,-0.0625702389,0.0285841249,0.0687901664
0.18,-0.2346552396,0.0873833473,-0.1729566607,0.058543899,-0.0616985789,0.0288394483,0.0681060087
0.19,-0.2429012956,0.0916039612,-0.1822629139,0.0626237543,-0.0606383817,0.0289802069,0.0672076315
0.2,-0.2509486429,0.0957971702,-0.1915338457,0.066784775,-0.0594147972,0.0290123952,0.06611987
0.21,-0.2588188647,0.099967817,-0.200769046,0.0710260364,-0.0580498188,0.0289417806,0.0648645367
0.22,-0.2665307589,0.1041205087,-0.2099681252,0.0753466105,-0.0565626337,0.0287738983,0.0634607654
0.23,-0.2741006641,0.1082596139,-0.2191307144,0.079745567,-0.0549699497,0.0285140469,0.0619253279
0.24,-0.281542763,0.1123892598,-0.2282564647,0.084221974,-0.0532862983,0.0281672859,0.0602729258
0.25,-0.2888693616,0.1165133319,-0.2373450472,0.0887748986,-0.0515243144,0.0277384333,0.0585164563
0.26,-0.2960911447,0.1206354735,-0.2463961527,0.0934034078,-0.049694992,0.0272320657,0.0566672537
0.27,-0.3032174084,0.1247590869,-0.2554094909,0.0981065687,-0.0478079175,0.0266525182,0.0547353059
0.28,-0.3102562691,0.1288873361,-0.2643847908,0.1028834497,-0.0458714783,0.0260038864,0.0527294475
0.29,-0.317214848,0.1330231497,-0.2733217997,0.1077331205,-0.0438930483,0.0252900292,0.0506575292
0.3,-0.3240994338,0.1371692259,-0.2822202834,0.1126546531,-0.0418791504,0.0245145728,0.048526565
0.31,-0.3309156198,0.1413280383,-0.2910800252,0.1176471224,-0.0398355945,0.0236809159,0.0463428567
0.32,-0.3376684192,0.1455018424,-0.2999008261,0.1227096062,-0.037767593,0.0227922361,0.0441120971
0.33,-0.3443623559,0.1496926836,-0.308682504,0.1278411863,-0.0356798519,0.0218514973,0.0418394522
0.34,-0.3510015322,0.1539024069,-0.3174248935,0.1330409486,-0.0335766387,0.0208614583,0.0395296232
0.35,-0.3575896734,0.1581326666,-0.3261278456,0.1383079836,-0.0314618278,0.0198246829,0.0371868883
0.36,-0.3641301564,0.1623849373,-0.3347912269,0.1436413872,-0.0293389295,0.0187435501,0.0348151326
0.37,-0.3706260338,0.166660526,-0.3434149196,0.1490402603,-0.0272111143,0.0176202656,0.0324178732
0.38,-0.3770800581,0.1709605829,-0.3519988209,0.1545037102,-0.0250812372,0.0164568727,0.0299982853
0.39,-0.3834947042,0.1752861139,-0.3605428426,0.1600308501,-0.0229518616,0.0152552637,0.0275592276
0.4,-0.3898721933,0.179637992,-0.3690469107,0.1656207999,-0.0208252825,0.0140171921,0.0251032681
0.41,-0.3962145148,0.1840169701,-0.3775109651,0.1712726864,-0.0187035497,0.0127442837,0.0226327095
0.42,-0.4025234493,0.1884236928,-0.3859349589,0.1769856434,-0.0165884904,0.0114380493,0.020149615
0.43,-0.4088005901,0.1928587091,-0.3943188582,0.1827588125,-0.0144817319,0.0100998966,0.0176558339
0.44,-0.4150473653,0.1973224855,-0.4026626417,0.1885913427,-0.0123847236,0.0087311428,0.0151530272
0.45,-0.4212650589,0.2018154184,-0.4109663002,0.1944823912,-0.0102987586,0.0073330272,0.0126426943
0.46,-0.4274548317,0.2063378475,-0.4192298363,0.2004311231,-0.0082249953,0.0059067244,0.0101262008
0.47,-0.4336177423,0.210890069,-0.4274532639,0.206436712,-0.0061644784,0.004453357,0.0076048131
0.48,-0.4397547675,0.2154723491,-0.4356366078,0.2124983402,-0.0041181596,0.0029740089,0.0050797606
0.49,-0.4458668217,0.2200849376,-0.4437799035,0.2186151984,-0.0020869182,0.0014697392,0.0025525205
0.5,-0.4519547773,0.2247280818,-0.4518831965,0.2247864863,-7.15808e-05,-5.84045e-05,9.23845e-05
0.51,-0.4580194838,0.2294020407,-0.4599465422,0.2310114127,0.0019270584,-0.001609372,0.0025107035
0.52,-0.4640617865,0.2341070986,-0.4679700053,0.2372891953,0.0039082188,-0.0031820967,0.0050398327
0.53,-0.4700825458,0.2388435804,-0.4759536599,0.2436190611,0.005871114,-0.0047754808,0.0075680378
0.54,-0.476082655,0.2436118653,-0.4838975883,0.2500002465,0.0078149333,-0.0063883812,0.01009379
0.55,-0.4820630586,0.2484124023,-0.4918018815,0.2564319971,0.0097388229,-0.0080195948,0.0126158064
0.56,-0.4880247699,0.2532457245,-0.4996666384,0.2629135679,0.0116418685,-0.0096678434,0.0151327558
0.57,-0.4939688885,0.2581124648,-0.5074919656,0.2694442237,0.0135230771,-0.0113317589,0.0176431962
0.58,-0.4998966171,0.263013371,-0.5152779769,0.2760232386,0.0153813598,-0.0130098676,0.0201455425
0.59,-0.5058092783,0.267949321,-0.5230247933,0.2826498961,0.017215515,-0.0147005751,0.0226380402
0.6,-0.5117083309,0.272921339,-0.5307325423,0.2893234896,0.0190242114,-0.0164021506,0.0251187413
0.61,-0.5175953861,0.2779306111,-0.5384013579,0.2960433219,0.0208059718,-0.0181127108,0.0275854809
0.62,-0.5234722231,0.2829785014,-0.5460313803,0.3028087054,0.0225591572,-0.019830204,0.0300358546
0.63,-0.5293408042,0.2880665683,-0.5536227552,0.3096189622,0.024281951,-0.0215523939,0.0324671962
0.64,-0.5352032902,0.2931965808,-0.561175634,0.3164734238,0.0259723439,-0.0232768429,0.0348765546
0.65,-0.5410620549,0.2983705353,-0.5686901734,0.3233714313,0.0276281185,-0.0250008959,0.0372606727
0.66,-0.5469196995,0.3035906723,-0.5761665349,0.3303123353,0.0292468354,-0.026721663,0.0396159646
0.67,-0.5527790667,0.3088594932,-0.5836048847,0.3372954959,0.030825818,-0.0284360027,0.0419384943
0.68,-0.5586432542,0.3141797781,-0.5910053936,0.3443202827,0.0323621394,-0.0301405045,0.0442239537
0.69,-0.5645156309,0.3195546064,-0.5983682365,0.3513860744,0.0338526056,-0.031831468,0.0464676367
0.7,-0.5703998601,0.3249873918,-0.6056935923,0.3584922593,0.0352937322,-0.0335048675,0.0486643985
0.71,-0.5762999359,0.3304819365,-0.6129816436,0.3656382347,0.0366817078,-0.0351562982,0.0508085917
0.72,-0.5822202302,0.336042506,-0.6202325765,0.3728234074,0.0380123463,-0.0367809014,0.0528939805
0.73,-0.5881655539,0.3416739237,-0.6274465804,0.3800471931,0.0392810265,-0.0383732694,0.0549136308
0.74,-0.5941412283,0.3473816855,-0.6346238479,0.3873090165,0.0404826196,-0.039927331,0.056859777
0.75,-0.6001531698,0.3531720954,-0.6417645742,0.3946083114,0.0416114043,-0.041436216,0.0587236662
0.76,-0.6062079872,0.3590524201,-0.6488689574,0.4019445204,0.0426609703,-0.0428921003,0.0604953771
0.77,-0.6123130897,0.3650310649,-0.6559371982,0.409317095,0.0436241085,-0.0442860302,0.0621636172
0.78,-0.6184768088,0.3711177689,-0.6629694992,0.4167254953,0.0444926904,-0.0456077264,0.0637154942
0.79,-0.6247085315,0.377323821,-0.6699660657,0.4241691899,0.0452575342,-0.046845369,0.0651362648
0.8,-0.6310188453,0.3836622956,-0.6769271044,0.4316476563,0.0459082591,-0.0479853607,0.0664090589
0.81,-0.6374196967,0.3901483088,-0.6838528242,0.43916038,0.0464331274,-0.0490120713,0.0675145796
0.82,-0.6439245608,0.3967992945,-0.6907434354,0.4467068552,0.0468188746,-0.0499075607,0.0684307798
0.83,-0.6505486235,0.403635301,-0.69759915,0.454286584,0.0470505265,-0.050651283,0.0691325141
0.84,-0.6573089759,0.4106793074,-0.7044201812,0.4618990768,0.0471112053,-0.0512197694,0.0695911665
0.85,-0.6642248207,0.4179575605,-0.7112067434,0.4695438521,0.0469819227,-0.0515862917,0.0697742542
0.86,-0.6713176916,0.4254999315,-0.7179590523,0.4772204362,0.0466413607,-0.0517205047,0.069645008
0.87,-0.6786116834,0.4333402935,-0.7246773242,0.4849283633,0.0460656407,-0.0515880698,0.0691619274
0.88,-0.6861336962,0.4415169183,-0.7313617764,0.4926671752,0.0452280802,-0.0511502569,0.0682783129
0.89,-0.6939136898,0.4500728941,-0.7380126269,0.5004364214,0.0440989371,-0.0503635273,0.0669417742
0.9,-0.7019849523,0.459056563,-0.7446300943,0.5082356589,0.042645142,-0.0491790959,0.0650937141
0.91,-0.7103843792,0.4685219789,-0.7512143976,0.5160644522,0.0408300184,-0.0475424732,0.0626687894
0.92,-0.7191527658,0.4785293854,-0.7577657563,0.5239223729,0.0386129905,-0.0453929875,0.0595943483
0.93,-0.7283351114,0.4891457137,-0.76428439,0.5318089999,0.0359492786,-0.0426632862,0.0557898433
0.94,-0.7379809356,0.5004451012,-0.7707705186,0.5397239191,0.0327895829,-0.0392788179,0.0511662221
0.95,-0.7481446073,0.5125094297,-0.777224362,0.5476667236,0.0290797547,-0.0351572938,0.0456252939
0.96,-0.7588856851,0.5254288844,-0.7836461401,0.5556370131,0.0247604551,-0.0302081287,0.0390590729
0.97,-0.7702692707,0.5393025322,-0.7900360729,0.5636343942,0.0197668022,-0.024331862,0.0313490985
0.98,-0.7823663743,0.5542389209,-0.79639438,0.5716584801,0.0140280057,-0.0174195592,0.0223657324
0.99,-0.7952542918,0.5703566985,-0.8027212808,0.5797088908,0.007466989,-0.0093521923,0.0119674318
1,-0.8090169944,0.5877852523,-0.8090169944,0.5877852523,-0,-0,0
