xi,sx,sy,cx,cy,ex,ey,ne
0,6.68626064139551e-27,-1.09379746756163e-27,0,0,6.68626064139551e-27,-1.09379746756163e-27,6.77513647572644e-27
0.01,-0.00302048739188631,-0.0254798206841598,-0.00127356202463347,-0.0100191975430526,-0.00174692536725285,-0.0154606231411073,0.0155590043431478
0.02,-0.00587703373403791,-0.0485840372708471,-0.00256672373512666,-0.0200343437758957,-0.00331030999891125,-0.0285496934949514,0.0287409664232879
0.03,-0.00857950278648406,-0.0696225716766977,-0.00388009872730381,-0.0300453188303339,-0.00469940405918026,-0.0395772528463638,0.0398552799686121
0.04,-0.0111388902820477,-0.0888694785766553,-0.00521432960346893,-0.0400519951206518,-0.00592456067857881,-0.0488174834560034,0.0491756760015694
0.05,-0.0135670288747732,-0.106565980603715,-0.00657008981183891,-0.0500542367153332,-0.00699693906293433,-0.056511743888382,0.0569432555581124
0.06,-0.0158763146572962,-0.12292336719752,-0.00794808563255532,-0.0600518986466971,-0.00792822902474087,-0.062871468550823,0.0633693804073061
0.07,-0.0180794552471558,-0.138125757101807,-0.00934905832434825,-0.07004482615121,-0.00873039692280752,-0.0680809309505969,0.0686384221083914
0.08,-0.0201892394420491,-0.152332724510707,-0.0107737864475093,-0.0800328538322637,-0.00941545299453985,-0.0722998706784433,0.0729103700114875
0.09,-0.0222183284440281,-0.165681788863897,-0.0122230883806109,-0.0900158047360731,-0.00999524006341725,-0.0756659841278236,0.076323299050535
0.1,-0.0241790686526383,-0.178290768290601,-0.0136978250504288,-0.0999934893300613,-0.0104812436022095,-0.0782972789605397,0.078995698364363
0.11,-0.026083326027,-0.190259996702448,-0.0151989028968038,-0.109965704371581,-0.0108844231301962,-0.0802942923308672,0.0810286618906663
0.12,-0.0279423420168319,-0.201674404535177,-0.016727277096768,-0.119932231653081,-0.0112150649200639,-0.0817421728820964,0.0825079420943692
0.13,-0.0297666110624169,-0.212605463139197,-0.0182839550751996,-0.129892836607787,-0.0114826559872173,-0.0827126265314103,0.0835058679150473
0.14,-0.0315657796635096,-0.223112992818996,-0.0198700003326121,-0.139847266757591,-0.0116957793308975,-0.0832657260614048,0.0840831278598147
0.15,-0.0333485670171871,-0.233246834521407,-0.0214865366244954,-0.149795249982079,-0.0118620303926916,-0.0834515845393277,0.0842904189523441
0.16,-0.0351227072246409,-0.243048385172719,-0.0231347525309737,-0.15973649258434,-0.0119879546936672,-0.0833118925883782,0.0841699620078023
0.17,-0.036894913066912,-0.252551996664646,-0.0248159064605178,-0.169670677125423,-0.0120790066063942,-0.0828813195392224,0.0837568834733003
0.18,-0.0386708613495677,-0.261786238489145,-0.0265313321371457,-0.179597459994737,-0.012139529212422,-0.0821887784944084,0.0830804638883425
0.19,-0.0404551998163209,-0.270775024022087,-0.0282824446270797,-0.189516468678403,-0.0121727551892412,-0.0812585553436839,0.0821652529080252
0.2,-0.0422515756315914,-0.279538600455778,-0.0300707469683382,-0.199427298681219,-0.0121808286632531,-0.0801113017745587,0.0810320508128601
0.21,-0.0440626854320097,-0.288094402380332,-0.0318978374753901,-0.209329510050373,-0.0121648479566196,-0.0787648923299585,0.079698756511991
0.22,-0.045890346946863,-0.296457769013902,-0.0337654178009674,-0.219222623440093,-0.0121249291458956,-0.0772351455738086,0.078181082229657
0.23,-0.0477355921874834,-0.304642525081752,-0.0356753018486525,-0.229106115645653,-0.0120602903388309,-0.0755364094360993,0.0764931353361524
0.24,-0.0495987822055783,-0.312661425344192,-0.0376294256431762,-0.238979414522295,-0.0119693565624021,-0.0736820108218972,0.0746478681227809
0.25,-0.0514797434205029,-0.320526462773358,-0.0396298582807997,-0.248841893189087,-0.0118498851397032,-0.0716845695842713,0.0726573966937049
0.26,-0.0533779254631102,-0.328249040569459,-0.0416788141000553,-0.25869286339896,-0.0116991113630549,-0.0695561771704993,0.0705331906924609
0.27,-0.0552925775513423,-0.335840018881543,-0.0437786662339129,-0.268531567933431,-0.0115139113174294,-0.0673084509481119,0.0682861459072045
0.28,-0.0572229275831794,-0.343309693798474,-0.045931961728606,-0.278357171852775,-0.0112909658545734,-0.0649525219456994,0.065926595673034
0.29,-0.0591683481325598,-0.350667766175814,-0.0481414384424624,-0.288168752398535,-0.0110269096900974,-0.0624990137772793,0.0634643164340885
0.3,-0.0611285063634372,-0.357923311163669,-0.0504100439707905,-0.297965287303745,-0.0107184623926467,-0.0599580238599235,0.0609085384921502
0.31,-0.0631034978096095,-0.365084748626099,-0.0527409568809137,-0.307745641215,-0.0103625409286958,-0.0573391074110986,0.0582679628372264
0.32,-0.0650939640203188,-0.372159814452107,-0.055137610585663,-0.317508549867275,-0.00995635343465578,-0.0546512645848328,0.0555507848228734
0.33,-0.0671011940716237,-0.3791555327582,-0.0576037202349379,-0.327252601573783,-0.00949747383668582,-0.0519029311844178,0.0527647256679398
0.34,-0.0691272099435425,-0.386078188982515,-0.0601433130642996,-0.336976215495202,-0.00898389687924282,-0.049101973487313,0.0499170732664252
0.35,-0.0711748357629679,-0.392933303870523,-0.0627607627079297,-0.34667761602991,-0.00841407305503825,-0.0462556878406137,0.0470147347433102
0.36,-0.0732477509123541,-0.39972560835231,-0.0654608280615205,-0.356354802512632,-0.00778692285083354,-0.0433708058396783,0.0440643049039459
0.37,-0.0753505270041741,-0.406459019311417,-0.0682486973693188,-0.366005513214132,-0.00710182963485528,-0.040453506097285,0.0410721577193795
0.38,-0.0774886487211501,-0.413136616245263,-0.0711300383085547,-0.37562718238763,-0.00635861041259538,-0.0375094338576329,0.0380445732621527
0.39,-0.0796685185222539,-0.419760618817138,-0.0741110549526692,-0.38521688879326,-0.00555746356958474,-0.0345437300238782,0.0349879219915937
0.4,-0.0818974452144802,-0.426332365299766,-0.0771985526089028,-0.394771293730143,-0.00469889260557739,-0.0315610715696228,0.0319089459296544
0.41,-0.0841836163903906,-0.43285229191044,-0.0804000116393666,-0.404286566090492,-0.00378360475102399,-0.0285657258199479,0.028815210506474
0.42,-0.0865360547314293,-0.439319913037732,-0.083723671475481,-0.413758291287546,-0.00281238325594829,-0.0255616217501854,0.0257158707042537
0.43,-0.0889645581770106,-0.445733802359774,-0.0871786261022547,-0.423181360054912,-0.00178593207475593,-0.022552442304862,0.0226230459330695
0.44,-0.0914796239593778,-0.452091574854108,-0.0907749322849394,-0.43254983201221,-0.000704691674438443,-0.0195417428418979,0.0195544446010335
0.45,-0.0940923565042337,-0.458389869699117,-0.0945237316757545,-0.441856767468872,0.00043137517152074,-0.0165331022302451,0.0165387289080612
0.46,-0.0968143591971424,-0.464624334067014,-0.0984373875737245,-0.451094019105543,0.00162302837658208,-0.0135303149614711,0.0136273124301088
0.47,-0.099657610015703,-0.470789607808417,-0.102529636356025,-0.460251972826359,0.00287202634032206,-0.0105376349820578,0.0109220092617885
0.48,-0.102634321027495,-0.476879309028492,-0.106815752197599,-0.469319224102064,0.00418143117010464,-0.0075600849264284,0.00863940106287077
0.49,-0.105756781753794,-0.482886020554661,-0.111312721238846,-0.478282172424074,0.00555593948505251,-0.00460384813058734,0.0072155305536792
0.5,-0.10903718639906,-0.488801277295893,-0.116039417207476,-0.487124512028011,0.00700223080841535,-0.0016767652678818,0.00720019291810266
0.51,-0.11248744498919,-0.494615554506217,-0.121016763658608,-0.495826591960605,0.00852931866941767,0.00121103745438772,0.00861486440290308
0.52,-0.116118980868921,-0.500318257674022,-0.126267856970078,-0.50436461338859,0.0101488761011568,0.00404635571456746,0.0109257805526856
0.53,-0.119942527541217,-0.505897717860053,-0.131818006843718,-0.512709628128821,0.0118754793025015,0.00681191026876793,0.0136904758928931
0.54,-0.123967937831438,-0.511341196307058,-0.137694624363995,-0.520826302644715,0.0137266865325569,0.00948510633765742,0.016684998213957
0.55,-0.128204007826698,-0.516634899042616,-0.143926848132863,-0.528671422031317,0.0157228403061646,0.0120365229887008,0.0198011513036661
0.56,-0.132658315633399,-0.521764001487808,-0.150544743675993,-0.536192139552799,0.0178864280425936,0.0144281380649915,0.0229803280251901
0.57,-0.137337074952939,-0.526712683071739,-0.157577841093122,-0.543324047331052,0.0202407661401833,0.0166113642593133,0.0261844617377784
0.58,-0.142245003475599,-0.531464171851896,-0.165052703162069,-0.54998928007098,0.0228076996864703,0.0185251082190842,0.0293831720465473
0.59,-0.147385206092604,-0.536000799140362,-0.172989179097766,-0.556095098167846,0.0256039730051628,0.0200942990274843,0.0325475696028914
0.6,-0.152759072926361,-0.540304064135861,-0.181395082676262,-0.56153374410881,0.0286360097499015,0.0212296799729492,0.0356471649104146
0.61,-0.158366192178875,-0.544354708561662,-0.190259380049961,-0.566184768387535,0.0318931878710856,0.021830059825873,0.0386487638169911
0.62,-0.164204277798337,-0.548132801309318,-0.199544736757559,-0.569921251136891,0.035340458959222,0.0217884498275726,0.0415172805628825
0.63,-0.170269111963888,-0.551617833088254,-0.209181439567892,-0.572620942341315,0.0389123276040041,0.0210031092530604,0.0442187724598652
0.64,-0.176554502388569,-0.554788821081198,-0.219065773632097,-0.574181791106478,0.0425112712435289,0.0193929700252801,0.0467257473898738
0.65,-0.18305225444043,-0.557624423605456,-0.229065787916671,-0.574538709503167,0.046013533476241,0.0169142858977102,0.0490238547076689
0.66,-0.189752158081832,-0.560103064780041,-0.239035037771577,-0.57367613071971,0.049282879689745,0.0135730659396691,0.0511178085359348
0.67,-0.196641989626915,-0.562203069198627,-0.248831016757979,-0.57163123155718,0.0521890271310639,0.00942816235855315,0.0530338080694397
0.68,-0.203707528317244,-0.563902806608372,-0.25833227593123,-0.568486377082872,0.0546247476139863,0.00458357047449953,0.0548167143322764
0.69,-0.210932587715632,-0.565180846594566,-0.267449015960553,-0.564354090349738,0.0565164282449206,-0.000826756244827975,0.0565224750648061
0.7,-0.218299061918142,-0.566016123271136,-0.276125520260793,-0.559360237861957,0.057826458342651,-0.00665588540917894,0.0582082476547308
0.71,-0.225786986584258,-0.566388109976988,-0.284336271283038,-0.553630108172419,0.0585492846987797,-0.0127580018045688,0.059923162039266
0.72,-0.233374614785239,-0.566277003978199,-0.292078974397749,-0.547279372280688,0.0587043596125096,-0.0189976316975116,0.0617017977665898
0.73,-0.241038507670647,-0.565663921176056,-0.299367199791015,-0.540409650874678,0.0583286921203684,-0.0252542703013776,0.0635611083362127
0.74,-0.248753639953046,-0.564531100820927,-0.306224141541886,-0.533107383819312,0.0574705015888409,-0.0314237170016148,0.0655004468921437
0.75,-0.256493520210888,-0.562862120231995,-0.312677968575367,-0.525444625937931,0.0561844483644799,-0.0374174942940636,0.0675037859476577
0.76,-0.264230326136114,-0.560642119261522,-0.318758665756352,-0.51748073736746,0.0545283396202382,-0.043161381894062,0.0695431140282422
0.77,-0.271935061939878,-0.557858019609606,-0.324496046539637,-0.509264331772899,0.0525609845997587,-0.0485936878367071,0.0715821458163096
0.78,-0.279577776134668,-0.554498660077018,-0.329918599294128,-0.500835147313022,0.0503408231594598,-0.0536635127639967,0.0735796920253384
0.79,-0.28712787791113,-0.55055476884373,-0.335052888441026,-0.492225695278304,0.0479250105298963,-0.0583290735654262,0.0754923006490832
0.8,-0.294554559322973,-0.546018757879062,-0.339923305995264,-0.483462646214873,0.0453687466722904,-0.0625561116641889,0.0772760653835127
0.81,-0.301827323406514,-0.540884339222162,-0.34455203372612,-0.474567964373149,0.0427247103196061,-0.0663163748490132,0.078887657114463
0.82,-0.308916618234848,-0.535145963132807,-0.348959124683585,-0.465559821998196,0.0400425064487369,-0.0695861411346111,0.0802847019095366
0.83,-0.315794576906664,-0.528798078112528,-0.353162646597515,-0.4564533301233,0.0373680696908509,-0.0723447479892279,0.0814256421162596
0.84,-0.322435863469685,-0.521834212796065,-0.357178852075813,-0.447261120549578,0.0347429886061278,-0.0745730922464869,0.082269200460978
0.85,-0.32881862477875,-0.514245879713144,-0.36102235495549,-0.437993809010428,0.0322037301767399,-0.0762520707027164,0.0827735375814537
0.86,-0.334925548288526,-0.506021300920584,-0.364706301225419,-0.428660364277965,0.0297807529368928,-0.0773609366426191,0.0828951612804485
0.87,-0.34074502578086,-0.497143955504723,-0.368242528514573,-0.419268403107816,0.0274975027337128,-0.0778755523969066,0.0825876160069649
0.88,-0.346272423026758,-0.487590948954173,-0.371641711490281,-0.409824426770431,0.0253692884635227,-0.0777665221837415,0.081799955804999
0.89,-0.351511455383008,-0.477331204402904,-0.374913492466769,-0.400334011529034,0.0234020370837614,-0.07699719287387,0.0804749840020219
0.9,-0.356475669323425,-0.466323475743648,-0.378066597617365,-0.390801962725478,0.0215909282939403,-0.0755215130181698,0.0785472285516661
0.91,-0.361190029904746,-0.454514182611629,-0.381108939751542,-0.381232440016312,0.0199189098467966,-0.0732817425953174,0.075940613424512
0.92,-0.365692614167146,-0.441835067238625,-0.384047708871718,-0.371629059651121,0.0183550947045719,-0.0702060075875045,0.0725657839686897
0.93,-0.370036410469396,-0.428200673177347,-0.386889451795737,-0.361994978405187,0.0168530413263413,-0.0662056947721599,0.0683170478154009
0.94,-0.374291223758655,-0.413505645896147,-0.389640142099886,-0.352332962787012,0.0153489183412305,-0.0611726831091352,0.0630689024243837
0.95,-0.378545686774894,-0.397621855244055,-0.392305241553048,-0.34264544637282,0.013759554778154,-0.0549764088712347,0.0566721349524632
0.96,-0.382909377189955,-0.380395339786136,-0.394889754104617,-0.332934577523614,0.0119803769146616,-0.0474607622625222,0.0489494983177255
0.97,-0.387515040681248,-0.361643073009177,-0.397398273373821,-0.323202259275979,0.00988323269257274,-0.038440813733198,0.0396909869986369
0.98,-0.392520919940079,-0.341149551397696,-0.399835024475933,-0.313450182835241,0.00731410453585424,-0.0276993685624543,0.0286487546661296
0.99,-0.398113189614613,-0.318663204380277,-0.402203900916187,-0.303679855815347,0.00409071130157385,-0.0149833485649299,0.0155317305272468
1,-0.404508497187474,-0.293892626146237,-0.404508497187474,-0.293892626146236,5.55111512312578e-17,-1.11022302462516e-16,1.24126707662364e-16
