xi,s1,s2
0,-9.14282800791997e-28,2.29784544349178e-27
0.01,0.0075721789997434,-0.0472403568753759
0.02,0.0125441249432239,-0.0773137041643623
0.03,0.016447945595134,-0.100367343522689
0.04,0.0198069810105096,-0.11983090668512
0.05,0.0228215307712268,-0.137006872675388
0.06,0.0255905214830235,-0.152540899061023
0.07,0.0281735589361334,-0.166825429561083
0.08,0.030609855264267,-0.180119778373513
0.09,0.0329266753371154,-0.192603982755994
0.1,0.0351439297197985,-0.204408906631582
0.11,0.0372767267768789,-0.21563345801781
0.12,0.0393368412464761,-0.226354672302606
0.13,0.0413336265859567,-0.236633937320268
0.14,0.0432746337253907,-0.2465210879259
0.15,0.0451660554903316,-0.256057231400045
0.16,0.0470130521685494,-0.265276750380856
0.17,0.0488199906300091,-0.274208752512449
0.18,0.0505906200750089,-0.282878146100642
0.19,0.0523282016839806,-0.291306461309971
0.2,0.0540356053372351,-0.299512495177183
0.21,0.0557153836717118,-0.307512831684813
0.22,0.0573698316049681,-0.315322271350567
0.23,0.0590010376532902,-0.322954194318649
0.24,0.0606109315508306,-0.330420873399244
0.25,0.0622013307225198,-0.337733747049809
0.26,0.0637739861902217,-0.344903656630523
0.27,0.0653306266950362,-0.351941047637115
0.28,0.066872998403128,-0.358856131314697
0.29,0.0684028967317985,-0.365659001383604
0.3,0.0699221867729875,-0.372359700824889
0.31,0.0714328095800592,-0.378968235826575
0.32,0.072936773078356,-0.385494537696173
0.33,0.0744361282632829,-0.391948378109168
0.34,0.0759329333272361,-0.398339247722316
0.35,0.0774292100717422,-0.404676212165605
0.36,0.0789268980800272,-0.410967761974933
0.37,0.080427812361253,-0.41722167348119
0.38,0.0819336094412243,-0.423444895810122
0.39,0.0834457653544836,-0.42964347536992
0.4,0.0849655670170897,-0.435822524216662
0.41,0.0864941163780355,-0.441986233248
0.42,0.0880323449109201,-0.448137926040864
0.43,0.0895810347582149,-0.454280145061834
0.44,0.0911408424380713,-0.460414759533879
0.45,0.0927123214911617,-0.466543083608813
0.46,0.0942959415688078,-0.47266599441405
0.47,0.0958921029476591,-0.478784041609651
0.48,0.0975011469958285,-0.484897542886629
0.49,0.0991233644065985,-0.491006662939324
0.5,0.100759003772702,-0.497111476443948
0.51,0.102408283124211,-0.503212018132404
0.52,0.104071406451251,-0.509308324965476
0.53,0.10574858619498,-0.515400476581614
0.54,0.107440071471002,-0.521488640549833
0.55,0.109146180645372,-0.527573128411961
0.56,0.110867336069286,-0.533654466988384
0.57,0.112604098512764,-0.539733486915441
0.58,0.114357199188039,-0.545811427046585
0.59,0.116127568074168,-0.551890049618255
0.6,0.117916358294081,-0.557971757525252
0.61,0.119724967284843,-0.564059702260607
0.62,0.121555056172244,-0.570157869643642
0.63,0.123408568852266,-0.576271130957823
0.64,0.12528775162772,-0.582405249916715
0.65,0.127195172948259,-0.588566840761798
0.66,0.129133741222671,-0.594763278980762
0.67,0.131106717273163,-0.601002572628347
0.68,0.133117717251334,-0.607293208021988
0.69,0.13517070220181,-0.613643987661983
0.7,0.137269952358049,-0.62006387965402
0.71,0.139420027781233,-0.626561896207733
0.72,0.141625721560811,-0.633147014376281
0.73,0.14389201648275,-0.639828146160857
0.74,0.146224059729183,-0.646614158656338
0.75,0.148627171684117,-0.653513939295924
0.76,0.151106903187007,-0.660536497687389
0.77,0.153669149801649,-0.667691095059821
0.78,0.15632032230702,-0.674987395219909
0.79,0.159067561896522,-0.682435636315944
0.8,0.161918979601745,-0.6900468292443
0.81,0.164883895487455,-0.697832994738136
0.82,0.167973057449091,-0.705807455580917
0.83,0.17119883506903,-0.713985201630222
0.84,0.174575412453157,-0.722383343128659
0.85,0.178119042207887,-0.731021664899286
0.86,0.18184846309586,-0.739923296324386
0.87,0.185785617205793,-0.749115526407846
0.88,0.189956819302736,-0.758630826754366
0.89,0.194394522359129,-0.768508205150793
0.9,0.199139789285765,-0.778795109731363
0.91,0.204245579046448,-0.789550274062192
0.92,0.209781158153935,-0.800848221683533
0.93,0.215838609865904,-0.812786754273152
0.94,0.222543806520746,-0.825499758521143
0.95,0.230076619996555,-0.839179221883318
0.96,0.238709851520166,-0.854113617741281
0.97,0.248899752533738,-0.870771640484542
0.98,0.261582717420683,-0.890083049310052
0.99,0.279221825603126,-0.914467250596879
1,0.309016994374947,-0.951056516295154
