xi,s1,s2
0,0,0
0.01,0.00211666628430516,-0.0097996656857615
0.02,0.00436446507654306,-0.0195685253637571
0.03,0.00676024818561099,-0.0293005811493452
0.04,0.00932421005357411,-0.0389881085668203
0.05,0.0120807872934325,-0.0486210021389366
0.06,0.0150598587271273,-0.0581858080277904
0.07,0.0182983584912957,-0.0676642610604596
0.08,0.0218424516792069,-0.0770310174494492
0.09,0.0257504524097016,-0.0862500499851152
0.1,0.030096640857066,-0.0952687690440666
0.11,0.034975906123284,-0.104008218128207
0.12,0.040508250150186,-0.11234651656378
0.13,0.0468393784904175,-0.120091262871768
0.14,0.0541259995667642,-0.126937099780788
0.15,0.0624789644279466,-0.132417203101581
0.16,0.0718290795426924,-0.135906953175269
0.17,0.081760706872984,-0.136811691485181
0.18,0.0915585317145679,-0.13494233663484
0.19,0.100583064254411,-0.130672326092666
0.2,0.108553772366891,-0.124644595961461
0.21,0.115485551408077,-0.117436774626416
0.22,0.121516270960684,-0.109454148479147
0.23,0.126802282107294,-0.100956397547765
0.24,0.131480714295788,-0.092106938177805
0.25,0.135662285403491,-0.0830099937276313
0.26,0.139434036480655,-0.0737337302169195
0.27,0.142864107270406,-0.0643240087913013
0.28,0.146006128447673,-0.0548125506200221
0.29,0.148902709874138,-0.0452218683460197
0.3,0.151588074933756,-0.0355683167431815
0.31,0.154090017852502,-0.0258640290297499
0.32,0.156431355632906,-0.0161181773432211
0.33,0.158631010731906,-0.00633781312114884
0.34,0.1607048252443,0.00347156002396766
0.35,0.162666179254347,0.0133055877240341
0.36,0.164526465348319,0.0231607822990003
0.37,0.166295456530467,0.0330343189875824
0.38,0.167981594368417,0.0429238866712962
0.39,0.169592216844205,0.0528275769333987
0.4,0.171133740179414,0.0627438005107162
0.41,0.17261180518739,0.0726712236042151
0.42,0.174031396032647,0.0826087187798265
0.43,0.175396937337515,0.0925553267220751
0.44,0.176712374154809,0.102510226153563
0.45,0.177981238274612,0.112472709964432
0.46,0.179206703549382,0.122442166111509
0.47,0.180391632331753,0.132418062214982
0.48,0.181538614671692,0.14239993304639
0.49,0.182650001577169,0.152387370295893
0.5,0.183727933378424,0.162380014150088
0.51,0.184774364030724,0.172377546318337
0.52,0.185791082030087,0.182379684225803
0.53,0.186779728489988,0.192386176152189
0.54,0.187741812826949,0.202396797141663
0.55,0.188678726422944,0.212411345545214
0.56,0.189591754568507,0.222429640084448
0.57,0.190482086938698,0.232451517347518
0.58,0.191350826812142,0.242476829644892
0.59,0.192198999209199,0.252505443166154
0.6,0.193027558097283,0.262537236389735
0.61,0.193837392788342,0.272572098706067
0.62,0.194629333634453,0.282609929221503
0.63,0.195404157111644,0.292650635715963
0.64,0.196162590368935,0.302694133731776
0.65,0.196905315308496,0.312740345774853
0.66,0.197632972253603,0.322789200612408
0.67,0.198346163253238,0.332840632653868
0.68,0.199045455065582,0.342894581403748
0.69,0.19973138185704,0.352950990976887
0.7,0.200404447648657,0.363009809667955
0.71,0.201065128537726,0.373070989568251
0.72,0.201713874718858,0.383134486223859
0.73,0.202351112325824,0.393200258330057
0.74,0.202977245112863,0.403268267457556
0.75,0.203592655991925,0.413338477806796
0.76,0.204197708440397,0.423410855986981
0.77,0.204792747792153,0.433485370817011
0.78,0.205378102423327,0.44356199314582
0.79,0.20595408484294,0.453640695689944
0.8,0.206520992697364,0.463721452886436
0.81,0.207079109696666,0.473804240759443
0.82,0.207628706469994,0.483889036799015
0.83,0.208170041356423,0.493975819850831
0.84,0.208703361137005,0.504064570015736
0.85,0.209228901713191,0.514155268558066
0.86,0.209746888736256,0.524247897821897
0.87,0.210257538191916,0.534342441154413
0.88,0.210761056943904,0.544438882835708
0.89,0.211257643239906,0.5545372080144
0.9,0.211747487182942,0.564637402648499
0.91,0.212230771170985,0.574739453451043
0.92,0.212707670307346,0.584843347840046
0.93,0.213178352784118,0.594949073892383
0.94,0.213642980240791,0.605056620301245
0.95,0.214101708099915,0.615165976336839
0.96,0.214554685881575,0.625277131810066
0.97,0.215002057498239,0.635390077038901
0.98,0.215443961531449,0.64550480281725
0.99,0.21588053149166,0.655621300386078
1,0.216311896062463,0.665739561406607
