xi,s1,s2
0,0,0
0.01,-0.00168351364685469,-0.00996422284570915
0.02,-0.00339136714836573,-0.019922762098771
0.03,-0.00512427135538649,-0.0298754321290566
0.04,-0.00688296820620116,-0.039822036138897
0.05,-0.00866823253291708,-0.0497623653175778
0.06,-0.0104808739982631,-0.0596961979185328
0.07,-0.0123217391739783,-0.0696232982509354
0.08,-0.0141917137730781,-0.0795434155763814
0.09,-0.0160917250495064,-0.0894562829001755
0.1,-0.0180227443800385,-0.0993616156454168
0.11,-0.0199857900448119,-0.109259110196558
0.12,-0.0219819302245349,-0.11914844229737
0.13,-0.0240122862342944,-0.129029265286251
0.14,-0.02607803601596,-0.138901208149527
0.15,-0.0281804179134992,-0.148763873370753
0.16,-0.030320734758096,-0.158616834550961
0.17,-0.0325003582928445,-0.168459633771319
0.18,-0.0347207339699913,-0.178291778665529
0.19,-0.036983386157276,-0.188112739164618
0.2,-0.0392899237938967,-0.197921943871221
0.21,-0.041642046541064,-0.207718776014079
0.22,-0.0440415514770334,-0.217502568925955
0.23,-0.0464903403919863,-0.227272600979416
0.24,-0.0489904277442045,-0.237028089904629
0.25,-0.0515439493456991,-0.246768186401261
0.26,-0.0541531718528621,-0.256491966942293
0.27,-0.0568205031458344,-0.266198425650771
0.28,-0.059548503689148,-0.275886465110627
0.29,-0.0623398989757968,-0.285554885949111
0.3,-0.065197593167163,-0.29520237500038
0.31,-0.0681246840520686,-0.304827491826419
0.32,-0.0711244794594344,-0.314428653331716
0.33,-0.0742005152702741,-0.324004116160567
0.34,-0.0773565751855107,-0.333551956509037
0.35,-0.0805967124155873,-0.343070046915396
0.36,-0.0839252734648796,-0.352556029511078
0.37,-0.0873469241867843,-0.362007285116006
0.38,-0.090866678281592,-0.371420897444128
0.39,-0.0944899283952986,-0.38079361154341
0.4,-0.0982224799483307,-0.390121785424631
0.41,-0.102070587771628,-0.399401333630135
0.42,-0.106040995543604,-0.408627661251341
0.43,-0.110140977891139,-0.417795586616726
0.44,-0.114378384821351,-0.426899250534471
0.45,-0.11876168786125,-0.435932009582402
0.46,-0.123300026862086,-0.444886310491909
0.47,-0.128003255823141,-0.453753542179043
0.48,-0.132881985236779,-0.462523861454431
0.49,-0.137947617261232,-0.471185987935397
0.5,-0.143212368370641,-0.479726963265976
0.51,-0.148689271864362,-0.488131869558935
0.52,-0.154392149562328,-0.496383502234383
0.53,-0.160335537980552,-0.504461993505322
0.54,-0.16653454910616,-0.512344385213484
0.55,-0.173004639520072,-0.52000415438413
0.56,-0.179761254262316,-0.527410702923111
0.57,-0.186819304262646,-0.534528835862169
0.58,-0.194192430114564,-0.541318272242185
0.59,-0.201892003781906,-0.547733260663083
0.6,-0.20992582903237,-0.553722408004285
0.61,-0.218296528987869,-0.559228871874714
0.62,-0.226999664582244,-0.564191105843678
0.63,-0.236021718003276,-0.568544362950328
0.64,-0.245338197335465,-0.572223128775043
0.65,-0.254912248487723,-0.575164538123764
0.66,-0.264694244897982,-0.577312611555821
0.67,-0.274622790159823,-0.578622855702769
0.68,-0.284627354287393,-0.579066496139353
0.69,-0.294632383055901,-0.578633493542475
0.7,-0.304562290915335,-0.577333648295132
0.71,-0.314346459572682,-0.575195521856843
0.72,-0.323923362419829,-0.572263440293686
0.73,-0.333243220562956,-0.568593271108951
0.74,-0.342269024615923,-0.564247822542889
0.75,-0.350976139209543,-0.559292599257642
0.76,-0.359350923901177,-0.55379237416164
0.77,-0.367388841422204,-0.547808743365017
0.78,-0.375092440784256,-0.541398612255558
0.79,-0.3824694730704,-0.534613442277791
0.8,-0.389531275304788,-0.52749905296278
0.81,-0.396291467071472,-0.520095789776517
0.82,-0.402764948759879,-0.512438906711631
0.83,-0.408967162437911,-0.504559054629776
0.84,-0.41491356697756,-0.496482802932078
0.85,-0.420619280158749,-0.488233150180265
0.86,-0.426098846486524,-0.479829999067072
0.87,-0.43136609702351,-0.471290584187819
0.88,-0.436434074901375,-0.462629849169703
0.89,-0.441315006560363,-0.453860774413997
0.9,-0.44602030395516,-0.444994659180679
0.91,-0.45056058701114,-0.436041362833611
0.92,-0.454945718680938,-0.427009510332282
0.93,-0.45918484722732,-0.417906666868467
0.94,-0.463286452021715,-0.408739486130253
0.95,-0.467258390347969,-0.399513836168139
0.96,-0.471107943557354,-0.390234906316266
0.97,-0.474841861525546,-0.380907298127812
0.98,-0.478466404784438,-0.371535102837039
0.99,-0.481987383992636,-0.36212196746821
1,-0.48541019660584,-0.352671151373477
