xi,sx,sy,cx,cy,ex,ey,ne
0,0,0,0,0,0,0,0
0.01,0.0015965739,-0.0100623448,0.0015901567,-0.0100619312,6.4173e-06,-4.136e-07,6.4306e-06
0.02,0.0031995694,-0.0201202976,0.0031931286,-0.0201202884,6.4409e-06,-9.2e-09,6.4409e-06
0.03,0.0048111067,-0.0301742888,0.0048091252,-0.0301750209,1.9815e-06,7.322e-07,2.1124e-06
0.04,0.0064329476,-0.0402245933,0.006438361,-0.0402260763,-5.4134e-06,1.483e-06,5.6129e-06
0.05,0.0080665411,-0.0502713626,0.0080810558,-0.0502734005,-1.45147e-05,2.0379e-06,1.46571e-05
0.06,0.0097130648,-0.0603146518,0.0097374349,-0.0603169374,-2.43701e-05,2.2855e-06,2.4477e-05
0.07,0.0113734636,-0.0703544434,0.0114077291,-0.0703566291,-3.42655e-05,2.1857e-06,3.43352e-05
0.08,0.0130484847,-0.0803906663,0.0130921751,-0.0803924157,-4.36904e-05,1.7494e-06,4.37254e-05
0.09,0.0147387101,-0.0904232126,0.0147910155,-0.0904242354,-5.23054e-05,1.0227e-06,5.23154e-05
0.1,0.0164445856,-0.1004519508,0.0165044992,-0.1004520239,-5.99136e-05,7.3e-08,5.99136e-05
0.11,0.0181664475,-0.1104767365,0.0182328814,-0.1104757148,-6.64339e-05,-1.0217e-06,6.64418e-05
0.12,0.0199045464,-0.1204974207,0.0199764241,-0.1204952393,-7.18777e-05,-2.1814e-06,7.19108e-05
0.13,0.0216590684,-0.1305138566,0.0217353961,-0.1305105264,-7.63277e-05,-3.3303e-06,7.64003e-05
0.14,0.0234301542,-0.1405259037,0.0235100731,-0.140521502,-7.99189e-05,-4.4017e-06,8.004e-05
0.15,0.0252179156,-0.150533431,0.0253007384,-0.1505280897,-8.28228e-05,-5.3413e-06,8.29948e-05
0.16,0.0270224501,-0.1605363191,0.0271076827,-0.1605302102,-8.52326e-05,-6.1088e-06,8.54512e-05
0.17,0.0288438535,-0.1705344601,0.0289312047,-0.1705277813,-8.73512e-05,-6.6788e-06,8.76062e-05
0.18,0.0306822304,-0.1805277582,0.0307716112,-0.1805207174,-8.93808e-05,-7.0408e-06,8.96577e-05
0.19,0.0325377032,-0.1905161283,0.0326292174,-0.1905089301,-9.15142e-05,-7.1982e-06,9.17968e-05
0.2,0.0344104196,-0.2004994942,0.0345043473,-0.2004923274,-9.39277e-05,-7.1668e-06,9.42007e-05
0.21,0.0363005579,-0.2104777871,0.0363973339,-0.2104708137,-9.6776e-05,-6.9735e-06,9.70269e-05
0.22,0.0382083319,-0.2204509433,0.0383085197,-0.2204442897,-0.0001001879,-6.6535e-06,0.0001004085
0.23,0.0401339938,-0.2304189011,0.0402382569,-0.2304126525,-0.0001042632,-6.2486e-06,0.0001044503
0.24,0.0420778363,-0.2403815991,0.0421869079,-0.2403757947,-0.0001090715,-5.8044e-06,0.0001092259
0.25,0.0440401938,-0.2503389732,0.0441548453,-0.2503336047,-0.0001146515,-5.3685e-06,0.0001147771
0.26,0.0460214422,-0.2602909542,0.046142453,-0.2602859667,-0.0001210108,-4.9875e-06,0.0001211135
0.27,0.0480219984,-0.2702374655,0.0481501259,-0.2702327598,-0.0001281275,-4.7057e-06,0.0001282139
0.28,0.0500423187,-0.280178421,0.0501782709,-0.2801738583,-0.0001359521,-4.5628e-06,0.0001360287
0.29,0.0520828975,-0.2901137233,0.0522273068,-0.2901091312,-0.0001444093,-4.5921e-06,0.0001444823
0.3,0.054144264,-0.3000432619,0.0542976655,-0.3000384421,-0.0001534016,-4.8199e-06,0.0001534773
0.31,0.0562269799,-0.3099669121,0.0563897919,-0.3099616487,-0.000162812,-5.2634e-06,0.000162897
0.32,0.0583316363,-0.3198845337,0.0585041444,-0.3198786026,-0.0001725081,-5.9311e-06,0.0001726101
0.33,0.0604588502,-0.3297959706,0.0606411961,-0.3297891492,-0.0001823459,-6.8215e-06,0.0001824735
0.34,0.0626092613,-0.3397010503,0.0628014347,-0.3396931267,-0.0001921734,-7.9235e-06,0.0001923367
0.35,0.0647835286,-0.3495995835,0.0649853635,-0.3495903667,-0.000201835,-9.2168e-06,0.0002020453
0.36,0.0669823266,-0.3594913647,0.0671935019,-0.3594806928,-0.0002111753,-1.06719e-05,0.0002114448
0.37,0.0692063426,-0.3693761723,0.0694263859,-0.3693639208,-0.0002200433,-1.22515e-05,0.0002203841
0.38,0.0714562736,-0.3792537695,0.0716845694,-0.3792398582,-0.0002282958,-1.39113e-05,0.0002287192
0.39,0.0737328232,-0.3891239049,0.0739686242,-0.3891083036,-0.000235801,-1.56013e-05,0.0002363166
0.4,0.0760366994,-0.3989863135,0.0762791413,-0.398969046,-0.0002424419,-1.72675e-05,0.000243056
0.41,0.0783686125,-0.4088407179,0.0786167315,-0.4088218648,-0.000248119,-1.88531e-05,0.0002488342
0.42,0.0807292737,-0.4186868295,0.0809820264,-0.4186665285,-0.0002527527,-2.0301e-05,0.0002535667
0.43,0.0831193933,-0.4285243496,0.0833756791,-0.4285027949,-0.0002562858,-2.15547e-05,0.0002571906
0.44,0.085539681,-0.4383529705,0.0857983655,-0.4383304095,-0.0002586845,-2.2561e-05,0.0002596665
0.45,0.0879908451,-0.4481723768,0.088250785,-0.4481491058,-0.0002599399,-2.3271e-05,0.0002609794
0.46,0.0904735934,-0.457982246,0.0907336616,-0.4579586035,-0.0002600682,-2.36425e-05,0.0002611407
0.47,0.092988634,-0.4677822498,0.0932477454,-0.4677586085,-0.0002591114,-2.36413e-05,0.0002601876
0.48,0.0955366774,-0.4775720541,0.0957938131,-0.4775488116,-0.0002571357,-2.32425e-05,0.000258184
0.49,0.0981184385,-0.4873513196,0.09837267,-0.4873288877,-0.0002542314,-2.24319e-05,0.0002552192
0.5,0.1007346399,-0.4971197018,0.1009851507,-0.4970984947,-0.0002505108,-2.1207e-05,0.0002514068
0.51,0.1033860153,-0.5068768501,0.1036321212,-0.5068572724,-0.0002461058,-1.95778e-05,0.0002468833
0.52,0.1060733138,-0.5166224078,0.1063144794,-0.5166048412,-0.0002411656,-1.75666e-05,0.0002418045
0.53,0.1087973046,-0.5263560099,0.1090331575,-0.5263408013,-0.000235853,-1.52087e-05,0.0002363428
0.54,0.1115587825,-0.5360772822,0.1117891235,-0.5360647307,-0.000230341,-1.25515e-05,0.0002306828
0.55,0.1143585738,-0.5457858382,0.1145833825,-0.545776184,-0.0002248087,-9.6541e-06,0.0002250159
0.56,0.1171975428,-0.5554812768,0.1174169789,-0.555474691,-0.0002194361,-6.5858e-06,0.0002195349
0.57,0.1200765984,-0.5651631791,0.1202909984,-0.5651597545,-0.0002144,-3.4246e-06,0.0002144274
0.58,0.1229967015,-0.5748311038,0.1232065698,-0.5748308489,-0.0002098683,-2.549e-07,0.0002098685
0.59,0.1259588727,-0.5844845832,0.1261648674,-0.5844874177,-0.0002059947,2.8345e-06,0.0002060142
0.6,0.1289641997,-0.5941231178,0.1291671131,-0.5941288715,-0.0002029134,5.7537e-06,0.000202995
0.61,0.1320138456,-0.6037461711,0.1322145789,-0.6037545859,-0.0002007332,8.4149e-06,0.0002009095
0.62,0.1351090572,-0.6133531626,0.1353085896,-0.6133638984,-0.0001995324,1.07357e-05,0.000199821
0.63,0.1382511723,-0.6229434621,0.1384505255,-0.6229561056,-0.0001993532,1.26435e-05,0.0001997537
0.64,0.1414416282,-0.6325163815,0.1416418249,-0.6325304606,-0.0002001967,1.40791e-05,0.0002006912
0.65,0.1446819692,-0.642071168,0.1448839878,-0.6420861692,-0.0002020186,1.50013e-05,0.0002025748
0.66,0.1479738536,-0.6516069954,0.1481785784,-0.6516223864,-0.0002047247,1.5391e-05,0.0002053025
0.67,0.151319061,-0.6611229564,0.151527229,-0.6611382123,-0.000208168,1.52558e-05,0.0002087263
0.68,0.1547194978,-0.6706180539,0.1549316435,-0.6706326879,-0.0002121457,1.4634e-05,0.0002126498
0.69,0.1581772029,-0.680091192,0.158393601,-0.6801047901,-0.0002163981,1.35981e-05,0.0002168249
0.7,0.1616943516,-0.6895411681,0.1619149598,-0.689553427,-0.0002206082,1.22588e-05,0.0002209485
0.71,0.1652732594,-0.6989666638,0.165497662,-0.6989774313,-0.0002244026,1.07676e-05,0.0002246608
0.72,0.1689163828,-0.7083662368,0.1691437372,-0.7083755552,-0.0002273544,9.3184e-06,0.0002275453
0.73,0.1726263204,-0.7177383133,0.1728553079,-0.7177464624,-0.0002289875,8.1491e-06,0.0002291325
0.74,0.1764058109,-0.7270811805,0.1766345938,-0.7270887213,-0.0002287829,7.5408e-06,0.0002289072
0.75,0.1802577299,-0.7363929803,0.1804839172,-0.7364007966,-0.0002261873,7.8163e-06,0.0002263224
0.76,0.1841850838,-0.7456717036,0.1844057082,-0.7456810401,-0.0002206244,9.3365e-06,0.0002208218
0.77,0.1881910021,-0.7549151862,0.1884025101,-0.7549276805,-0.000211508,1.24942e-05,0.0002118767
0.78,0.1922787261,-0.7641211059,0.1924769854,-0.7641388129,-0.0001982592,1.77069e-05,0.0001990484
0.79,0.1964515955,-0.7732869812,0.1966319214,-0.7733123862,-0.0001803259,2.54049e-05,0.0001821067
0.8,0.200713031,-0.7824101723,0.2008702367,-0.78244619,-0.0001572056,3.60176e-05,0.0001612789
0.81,0.2050665139,-0.791487884,0.2051949865,-0.7915378396,-0.0001284726,4.99556e-05,0.0001378433
0.82,0.2095155615,-0.8005171715,0.2096093698,-0.80058476,-9.38083e-05,6.75885e-05,0.000115621
0.83,0.2140636986,-0.8094949489,0.2141167348,-0.8095841676,-5.30362e-05,8.92187e-05,0.0001037922
0.84,0.2187144244,-0.8184180012,0.2187205852,-0.8185330507,-6.1608e-06,0.0001150495,0.0001152144
0.85,0.2234711749,-0.8272829999,0.2234245863,-0.8274281475,4.65887e-05,0.0001451475,0.0001524412
0.86,0.2283372794,-0.8360865226,0.2282325697,-0.8362659216,0.0001047097,0.000179399,0.0002077213
0.87,0.2333159121,-0.8448250769,0.2331485389,-0.8450425359,0.0001673732,0.000217459,0.0002744125
0.88,0.2384100377,-0.8534951302,0.2381766725,-0.8537538229,0.0002333652,0.0002586927,0.0003483981
0.89,0.2436223508,-0.8620931435,0.2433213277,-0.8623952524,0.0003010231,0.0003021089,0.0004264795
0.9,0.2489552079,-0.8706156126,0.248587041,-0.870961896,0.0003681669,0.0003462834,0.0005054296
0.91,0.2544105532,-0.8790591148,0.2539785279,-0.8794483879,0.0004320253,0.0003892731,0.000581532
0.92,0.2599898365,-0.887420363,0.2595006796,-0.8878488826,0.0004891569,0.0004285196,0.0006503103
0.93,0.2656939224,-0.8956962674,0.2651585563,-0.896157008,0.0005353661,0.0004607405,0.0007063276
0.94,0.2715229927,-0.9038840057,0.270957377,-0.9043658147,0.0005656156,0.000481809,0.000743008
0.95,0.2774764378,-0.9119811015,0.2769025039,-0.9124677219,0.0005739338,0.0004866204,0.0007524623
0.96,0.2835527403,-0.9199855128,0.2829994206,-0.920454458,0.0005533198,0.0004689453,0.0007253085
0.97,0.2897493481,-0.9278957307,0.2892537026,-0.9283169988,0.0004956455,0.0004212681,0.0006504854
0.98,0.2960625365,-0.9357108892,0.2956709795,-0.9360455013,0.0003915571,0.0003346121,0.0005150556
0.99,0.3024872606,-0.9434308858,0.3022568848,-0.9436292357,0.0002303757,0.0001983499,0.0003039994
1,0.3090169944,-0.9510565163,0.3090169944,-0.9510565163,-0,-0,0
