xi,s1,s2
0,-4.66609772211367e-26,2.37993731629168e-25
0.01,0.0108464142553923,0.0131861443975871
0.02,0.0208639116828124,0.0258132378531504
0.03,0.0301299614743763,0.0379334743632683
0.04,0.0387159339388272,0.049595208132054
0.05,0.0466874629018379,0.0608431683164846
0.06,0.0541047936939097,0.0717186655662217
0.07,0.061023117015463,0.0822597905195178
0.08,0.067492888968718,0.0925016044168071
0.09,0.073560137545959,0.102476321993578
0.1,0.0792667558637814,0.112213486814121
0.11,0.0846507824329159,0.121740139207757
0.12,0.0897466687532273,0.13108097696913
0.13,0.094585534523483,0.140258508984175
0.14,0.0991954107554892,0.14929320194335
0.15,0.10360147108219,0.158203620303726
0.16,0.107826251549326,0.167006559661548
0.17,0.111889859180249,0.175717173696836
0.18,0.115810169603486,0.184349094851659
0.19,0.119603014032659,0.192914548903643
0.2,0.123282355888342,0.201424463596337
0.21,0.126860457351462,0.209888571488018
0.22,0.130348036137838,0.218315507180542
0.23,0.133754412783455,0.22671289908983
0.24,0.137087648730066,0.235087455919589
0.25,0.140354675500722,0.243445047999871
0.26,0.14356141525482,0.251790783652054
0.27,0.146712893012283,0.260129080741854
0.28,0.14981334083644,0.268463733581959
0.29,0.152866294265227,0.276797975345887
0.3,0.155874681280297,0.285134536154651
0.31,0.158840904103627,0.293475696997852
0.32,0.161766914111235,0.301823339650771
0.33,0.164654280153588,0.310178992749079
0.34,0.167504250572308,0.318543874182744
0.35,0.170317809202761,0.326918929970746
0.36,0.173095725652143,0.335304869778186
0.37,0.175838600142638,0.3437021992374
0.38,0.17854690320926,0.352111249234652
0.39,0.181221010541975,0.360532202324031
0.4,0.183861233261682,0.368965116430125
0.41,0.186467843919673,0.377409946001085
0.42,0.189041098510157,0.385866560773666
0.43,0.191581254785434,0.39433476231185
0.44,0.194088587163341,0.402814298480637
0.45,0.196563398516539,0.411304876016617
0.46,0.199006029133257,0.4198061713569
0.47,0.201416863139078,0.428317839888023
0.48,0.20379633266937,0.436839523776412
0.49,0.206144920081952,0.445370858542005
0.5,0.208463158499602,0.453911478536631
0.51,0.210751630971958,0.462461021488804
0.52,0.213010968542738,0.471019132283276
0.53,0.215241847471956,0.479585466210256
0.54,0.217444985789286,0.488159692054158
0.55,0.219621139318519,0.496741495458293
0.56,0.221771097309376,0.505330583008612
0.57,0.223895677812926,0.513926687479672
0.58,0.225995722936853,0.522529574685997
0.59,0.228072094116822,0.531139052381991
0.6,0.230125667540184,0.539754981653586
0.61,0.232157329858262,0.548377291244785
0.62,0.23416797432348,0.557005995262273
0.63,0.236158497487558,0.565641214701257
0.64,0.238129796597031,0.574283203235718
0.65,0.240082767822336,0.582932377716228
0.66,0.242018305456714,0.59158935381851
0.67,0.243937302221166,0.600254987285912
0.68,0.245840650811708,0.608930421208949
0.69,0.247729246825184,0.617617139785106
0.7,0.249603993199865,0.626317029002044
0.71,0.251465806307082,0.635032444687399
0.72,0.253315623830158,0.643766288368329
0.73,0.255154414566852,0.652522091383986
0.74,0.256983190291585,0.661304107694078
0.75,0.25880301981369,0.670117415826692
0.76,0.260615045367915,0.678968030408538
0.77,0.262420501473445,0.687863023720802
0.78,0.264220736397677,0.696810657723753
0.79,0.266017236360992,0.70582052699329
0.8,0.267811652618778,0.714903713012593
0.81,0.269605831556939,0.724072950262042
0.82,0.271401847937142,0.73334280455058
0.83,0.273202041428047,0.742729864031681
0.84,0.275009056558759,0.752252943347101
0.85,0.276825886230755,0.761933301341571
0.86,0.278655918924532,0.771794872791612
0.87,0.280502989737205,0.781864514591621
0.88,0.282371435387328,0.792172266840427
0.89,0.284266153323153,0.802751629271456
0.9,0.286192665070601,0.813639853469691
0.91,0.288157183957162,0.824878251318588
0.92,0.290166687347996,0.836512520120126
0.93,0.292228993530462,0.848593084831145
0.94,0.29435284338332,0.861175457859155
0.95,0.296547986966873,0.874320616860781
0.96,0.298825275170261,0.888095400986001
0.97,0.301196756552182,0.902572926011363
0.98,0.303675779511266,0.917833018805344
0.99,0.306277099922358,0.933962671569008
1,0.309016994374947,0.951056516295154
