xi,s1,s2
0,0,0
0.01,0.00127529899445946,-0.00995140477949607
0.02,0.00261268439178607,-0.0198931120335747
0.03,0.00401847020041709,-0.0298238331462082
0.04,0.00549997382353,-0.039741994679096
0.05,0.00706573760585325,-0.0496456556319742
0.06,0.00872581407160541,-0.0595323943166485
0.07,0.0104921377029401,-0.0693991511014305
0.08,0.0123790160150501,-0.0792420057695955
0.09,0.0144037876338838,-0.0890558558278664
0.1,0.0165877179893156,-0.0988339410421151
0.11,0.0189572388223063,-0.108567122648639
0.12,0.0215456935375101,-0.118242759139966
0.13,0.024395838122754,-0.12784289593647
0.14,0.0275634823758423,-0.137341244081164
0.15,0.031122849003905,-0.146697934057163
0.16,0.0351744357961469,-0.155850008750561
0.17,0.0398560778632412,-0.164693442300117
0.18,0.0453560700838553,-0.173047971681988
0.19,0.0519178109475973,-0.180588535748057
0.2,0.0597902700525328,-0.186728001660979
0.21,0.0690026014828326,-0.190523005258817
0.22,0.0789405037500334,-0.190979765503607
0.23,0.0884257001040503,-0.187947355131201
0.24,0.096650244954777,-0.182296064520696
0.25,0.103521024457188,-0.175039309501423
0.26,0.109263392610803,-0.166851070565154
0.27,0.114130961736634,-0.158109512787181
0.28,0.118326339188825,-0.149023095428761
0.29,0.12199883831995,-0.139710747629206
0.3,0.125257179717539,-0.130243589545838
0.31,0.128181339330678,-0.120666168164039
0.32,0.130831171668505,-0.111007574336057
0.33,0.133252318461253,-0.101287510509404
0.34,0.135480219003206,-0.0915197485913776
0.35,0.137542855176982,-0.0817141820290298
0.36,0.139462659036757,-0.0718780892047264
0.37,0.141257861545058,-0.0620169372558461
0.38,0.14294346300082,-0.0521349086908698
0.39,0.144531943120431,-0.042235255518459
0.4,0.146033788905522,-0.0323205430016869
0.41,0.147457892870099,-0.0223928209815593
0.42,0.148811857578715,-0.0124537465777851
0.43,0.150102231476046,-0.00250467357168679
0.44,0.151334693632611,0.00745328147081685
0.45,0.152514200023109,0.0174191895923393
0.46,0.153645100492762,0.0273922717478529
0.47,0.154731233140845,0.0373718698208376
0.48,0.155776001126863,0.0473574240959701
0.49,0.156782435664432,0.057348455574571
0.5,0.157753248064706,0.0673445519630354
0.51,0.158690873026032,0.077345356475922
0.52,0.159597504871402,0.0873505588167364
0.53,0.160475128063231,0.0973598878587129
0.54,0.161325543042584,0.107373105663804
0.55,0.162150388223941,0.117390002563337
0.56,0.162951158809752,0.127410393087135
0.57,0.163729222959359,0.137434112575392
0.58,0.164485835745179,0.147461014343526
0.59,0.165222151248834,0.157490967297642
0.6,0.165939233086225,0.167523853919308
0.61,0.166638063599596,0.177559568554671
0.62,0.167319551913701,0.187598015955668
0.63,0.167984541020087,0.19763911003108
0.64,0.168633814026561,0.207682772773069
0.65,0.169268099686952,0.217728933331131
0.66,0.169888077308185,0.227777527210376
0.67,0.170494381116816,0.237828495575125
0.68,0.171087604154798,0.247881784642033
0.69,0.171668301764011,0.257937345149604
0.7,0.172236994710486,0.267995131893119
0.71,0.172794171992044,0.278055103315765
0.72,0.173340293367044,0.288117221148203
0.73,0.173875791636769,0.298181450090011
0.74,0.174401074709686,0.308247757527441
0.75,0.174916527472067,0.31831611328276
0.76,0.175422513486363,0.328386489391106
0.77,0.175919376535983,0.338458859901437
0.78,0.176407442032835,0.34853320069856
0.79,0.176887018301987,0.358609489343698
0.8,0.177358397756094,0.368687704931386
0.81,0.177821857970719,0.378767827960763
0.82,0.178277662670429,0.388849840219618
0.83,0.178726062634389,0.398933724679719
0.84,0.179167296529193,0.409019465402192
0.85,0.179601591675856,0.419107047451808
0.86,0.180029164757083,0.429196456819256
0.87,0.180450222470326,0.439287680350503
0.88,0.180864962131526,0.449380705682544
0.89,0.181273572233938,0.459475521184836
0.9,0.181676232965993,0.469572115905872
0.91,0.182073116691743,0.479670479524355
0.92,0.182464388397076,0.489770602304523
0.93,0.182850206104603,0.499872475055226
0.94,0.183230721259798,0.509976089092378
0.95,0.183606079090762,0.520081436204483
0.96,0.183976418943733,0.530188508620923
0.97,0.184341874596281,0.540297298982775
0.98,0.184702574549943,0.550407800315909
0.99,0.185058642303897,0.560520006006167
1,0.185410196611133,0.570633909776447
