xi,s1,s2
0,-1.3679605390007e-26,-9.43810684790432e-26
0.01,-0.00093855036598247,-0.0101704043277641
0.02,-0.00177034298341313,-0.020244467229079
0.03,-0.00254701434864652,-0.0302629698803167
0.04,-0.00330885721589278,-0.0402555058792077
0.05,-0.00408617176336593,-0.0502425268654451
0.06,-0.00490054667609243,-0.0602371410335121
0.07,-0.00576606900114229,-0.0702466832272907
0.08,-0.00669046194857005,-0.0802740744888451
0.09,-0.00767615011732172,-0.0903189881326234
0.1,-0.00872125191977534,-0.100378838631201
0.11,-0.00982049926143856,-0.110449608829578
0.12,-0.0109660848036256,-0.12052653025197
0.13,-0.0121484373966778,-0.130604630527947
0.14,-0.013356926519479,-0.140679161243756
0.15,-0.014580496797645,-0.150745918819626
0.16,-0.0158082338978394,-0.160801470324852
0.17,-0.0170298633091859,-0.170843295469471
0.18,-0.0182361837247046,-0.180869855354398
0.19,-0.0194194369261044,-0.190880597920921
0.2,-0.0205736162541103,-0.200875909415565
0.21,-0.0216947159137944,-0.210857020577401
0.22,-0.0227809235201121,-0.22082587566203
0.23,-0.0238327584330235,-0.23078497183959
0.24,-0.0248531585642002,-0.240737175943301
0.25,-0.0258475184583808,-0.250685525000252
0.26,-0.0268236815619468,-0.260633016447329
0.27,-0.0277918896892416,-0.270582393422402
0.28,-0.0287646927835493,-0.280535930024151
0.29,-0.0297568221444878,-0.290495220953147
0.3,-0.0307850303568528,-0.300460979482119
0.31,-0.0318679012076735,-0.310432847254607
0.32,-0.0330256329184096,-0.320409218978575
0.33,-0.0342797980478299,-0.330387084664845
0.34,-0.0356530834381697,-0.340361891659627
0.35,-0.0371690135826622,-0.350327428335793
0.36,-0.0388516607864798,-0.360275730938929
0.37,-0.0407253454755109,-0.370197014731661
0.38,-0.0428143299782204,-0.380079630243175
0.39,-0.0451425090651232,-0.389910045110326
0.4,-0.0477331004781075,-0.399672851692224
0.41,-0.0506083386180102,-0.409350800351695
0.42,-0.0537891744834479,-0.418924858024534
0.43,-0.0572949848669522,-0.42837429144103
0.44,-0.0611432937159498,-0.437676774123815
0.45,-0.0653495084560608,-0.446808516061661
0.46,-0.069926673952564,-0.455744414750498
0.47,-0.074885246652702,-0.464458226100507
0.48,-0.0802328913067579,-0.472922753531853
0.49,-0.0859743025095466,-0.481110053421245
0.5,-0.0921110531361124,-0.488991654917243
0.51,-0.0986414715660209,-0.496538792013913
0.52,-0.105560549399667,-0.503722645660206
0.53,-0.112859881167508,-0.510514593586141
0.54,-0.120527637319046,-0.516886465446707
0.55,-0.128548571552768,-0.522810800820132
0.56,-0.136904063311041,-0.528261107549052
0.57,-0.145572196015238,-0.533212117880881
0.58,-0.15452787135605,-0.537640039847604
0.59,-0.163742959682098,-0.54152280132504
0.6,-0.173186486246526,-0.544840284227565
0.61,-0.182824852776303,-0.54757454632617
0.62,-0.192622093522426,-0.549710028225695
0.63,-0.20254016463112,-0.551233743101013
0.64,-0.212539265346524,-0.552135446871958
0.65,-0.222578189214113,-0.552407786592738
0.66,-0.232614703101386,-0.552046424943658
0.67,-0.242605951488015,-0.551050138840962
0.68,-0.252508883101809,-0.549420890324712
0.69,-0.262280696589397,-0.547163868044671
0.7,-0.271879301511569,-0.544287497840284
0.71,-0.281263790542682,-0.540803421102962
0.72,-0.290394918331429,-0.536726439817027
0.73,-0.299235582046633,-0.532074427399832
0.74,-0.307751298186524,-0.526868204701764
0.75,-0.315910669773171,-0.521131380783037
0.76,-0.323685837585462,-0.514890158356422
0.77,-0.33105290860411,-0.508173104073282
0.78,-0.337992354350753,-0.501010884134582
0.79,-0.344489371300221,-0.493435966028801
0.8,-0.350534195030506,-0.485482287534997
0.81,-0.356122359248853,-0.477184894481611
0.82,-0.361254890294741,-0.468579549119922
0.83,-0.365938427171323,-0.459702311355464
0.84,-0.370185256596084,-0.450589095481085
0.85,-0.374013251989198,-0.441275205471743
0.86,-0.377445704734136,-0.431794852333585
0.87,-0.380511035449664,-0.422180657448261
0.88,-0.383242372405361,-0.412463146317967
0.89,-0.385676983594243,-0.402670237597119
0.9,-0.387855548345945,-0.392826732793161
0.91,-0.389821253722283,-0.382953812531465
0.92,-0.391618700283759,-0.373068545807898
0.93,-0.393292601150813,-0.363183419197163
0.94,-0.394886257607286,-0.35330589354564
0.95,-0.396439793805654,-0.343437996254057
0.96,-0.397988132434159,-0.333575957847964
0.97,-0.399558692494954,-0.323709902142641
0.98,-0.40116878961979,-0.31382359993373
0.99,-0.40282271861571,-0.303894296785611
1,-0.404508497187474,-0.293892626146237
