xi,sx,sy,cx,cy,ex,ey,ne
0,0,-0,0,0,0,-0,0
0.01,0.0123507072,-0.0171236894,0.0056111694,-0.0083879038,0.0067395378,-0.0087357857,0.0110333731
0.02,0.0242688004,-0.0332659313,0.0113007859,-0.0167212476,0.0129680144,-0.0165446837,0.0210213215
0.03,0.0357737118,-0.048466137,0.0170705598,-0.0249977467,0.018703152,-0.0234683903,0.0300095524
0.04,0.0468848739,-0.0627637176,0.0229222287,-0.0332149997,0.0239626452,-0.029548718,0.0380438576
0.05,0.0576217193,-0.0761980847,0.0288575556,-0.0413704826,0.0287641637,-0.0348276021,0.0451701116
0.06,0.0680036803,-0.0888086494,0.0348783264,-0.0494615424,0.0331253539,-0.039347107,0.0514342678
0.07,0.0780501894,-0.100634823,0.0409863468,-0.0574853904,0.0370638426,-0.0431494326,0.056882352
0.08,0.087780679,-0.1117160169,0.047183439,-0.0654390956,0.04059724,-0.0462769213,0.0615604527
0.09,0.0972145816,-0.1220916423,0.0534714378,-0.0733195776,0.0437431438,-0.0487720648,0.0655147078
0.1,0.1063713296,-0.1318011106,0.0598521856,-0.0811235991,0.0465191439,-0.0506775115,0.0687912852
0.11,0.1152703554,-0.140883833,0.0663275277,-0.0888477592,0.0489428277,-0.0520360739,0.0714363589
0.12,0.1239310916,-0.1493792209,0.0728993054,-0.0964884853,0.0510317862,-0.0528907356,0.0734960755
0.13,0.1323729705,-0.1573266855,0.0795693494,-0.1040420263,0.0528036211,-0.0532846592,0.0750165136
0.14,0.1406154246,-0.1647656382,0.0863394722,-0.1115044446,0.0542759524,-0.0532611936,0.0760436306
0.15,0.1486778863,-0.1717354902,0.0932114586,-0.1188716092,0.0554664277,-0.052863881,0.0766231983
0.16,0.1565797881,-0.1782756528,0.1001870561,-0.1261391883,0.056392732,-0.0521364646,0.0768007237
0.17,0.1643405625,-0.1844255374,0.1072679636,-0.1333026427,0.0570725989,-0.0511228948,0.0766213542
0.18,0.1719796418,-0.1902245553,0.1144558188,-0.1403572193,0.057523823,-0.049867336,0.0761297669
0.19,0.1795164585,-0.1957121177,0.1217521845,-0.1472979455,0.057764274,-0.0484141722,0.0753700433
0.2,0.1869704451,-0.2009276359,0.1291585335,-0.154119624,0.0578119116,-0.0468080119,0.0743855302
0.21,0.1943585423,-0.2059047387,0.1366762317,-0.160816829,0.0576823106,-0.0450879097,0.073213172
0.22,0.2016877245,-0.2106539245,0.1443065199,-0.1673839034,0.0573812046,-0.0432700211,0.0718672204
0.23,0.2089624741,-0.2151799092,0.1520504939,-0.1738149572,0.0569119803,-0.041364952,0.0703564691
0.24,0.2161872739,-0.2194874087,0.1599090833,-0.1801038683,0.0562781906,-0.0393835404,0.0686898682
0.25,0.2233666064,-0.2235811389,0.1678830285,-0.1862442845,0.0554835779,-0.0373368544,0.0668765139
0.26,0.2305049542,-0.2274658156,0.1759728561,-0.1922296286,0.0545320981,-0.0352361869,0.064925639
0.27,0.2376068,-0.2311461547,0.1841788533,-0.1980531059,0.0534279467,-0.0330930489,0.0628466019
0.28,0.2446766263,-0.2346268722,0.1925010407,-0.2037077143,0.0521755856,-0.0309191579,0.0606488752
0.29,0.2517189158,-0.2379126838,0.2009391443,-0.2091862589,0.0507797714,-0.0287264249,0.0583420318
0.3,0.2587381509,-0.2410083055,0.209492567,-0.2144813696,0.049245584,-0.0265269359,0.0559357298
0.31,0.2657388145,-0.2439184532,0.218160359,-0.2195855228,0.0475784555,-0.0243329304,0.0534396943
0.32,0.272725389,-0.2466478427,0.2269411893,-0.2244910679,0.0457841997,-0.0221567748,0.0508636964
0.33,0.2797023571,-0.2492011899,0.235833317,-0.2291902585,0.0438690401,-0.0200109315,0.0482175285
0.34,0.2866742013,-0.2515832108,0.2448345643,-0.2336752881,0.0418396371,-0.0179079227,0.0455109759
0.35,0.2936454043,-0.2537986211,0.2539422913,-0.2379383315,0.0397031131,-0.0158602896,0.0427537831
0.36,0.3006204487,-0.2558521367,0.2631533734,-0.2419715902,0.0374670753,-0.0138805465,0.0399556167
0.37,0.3076038171,-0.2577484736,0.2724641826,-0.2457673439,0.0351396346,-0.0119811298,0.0371260204
0.38,0.3145999921,-0.2594923477,0.2818705722,-0.2493180049,0.0327294199,-0.0101743428,0.0342743662
0.39,0.3216134563,-0.2610884747,0.2913678681,-0.2526161783,0.0302455882,-0.0084722964,0.031409798
0.4,0.3286486923,-0.2625415706,0.300950865,-0.2556547241,0.0276978272,-0.0068868465,0.0285411683
0.41,0.335708998,-0.2638555653,0.3106138302,-0.2584268226,0.0250951678,-0.0054287427,0.025675644
0.42,0.3427929327,-0.2650312448,0.320350514,-0.2609260407,0.0224424187,-0.0041052041,0.0228147947
0.43,0.3498978709,-0.2660686091,0.3301541691,-0.2631463988,0.0197437018,-0.0029222102,0.0199587843
0.44,0.3570211871,-0.2669676581,0.3400175777,-0.2650824362,0.0170036095,-0.0018852219,0.0171077993
0.45,0.3641602561,-0.2677283918,0.3499330869,-0.2667292736,0.0142271691,-0.0009991182,0.0142622081
0.46,0.3713124522,-0.2683508104,0.3598926531,-0.2680826721,0.0114197991,-0.0002681383,0.0114229466
0.47,0.3784751501,-0.2688349137,0.3698878929,-0.2691390851,0.0085872573,0.0003041714,0.0085926426
0.48,0.3856457243,-0.2691807018,0.379910142,-0.2698957046,0.0057355823,0.0007150028,0.005779977
0.49,0.3928215495,-0.2693881746,0.3899505202,-0.2703504973,0.0028710293,0.0009623227,0.0030280149
0.5,0.4,-0.2694573322,0.4,-0.2705022323,-0,0.0010449001,0.0010449001
0.51,0.4071784505,-0.2693881746,0.4100494798,-0.2703504973,-0.0028710293,0.0009623227,0.0030280149
0.52,0.4143542757,-0.2691807018,0.420089858,-0.2698957046,-0.0057355823,0.0007150028,0.005779977
0.53,0.4215248499,-0.2688349137,0.4301121071,-0.2691390851,-0.0085872573,0.0003041714,0.0085926426
0.54,0.4286875478,-0.2683508104,0.4401073469,-0.2680826721,-0.0114197991,-0.0002681383,0.0114229466
0.55,0.4358397439,-0.2677283918,0.4500669131,-0.2667292736,-0.0142271691,-0.0009991182,0.0142622081
0.56,0.4429788129,-0.2669676581,0.4599824223,-0.2650824362,-0.0170036095,-0.0018852219,0.0171077993
0.57,0.4501021291,-0.2660686091,0.4698458309,-0.2631463988,-0.0197437018,-0.0029222102,0.0199587843
0.58,0.4572070673,-0.2650312448,0.479649486,-0.2609260407,-0.0224424187,-0.0041052041,0.0228147947
0.59,0.464291002,-0.2638555653,0.4893861698,-0.2584268226,-0.0250951678,-0.0054287427,0.025675644
0.6,0.4713513077,-0.2625415706,0.499049135,-0.2556547241,-0.0276978272,-0.0068868465,0.0285411683
0.61,0.4783865437,-0.2610884747,0.5086321319,-0.2526161783,-0.0302455882,-0.0084722964,0.031409798
0.62,0.4854000079,-0.2594923477,0.5181294278,-0.2493180049,-0.0327294199,-0.0101743428,0.0342743662
0.63,0.4923961829,-0.2577484736,0.5275358174,-0.2457673439,-0.0351396346,-0.0119811298,0.0371260204
0.64,0.4993795513,-0.2558521367,0.5368466266,-0.2419715902,-0.0374670753,-0.0138805465,0.0399556167
0.65,0.5063545957,-0.2537986211,0.5460577087,-0.2379383315,-0.0397031131,-0.0158602896,0.0427537831
0.66,0.5133257987,-0.2515832108,0.5551654357,-0.2336752881,-0.0418396371,-0.0179079227,0.0455109759
0.67,0.5202976429,-0.2492011899,0.564166683,-0.2291902585,-0.0438690401,-0.0200109315,0.0482175285
0.68,0.527274611,-0.2466478427,0.5730588107,-0.2244910679,-0.0457841997,-0.0221567748,0.0508636964
0.69,0.5342611855,-0.2439184532,0.581839641,-0.2195855228,-0.0475784555,-0.0243329304,0.0534396943
0.7,0.5412618491,-0.2410083055,0.590507433,-0.2144813696,-0.049245584,-0.0265269359,0.0559357298
0.71,0.5482810842,-0.2379126838,0.5990608557,-0.2091862589,-0.0507797714,-0.0287264249,0.0583420318
0.72,0.5553233737,-0.2346268722,0.6074989593,-0.2037077143,-0.0521755856,-0.0309191579,0.0606488752
0.73,0.5623932,-0.2311461547,0.6158211467,-0.1980531059,-0.0534279467,-0.0330930489,0.0628466019
0.74,0.5694950458,-0.2274658156,0.6240271439,-0.1922296286,-0.0545320981,-0.0352361869,0.064925639
0.75,0.5766333936,-0.2235811389,0.6321169715,-0.1862442845,-0.0554835779,-0.0373368544,0.0668765139
0.76,0.5838127261,-0.2194874087,0.6400909167,-0.1801038683,-0.0562781906,-0.0393835404,0.0686898682
0.77,0.5910375259,-0.2151799092,0.6479495061,-0.1738149572,-0.0569119803,-0.041364952,0.0703564691
0.78,0.5983122755,-0.2106539245,0.6556934801,-0.1673839034,-0.0573812046,-0.0432700211,0.0718672204
0.79,0.6056414577,-0.2059047387,0.6633237683,-0.160816829,-0.0576823106,-0.0450879097,0.073213172
0.8,0.6130295549,-0.2009276359,0.6708414665,-0.154119624,-0.0578119116,-0.0468080119,0.0743855302
0.81,0.6204835415,-0.1957121177,0.6782478155,-0.1472979455,-0.057764274,-0.0484141722,0.0753700433
0.82,0.6280203582,-0.1902245553,0.6855441812,-0.1403572193,-0.057523823,-0.049867336,0.0761297669
0.83,0.6356594375,-0.1844255374,0.6927320364,-0.1333026427,-0.0570725989,-0.0511228948,0.0766213542
0.84,0.6434202119,-0.1782756528,0.6998129439,-0.1261391883,-0.056392732,-0.0521364646,0.0768007237
0.85,0.6513221137,-0.1717354902,0.7067885414,-0.1188716092,-0.0554664277,-0.052863881,0.0766231983
0.86,0.6593845754,-0.1647656382,0.7136605278,-0.1115044446,-0.0542759524,-0.0532611936,0.0760436306
0.87,0.6676270295,-0.1573266855,0.7204306506,-0.1040420263,-0.0528036211,-0.0532846592,0.0750165136
0.88,0.6760689084,-0.1493792209,0.7271006946,-0.0964884853,-0.0510317862,-0.0528907356,0.0734960755
0.89,0.6847296446,-0.140883833,0.7336724723,-0.0888477592,-0.0489428277,-0.0520360739,0.0714363589
0.9,0.6936286704,-0.1318011106,0.7401478144,-0.0811235991,-0.0465191439,-0.0506775115,0.0687912852
0.91,0.7027854184,-0.1220916423,0.7465285622,-0.0733195776,-0.0437431438,-0.0487720648,0.0655147078
0.92,0.712219321,-0.1117160169,0.752816561,-0.0654390956,-0.04059724,-0.0462769213,0.0615604527
0.93,0.7219498106,-0.100634823,0.7590136532,-0.0574853904,-0.0370638426,-0.0431494326,0.056882352
0.94,0.7319963197,-0.0888086494,0.7651216736,-0.0494615424,-0.0331253539,-0.039347107,0.0514342678
0.95,0.7423782807,-0.0761980847,0.7711424444,-0.0413704826,-0.0287641637,-0.0348276021,0.0451701116
0.96,0.7531151261,-0.0627637176,0.7770777713,-0.0332149997,-0.0239626452,-0.029548718,0.0380438576
0.97,0.7642262882,-0.048466137,0.7829294402,-0.0249977467,-0.018703152,-0.0234683903,0.0300095524
0.98,0.7757311996,-0.0332659313,0.7886992141,-0.0167212476,-0.0129680144,-0.0165446837,0.0210213215
0.99,0.7876492928,-0.0171236894,0.7943888306,-0.0083879038,-0.0067395378,-0.0087357857,0.0110333731
1,0.8,-0,0.8,0,-0,-0,0
