xi,sx,sy,cx,cy,ex,ey,ne
0,0,0,0,0,0,0,0
0.01,0.0242563131,-0.0003548972,0.0075791616,-0.0065394013,0.0166771515,0.0061845042,0.0177869467
0.02,0.0466469514,0.0008406382,0.015732372,-0.0123439125,0.0309145794,0.0131845508,0.0336086834
0.03,0.0672535922,0.0034166416,0.0244588019,-0.0172402289,0.0427947903,0.0206568706,0.0475194736
0.04,0.08615723,0.0072122274,0.0337141071,-0.0210377532,0.0524431228,0.0282499806,0.0595679657
0.05,0.1034381769,0.0120755887,0.0433954665,-0.0235509036,0.0600427104,0.0356264923,0.0698167174
0.06,0.1191760625,0.0178639976,0.0533376869,-0.0246337828,0.0658383757,0.0424977804,0.0783629572
0.07,0.1334498338,0.0244438052,0.0633297718,-0.0242168518,0.0701200619,0.048660657,0.0853503522
0.08,0.146337755,0.0316904412,0.0731512641,-0.0223273957,0.0731864909,0.0540178369,0.0909625701
0.09,0.1579174082,0.0394884145,0.0826131238,-0.0190812618,0.0753042844,0.0585696763,0.0953999068
0.1,0.1682656925,0.0477313126,0.0915841281,-0.0146511032,0.0766815644,0.0623824158,0.0988515459
0.11,0.1774588247,0.0563218022,0.0999952995,-0.0092288756,0.0774635252,0.0655506778,0.1014765446
0.12,0.185572339,0.0651716285,0.107828519,-0.0029974602,0.0777438201,0.0681690887,0.1033979024
0.13,0.192681087,0.074201616,0.1150997971,0.0038841815,0.0775812899,0.0703174345,0.1047062469
0.14,0.1988592378,0.0833416678,0.121844323,0.0112852381,0.0770149148,0.0720564297,0.1054676546
0.15,0.2041802778,0.092530766,0.1281057983,0.0191013584,0.0760744794,0.0734294075,0.1057317564
0.16,0.2087170109,0.1017169715,0.1339298447,0.0272506053,0.0747871662,0.0744663661,0.1055384286
0.17,0.2125415587,0.1108574241,0.1393603829,0.0356690283,0.0731811759,0.0751883958,0.1049227304
0.18,0.2157253599,0.1199183427,0.1444379024,0.0443067102,0.0712874575,0.0756116325,0.1039183361
0.19,0.2183391708,0.1288750248,0.1491988308,0.0531245367,0.06914034,0.0757504882,0.1025598512
0.2,0.220453065,0.137711847,0.1536754948,0.0620916713,0.0667775702,0.0756201757,0.1008843638
0.21,0.2221362767,0.1464219081,0.1578963724,0.0711836254,0.0642399043,0.0752382827,0.0989321206
0.22,0.2234554712,0.155003108,0.1618864664,0.0803807972,0.0615690049,0.0746223107,0.0967431218
0.23,0.2244730169,0.1634542258,0.1656677097,0.0896673691,0.0588053072,0.0737868567,0.0943534015
0.24,0.2252468274,0.1717745638,0.1692593566,0.0990304741,0.0559874708,0.0727440897,0.0917948771
0.25,0.2258303622,0.1799639471,0.1726783398,0.1084595635,0.0531520223,0.0715043837,0.089095535
0.26,0.2262726261,0.1880227239,0.1759395863,0.1179459233,0.0503330398,0.0700768006,0.0862796202
0.27,0.2266181696,0.195951765,0.1790562918,0.1274823038,0.0475618778,0.0684694612,0.0833678555
0.28,0.2269070887,0.2037524645,0.1820401572,0.1370626317,0.0448669316,0.0666898328,0.0803777043
0.29,0.2271750251,0.2114267393,0.1849015902,0.1466817865,0.042273435,0.0647449528,0.0773236847
0.3,0.2274531659,0.2189770292,0.1876498776,0.1563354245,0.0398032883,0.0626416047,0.0742177364
0.31,0.2277682439,0.226406297,0.1902933325,0.1660198397,0.0374749114,0.0603864573,0.0710696363
0.32,0.2281425372,0.2337180284,0.1928394187,0.1757318528,0.0353031185,0.0579861756,0.0678874563
0.33,0.2285938697,0.2409162321,0.1952948582,0.1854687226,0.0332990116,0.0554475095,0.0646780525
0.34,0.2291356109,0.2480054397,0.1976657222,0.1952280739,0.0314698888,0.0527773658,0.0614475731
0.35,0.2297766758,0.2549907058,0.1999575099,0.2050078394,0.0298191659,0.0499828664,0.0582019724
0.36,0.2305215248,0.2618776079,0.2021752155,0.2148062119,0.0283463092,0.047071396,0.0549475165
0.37,0.231370164,0.2686722463,0.2043233868,0.2246216052,0.0270467772,0.0440506411,0.0516912675
0.38,0.2323181452,0.2753812445,0.206406175,0.2344526216,0.0259119701,0.0409286229,0.0484415355
0.39,0.2333565655,0.2820117488,0.2084273787,0.2442980253,0.0249291868,0.0377137236,0.0452082879
0.4,0.2344720677,0.2885714285,0.2103904814,0.2541567192,0.0240815863,0.0344147092,0.0420035119
0.41,0.2356470902,0.2950684439,0.2122986852,0.264027727,0.023348405,0.0310407169,0.0388416545
0.42,0.2368626182,0.3015110964,0.2141549392,0.2739101765,0.022707679,0.02760092,0.0357414251
0.43,0.2381009346,0.3079074786,0.2159619655,0.2838032864,0.0221389692,0.0241041922,0.0327283675
0.44,0.23934587,0.3142654418,0.2177222807,0.2937063549,0.0216235893,0.0205590868,0.0298371525
0.45,0.240582803,0.3205925967,0.2194382166,0.3036187501,0.0211445864,0.0169738466,0.027114664
0.46,0.2417986599,0.3268963131,0.2211119371,0.313539901,0.0206867228,0.0133564121,0.0246238552
0.47,0.2429819149,0.3331837201,0.2227454537,0.3234692911,0.0202364612,0.009714429,0.0224473716
0.48,0.2441225899,0.3394617056,0.2243406394,0.3334064514,0.0197819505,0.0060552542,0.0206879595
0.49,0.2452122548,0.3457369168,0.225899241,0.3433509557,0.0193130138,0.0023859611,0.0194598384
0.5,0.2462440272,0.3520157602,0.2274228899,0.3533024155,0.0188211373,-0.0012866553,0.0188650653
0.51,0.2472125726,0.3583044013,0.2289131121,0.3632604761,0.0182994606,-0.0049560748,0.0189587166
0.52,0.2481141043,0.3646087646,0.2303713366,0.3732248126,0.0177427677,-0.0086160481,0.0197241499
0.53,0.2489463835,0.370934534,0.231798904,0.3831951278,0.0171474795,-0.0122605938,0.0210798058
0.54,0.249708719,0.3772871523,0.233197073,0.3931711482,0.0165116459,-0.0158839959,0.022911477
0.55,0.2504019676,0.3836718216,0.2345670272,0.4031526224,0.0158349404,-0.0194808009,0.0251047195
0.56,0.2510285339,0.3900935031,0.2359098806,0.413139319,0.0151186533,-0.0230458159,0.0275623531
0.57,0.2515923704,0.3965569172,0.2372266833,0.4231310239,0.0143656872,-0.0265741068,0.0302085438
0.58,0.2520989773,0.4030665432,0.2385184258,0.4331275397,0.0135805515,-0.0300609965,0.0329862834
0.59,0.2525554027,0.4096266199,0.2397860439,0.4431286834,0.0127693588,-0.0335020635,0.0358531001
0.6,0.2529702425,0.4162411449,0.2410304221,0.4531342854,0.0119398204,-0.0368931405,0.0387770954
0.61,0.2533535375,0.4229139021,0.2422523976,0.4631441882,0.0111011399,-0.0402302861,0.0417338139
0.62,0.2537156415,0.4296487572,0.2434527636,0.4731582454,0.0102628779,-0.0435094882,0.0447034923
0.63,0.2540660892,0.4364499543,0.2446322719,0.4831763209,0.0094338173,-0.0467263667,0.0476691751
0.64,0.2544134935,0.443322142,0.2457916363,0.4931982878,0.0086218571,-0.0498761458,0.0506158704
0.65,0.2547655452,0.4502703741,0.2469315347,0.5032240274,0.0078340106,-0.0529536533,0.0535300021
0.66,0.2551290135,0.4573001093,0.2480526115,0.5132534292,0.007076402,-0.0559533199,0.0563990201
0.67,0.2555097454,0.4644172113,0.2491554799,0.5232863897,0.0063542655,-0.0588691784,0.0592111211
0.68,0.2559126661,0.4716279486,0.2502407238,0.5333228121,0.0056719423,-0.0616948634,0.061955041
0.69,0.2563417787,0.4789389948,0.2513088995,0.5433626054,0.0050328793,-0.0644236106,0.0646199
0.7,0.2568001647,0.4863574283,0.2523605376,0.5534056846,0.0044396271,-0.0670482563,0.0671950814
0.71,0.2572899835,0.4938907325,0.2533961446,0.5634519696,0.0038938389,-0.0695612371,0.0696701348
0.72,0.2578124725,0.5015467958,0.2544162038,0.5735013853,0.0033962686,-0.0719545895,0.0720346971
0.73,0.2583679473,0.5093339115,0.2554211776,0.5835538609,0.0029467697,-0.0742199495,0.0742784245
0.74,0.2589558015,0.5172607777,0.2564115078,0.5936093299,0.0025442937,-0.0763485522,0.0763909343
0.75,0.259574507,0.5253364977,0.2573876173,0.6036677293,0.0021868897,-0.0783312316,0.078361753
0.76,0.2602216134,0.5335705796,0.2583499109,0.613729,0.0018717025,-0.0801584204,0.0801802696
0.77,0.2608937488,0.5419729364,0.2592987767,0.6237930861,0.0015949721,-0.0818201497,0.0818356941
0.78,0.261586619,0.5505538862,0.2602345864,0.6338599347,0.0013520326,-0.0833060485,0.0833170194
0.79,0.2622950082,0.5593241518,0.2611576969,0.6439294959,0.0011373113,-0.0846053441,0.0846129879
0.8,0.2630127785,0.5682948612,0.2620684504,0.6540017223,0.000944328,-0.0857068611,0.0857120633
0.81,0.2637329725,0.5774778311,0.2629671758,0.6640765693,0.0007657967,-0.0865987382,0.0866021241
0.82,0.2644489405,0.5868886901,0.2638541888,0.6741539943,0.0005947517,-0.0872653041,0.0872673309
0.83,0.2651554673,0.5965500018,0.2647297931,0.6842339571,0.0004256742,-0.0876839553,0.0876849885
0.84,0.2658488747,0.6064915486,0.2655942807,0.6943164195,0.000254594,-0.087824871,0.08782524
0.85,0.2665270216,0.6167503315,0.2664479325,0.7044013453,7.9089e-05,-0.0876510138,0.0876510494
0.86,0.2671893038,0.6273705708,0.2672910191,0.7144886999,-0.0001017153,-0.0871181291,0.0871181885
0.87,0.2678366544,0.6384037051,0.268123801,0.7245784506,-0.0002871466,-0.0861747455,0.0861752239
0.88,0.2684715431,0.6499083924,0.2689465292,0.7346705662,-0.0004749861,-0.0847621738,0.0847635047
0.89,0.2690979771,0.6619505089,0.2697594457,0.744765017,-0.0006614686,-0.082814508,0.0828171497
0.9,0.2697215003,0.6746031502,0.2705627839,0.7548617747,-0.0008412836,-0.0802586244,0.0802630336
0.91,0.2703491937,0.6879466304,0.2713567691,0.7649608123,-0.0010075753,-0.0770141819,0.0770207727
0.92,0.2709896755,0.7020684825,0.2721416185,0.7750621042,-0.001151943,-0.0729936216,0.0730027107
0.93,0.2716531006,0.7170634584,0.2729175421,0.7851656257,-0.0012644415,-0.0681021673,0.0681139046
0.94,0.2723511612,0.7330335287,0.2736847426,0.7952713535,-0.0013335814,-0.0622378248,0.0622521106
0.95,0.2730970865,0.750087883,0.2744434161,0.8053792652,-0.0013463295,-0.0552913822,0.0553077711
0.96,0.2739056427,0.7683429296,0.2751937518,0.8154893393,-0.0012881092,-0.0471464097,0.047164003
0.97,0.2747931328,0.7879222956,0.2759359332,0.8256015555,-0.0011428004,-0.0376792599,0.0376965863
0.98,0.2757773972,0.8089568271,0.2766701373,0.8357158941,-0.0008927401,-0.026759067,0.0267739547
0.99,0.2768778132,0.8315845889,0.2773965359,0.8458323365,-0.0005187227,-0.0142477476,0.0142571871
1,0.2781152949,0.8559508647,0.2781152949,0.8559508646,1e-10,0,1e-10
