xi,s1,s2
0,3.19364386007427e-26,2.29705564443693e-26
0.01,0.00194153591124209,-0.046818775586828
0.02,0.003172994297249,-0.0753378469022318
0.03,0.00414722434455511,-0.0972063532869725
0.04,0.00499226290064997,-0.115700657250188
0.05,0.00575466110423363,-0.132013924667137
0.06,0.00645859188791491,-0.146769321486893
0.07,0.0071186631968607,-0.160343373428344
0.08,0.00774440247004445,-0.172980752056203
0.09,0.00834242433430857,-0.18485139912914
0.1,0.00891752424629872,-0.19607948016505
0.11,0.0094732954267489,-0.206758968293809
0.12,0.0100125267166143,-0.216962995793429
0.13,0.0105374665043127,-0.226749905308527
0.14,0.0110499886376341,-0.236167322565476
0.15,0.0115516928348091,-0.245255041727797
0.16,0.012043970817962,-0.25404720713816
0.17,0.0125280629853844,-0.262574049248656
0.18,0.0130051191450373,-0.270863281370009
0.19,0.0134762635316308,-0.278941176546326
0.2,0.0139426541246632,-0.286833301060154
0.21,0.0144055220565714,-0.294564871875764
0.22,0.0148661791085902,-0.302160727834511
0.23,0.0153259894536377,-0.309644955800671
0.24,0.0157863129018689,-0.317040276536775
0.25,0.016248435591789,-0.3243673413329
0.26,0.0167135073293145,-0.331644102642454
0.27,0.0171825021247539,-0.338885397518173
0.28,0.017656210350807,-0.346102824095825
0.29,0.0181352600893165,-0.35330491501283
0.3,0.0186201565115697,-0.360497546282065
0.31,0.0191113242924069,-0.367684482040997
0.32,0.0196091395328823,-0.37486794739808
0.33,0.020113944067967,-0.382049141672889
0.34,0.0206260439040847,-0.389228642273894
0.35,0.021145700510221,-0.396406686868399
0.36,0.0216731263152374,-0.403583347973038
0.37,0.0222084936491947,-0.410758627929381
0.38,0.0227519598934069,-0.417932503976501
0.39,0.0233037031853997,-0.425104946462347
0.4,0.0238639569320704,-0.432275924648464
0.41,0.0244330300299254,-0.439445407729651
0.42,0.0250113034586738,-0.446613364216108
0.43,0.0255992023489246,-0.453779760629105
0.44,0.026197152896594,-0.460944559925421
0.45,0.0268055405967844,-0.468107720098521
0.46,0.0274246873686926,-0.47526919338879
0.47,0.0280548597927774,-0.482428926369467
0.48,0.0286963094690775,-0.489586860871067
0.49,0.02934933307464,-0.496742935357768
0.5,0.0300143304980461,-0.503897086138555
0.51,0.0306918381034049,-0.511049247776613
0.52,0.0313825213008452,-0.518199352267087
0.53,0.0320871254021752,-0.525347326964588
0.54,0.0328064014229991,-0.532493091725604
0.55,0.0335410355663581,-0.539636556053409
0.56,0.0342916127919276,-0.546777617062151
0.57,0.035058635381154,-0.55391615879158
0.58,0.0358425977790959,-0.561052052834566
0.59,0.0366440955940345,-0.568185159571938
0.6,0.0374639307349554,-0.575315328872551
0.61,0.0383031726306303,-0.58244239909677
0.62,0.0391631483082888,-0.58956619367099
0.63,0.0400453604576665,-0.596686515423047
0.64,0.0409513640517908,-0.60380314054073
0.65,0.0418826537416736,-0.610915816893344
0.66,0.0428406176724173,-0.61802427579677
0.67,0.0438265972533031,-0.625128272130539
0.68,0.0448420585545249,-0.632227674519219
0.69,0.045888840561627,-0.639322631968583
0.7,0.0469694182565176,-0.646413840409945
0.71,0.0480871155743494,-0.653502918952575
0.72,0.0492462264699842,-0.660592880811777
0.73,0.0504520491541061,-0.66768864933609
0.74,0.0517108937724882,-0.67479753426818
0.75,0.0530301603984654,-0.681929563214158
0.76,0.0544185869336454,-0.689097567231987
0.77,0.0558867329793189,-0.696316948888314
0.78,0.057447699926989,-0.703605113854388
0.79,0.0591180139609919,-0.710980609400288
0.8,0.0609185608099328,-0.718462060723216
0.81,0.0628754834663103,-0.726067015194205
0.82,0.0650210405072455,-0.733810792981184
0.83,0.067394565350978,-0.741705397805184
0.84,0.0700438181639015,-0.749758450391287
0.85,0.0730270979129818,-0.757971945732284
0.86,0.0764164346277383,-0.766340390173308
0.87,0.080302003127622,-0.774847544100391
0.88,0.0847975807303616,-0.783460603065809
0.89,0.0900463627517933,-0.792120330212767
0.9,0.0962256623716289,-0.800725646093323
0.91,0.103547905656845,-0.809111624105948
0.92,0.112253888276077,-0.817020750755694
0.93,0.122592730533327,-0.824068617070873
0.94,0.13478282022967,-0.829706467079784
0.95,0.148951867916986,-0.833183455800339
0.96,0.165063488005811,-0.833510612714102
0.97,0.182854329051321,-0.829423134576334
0.98,0.201876973694331,-0.819235811234564
0.99,0.22215505678507,-0.79973285274008
1,0.247213595499958,-0.760845213036123
