xi,s1,s2
0,4.85187603037896e-25,1.95364670027459e-25
0.01,0.0179541079730276,-0.0160189170119377
0.02,0.0343653570178921,-0.0302611990019446
0.03,0.0493722027273616,-0.042888171792539
0.04,0.0631131006942041,-0.0540611612062394
0.05,0.0757265065111878,-0.063941493065564
0.06,0.0873508757710807,-0.0726904931930312
0.07,0.0981246640666509,-0.0804694874111595
0.08,0.108186326990667,-0.087439801542467
0.09,0.117674320135896,-0.0937627614094723
0.1,0.126727099095107,-0.0995996928346937
0.11,0.135465714337074,-0.105088918812076
0.12,0.143941595834602,-0.11027675102127
0.13,0.152188768436499,-0.115186498313353
0.14,0.160241256991577,-0.119841469539402
0.15,0.168133086348646,-0.124264973550495
0.16,0.175898281356515,-0.128480319197708
0.17,0.183570866863995,-0.13251081533212
0.18,0.191184867719896,-0.136379770804807
0.19,0.198774308773029,-0.140110494466846
0.2,0.206373214872203,-0.143726295169315
0.21,0.214009830685951,-0.147246168874277
0.22,0.221689280161695,-0.150671859987735
0.23,0.22941090706658,-0.154000800026679
0.24,0.237174055167751,-0.157230420508098
0.25,0.244978068232352,-0.160358152948982
0.26,0.252822290027527,-0.163381428866319
0.27,0.260706064320421,-0.166297679777099
0.28,0.26862873487818,-0.169104337198311
0.29,0.276589645467946,-0.171798832646946
0.3,0.284588139856865,-0.174378597639991
0.31,0.292623387926798,-0.17684132598208
0.32,0.300693864018465,-0.179185760628417
0.33,0.308797868587306,-0.18141090682185
0.34,0.316933702088757,-0.183515769805227
0.35,0.325099664978257,-0.185499354821397
0.36,0.333294057711242,-0.187360667113206
0.37,0.341515180743152,-0.189098711923504
0.38,0.349761334529423,-0.190712494495138
0.39,0.358030819525493,-0.192201020070956
0.4,0.3663219361868,-0.193563293893805
0.41,0.374632936024197,-0.194798399161862
0.42,0.382961874770202,-0.19590573089461
0.43,0.391306759212746,-0.19688476206686
0.44,0.399665596139762,-0.197734965653422
0.45,0.408036392339184,-0.198455814629109
0.46,0.416417154598942,-0.199046781968732
0.47,0.42480588970697,-0.1995073406471
0.48,0.433200604451201,-0.199836963639025
0.49,0.441599305619567,-0.200035123919319
0.5,0.45,-0.200101294462793
0.51,0.458400694380433,-0.200035123919319
0.52,0.466799395548799,-0.199836963639026
0.53,0.47519411029303,-0.1995073406471
0.54,0.483582845401058,-0.199046781968732
0.55,0.491963607660817,-0.198455814629109
0.56,0.500334403860238,-0.197734965653422
0.57,0.508693240787254,-0.19688476206686
0.58,0.517038125229798,-0.19590573089461
0.59,0.525367063975803,-0.194798399161862
0.6,0.5336780638132,-0.193563293893805
0.61,0.541969180474507,-0.192201020070956
0.62,0.550238665470577,-0.190712494495138
0.63,0.558484819256848,-0.189098711923504
0.64,0.566705942288757,-0.187360667113206
0.65,0.574900335021743,-0.185499354821397
0.66,0.583066297911243,-0.183515769805227
0.67,0.591202131412694,-0.18141090682185
0.68,0.599306135981535,-0.179185760628417
0.69,0.607376612073202,-0.17684132598208
0.7,0.615411860143135,-0.174378597639991
0.71,0.623410354532054,-0.171798832646946
0.72,0.631371265121821,-0.169104337198311
0.73,0.639293935679579,-0.166297679777099
0.74,0.647177709972473,-0.163381428866319
0.75,0.655021931767648,-0.160358152948982
0.76,0.662825944832249,-0.157230420508098
0.77,0.67058909293342,-0.154000800026679
0.78,0.678310719838305,-0.150671859987735
0.79,0.685990169314049,-0.147246168874277
0.8,0.693626785127797,-0.143726295169315
0.81,0.701225691226971,-0.140110494466846
0.82,0.708815132280104,-0.136379770804807
0.83,0.716429133136005,-0.13251081533212
0.84,0.724101718643485,-0.128480319197708
0.85,0.731866913651354,-0.124264973550495
0.86,0.739758743008422,-0.119841469539402
0.87,0.747811231563501,-0.115186498313353
0.88,0.756058404165398,-0.11027675102127
0.89,0.764534285662926,-0.105088918812076
0.9,0.773272900904893,-0.0995996928346936
0.91,0.782325679864104,-0.0937627614094723
0.92,0.791813673009333,-0.087439801542467
0.93,0.801875335933349,-0.0804694874111594
0.94,0.812649124228919,-0.0726904931930313
0.95,0.824273493488812,-0.063941493065564
0.96,0.836886899305796,-0.0540611612062394
0.97,0.850627797272638,-0.0428881717925391
0.98,0.865634642982108,-0.0302611990019446
0.99,0.882045892026972,-0.0160189170119377
1,0.9,-7.30710935725245e-26
