\begin{tikzpicture}[%
    yarn/.style={%
      /cdpr/cable,%
      draw=Black,%
      draw opacity=1.00,%
      fill=Red,%
      fill opacity=0.80,%
    },%
    assembled yarn/.style={%
      /cdpr/cable,%
      draw=Black,%
      draw opacity=1.00,%
      fill=Red,%
      fill opacity=0.60,%
    },%
    strand/.style={%
      /cdpr/cable,%
      draw=Black,%
      draw opacity=1.00,%
      fill=Red,%
      fill opacity=0.40,%
    },%
    rope/.style={%
      /cdpr/cable,%
      draw=Black,%
      draw opacity=1.00,%
      fill=Red,%
      fill opacity=0.20,%
    },%
  ]%
  


\draw[%
    rope,%
  ]%
  (0cm,0cm)%
    circle(1cm);

\draw[%
    strand,%
  ]%
  (-0.3025933883486113cm,-0.6283416453672137cm)%
    circle(0.3025933883486113cm);

\draw[%
    assembled yarn,%
  ]%
  (-0.39415614702090485cm,-0.8184736728794204cm)%
    circle(0.0915627586722935cm);

\draw[%
    yarn,%
  ]%
  (-0.4218624324141003cm,-0.8760063673179305cm)%
    circle(0.027706285393195487cm);

\draw[%
    yarn,%
  ]%
  (-0.3664498616277094cm,-0.8760063673179305cm)%
    circle(0.027706285393195487cm);

\draw[%
    yarn,%
  ]%
  (-0.4564116051941903cm,-0.8326830749526417cm)%
    circle(0.027706285393195487cm);

\draw[%
    yarn,%
  ]%
  (-0.3319006888476194cm,-0.8326830749526417cm)%
    circle(0.027706285393195487cm);

\draw[%
    yarn,%
  ]%
  (-0.39415614702090485cm,-0.8184736728794204cm)%
    circle(0.027706285393195487cm);

\draw[%
    yarn,%
  ]%
  (-0.4440811481898822cm,-0.7786598130072381cm)%
    circle(0.027706285393195487cm);

\draw[%
    yarn,%
  ]%
  (-0.3442311458519275cm,-0.7786598130072381cm)%
    circle(0.027706285393195487cm);

\draw[%
    yarn,%
  ]%
  (-0.39415614702090485cm,-0.7546171996003224cm)%
    circle(0.027706285393195487cm);

\draw[%
    assembled yarn,%
  ]%
  (-0.2110306296763178cm,-0.8184736728794204cm)%
    circle(0.0915627586722935cm);

\draw[%
    yarn,%
  ]%
  (-0.23873691506951328cm,-0.8760063673179305cm)%
    circle(0.027706285393195487cm);

\draw[%
    yarn,%
  ]%
  (-0.18332434428312233cm,-0.8760063673179305cm)%
    circle(0.027706285393195487cm);

\draw[%
    yarn,%
  ]%
  (-0.27328608784960323cm,-0.8326830749526417cm)%
    circle(0.027706285393195487cm);

\draw[%
    yarn,%
  ]%
  (-0.14877517150303235cm,-0.8326830749526417cm)%
    circle(0.027706285393195487cm);

\draw[%
    yarn,%
  ]%
  (-0.2110306296763178cm,-0.8184736728794204cm)%
    circle(0.027706285393195487cm);

\draw[%
    yarn,%
  ]%
  (-0.26095563084529516cm,-0.7786598130072381cm)%
    circle(0.027706285393195487cm);

\draw[%
    yarn,%
  ]%
  (-0.16110562850734048cm,-0.7786598130072381cm)%
    circle(0.027706285393195487cm);

\draw[%
    yarn,%
  ]%
  (-0.2110306296763178cm,-0.7546171996003224cm)%
    circle(0.027706285393195487cm);

\draw[%
    assembled yarn,%
  ]%
  (-0.5083330395453595cm,-0.675300378176177cm)%
    circle(0.0915627586722935cm);

\draw[%
    yarn,%
  ]%
  (-0.536039324938555cm,-0.7328330726146871cm)%
    circle(0.027706285393195487cm);

\draw[%
    yarn,%
  ]%
  (-0.480626754152164cm,-0.7328330726146871cm)%
    circle(0.027706285393195487cm);

\draw[%
    yarn,%
  ]%
  (-0.570588497718645cm,-0.6895097802493984cm)%
    circle(0.027706285393195487cm);

\draw[%
    yarn,%
  ]%
  (-0.44607758137207404cm,-0.6895097802493984cm)%
    circle(0.027706285393195487cm);

\draw[%
    yarn,%
  ]%
  (-0.5083330395453595cm,-0.675300378176177cm)%
    circle(0.027706285393195487cm);

\draw[%
    yarn,%
  ]%
  (-0.5582580407143368cm,-0.6354865183039947cm)%
    circle(0.027706285393195487cm);

\draw[%
    yarn,%
  ]%
  (-0.4584080383763821cm,-0.6354865183039947cm)%
    circle(0.027706285393195487cm);

\draw[%
    yarn,%
  ]%
  (-0.5083330395453595cm,-0.611443904897079cm)%
    circle(0.027706285393195487cm);

\draw[%
    assembled yarn,%
  ]%
  (-0.09685373715186318cm,-0.675300378176177cm)%
    circle(0.0915627586722935cm);

\draw[%
    yarn,%
  ]%
  (-0.12456002254505867cm,-0.7328330726146871cm)%
    circle(0.027706285393195487cm);

\draw[%
    yarn,%
  ]%
  (-0.0691474517586677cm,-0.7328330726146871cm)%
    circle(0.027706285393195487cm);

\draw[%
    yarn,%
  ]%
  (-0.15910919532514864cm,-0.6895097802493984cm)%
    circle(0.027706285393195487cm);

\draw[%
    yarn,%
  ]%
  (-0.034598278978577736cm,-0.6895097802493984cm)%
    circle(0.027706285393195487cm);

\draw[%
    yarn,%
  ]%
  (-0.09685373715186318cm,-0.675300378176177cm)%
    circle(0.027706285393195487cm);

\draw[%
    yarn,%
  ]%
  (-0.1467787383208405cm,-0.6354865183039947cm)%
    circle(0.027706285393195487cm);

\draw[%
    yarn,%
  ]%
  (-0.04692873598288585cm,-0.6354865183039947cm)%
    circle(0.027706285393195487cm);

\draw[%
    yarn,%
  ]%
  (-0.09685373715186318cm,-0.611443904897079cm)%
    circle(0.027706285393195487cm);

\draw[%
    assembled yarn,%
  ]%
  (-0.3025933883486113cm,-0.6283416453672137cm)%
    circle(0.0915627586722935cm);

\draw[%
    yarn,%
  ]%
  (-0.3302996737418068cm,-0.6858743398057238cm)%
    circle(0.027706285393195487cm);

\draw[%
    yarn,%
  ]%
  (-0.27488710295541585cm,-0.6858743398057238cm)%
    circle(0.027706285393195487cm);

\draw[%
    yarn,%
  ]%
  (-0.36484884652189675cm,-0.642551047440435cm)%
    circle(0.027706285393195487cm);

\draw[%
    yarn,%
  ]%
  (-0.24033793017532587cm,-0.642551047440435cm)%
    circle(0.027706285393195487cm);

\draw[%
    yarn,%
  ]%
  (-0.3025933883486113cm,-0.6283416453672137cm)%
    circle(0.027706285393195487cm);

\draw[%
    yarn,%
  ]%
  (-0.3525183895175887cm,-0.5885277854950314cm)%
    circle(0.027706285393195487cm);

\draw[%
    yarn,%
  ]%
  (-0.25266838717963397cm,-0.5885277854950314cm)%
    circle(0.027706285393195487cm);

\draw[%
    yarn,%
  ]%
  (-0.3025933883486113cm,-0.5644851720881157cm)%
    circle(0.027706285393195487cm);

\draw[%
    assembled yarn,%
  ]%
  (-0.4675837783946087cm,-0.49676619988420256cm)%
    circle(0.0915627586722935cm);

\draw[%
    yarn,%
  ]%
  (-0.49529006378780416cm,-0.5542988943227126cm)%
    circle(0.027706285393195487cm);

\draw[%
    yarn,%
  ]%
  (-0.4398774930014132cm,-0.5542988943227126cm)%
    circle(0.027706285393195487cm);

\draw[%
    yarn,%
  ]%
  (-0.5298392365678941cm,-0.5109756019574239cm)%
    circle(0.027706285393195487cm);

\draw[%
    yarn,%
  ]%
  (-0.40532832022132326cm,-0.5109756019574239cm)%
    circle(0.027706285393195487cm);

\draw[%
    yarn,%
  ]%
  (-0.4675837783946087cm,-0.49676619988420256cm)%
    circle(0.027706285393195487cm);

\draw[%
    yarn,%
  ]%
  (-0.517508779563586cm,-0.45695234001202023cm)%
    circle(0.027706285393195487cm);

\draw[%
    yarn,%
  ]%
  (-0.41765877722563133cm,-0.45695234001202023cm)%
    circle(0.027706285393195487cm);

\draw[%
    yarn,%
  ]%
  (-0.4675837783946087cm,-0.4329097266051045cm)%
    circle(0.027706285393195487cm);

\draw[%
    assembled yarn,%
  ]%
  (-0.13760299830261397cm,-0.49676619988420256cm)%
    circle(0.0915627586722935cm);

\draw[%
    yarn,%
  ]%
  (-0.16530928369580944cm,-0.5542988943227126cm)%
    circle(0.027706285393195487cm);

\draw[%
    yarn,%
  ]%
  (-0.10989671290941848cm,-0.5542988943227126cm)%
    circle(0.027706285393195487cm);

\draw[%
    yarn,%
  ]%
  (-0.19985845647589942cm,-0.5109756019574239cm)%
    circle(0.027706285393195487cm);

\draw[%
    yarn,%
  ]%
  (-0.07534754012932851cm,-0.5109756019574239cm)%
    circle(0.027706285393195487cm);

\draw[%
    yarn,%
  ]%
  (-0.13760299830261397cm,-0.49676619988420256cm)%
    circle(0.027706285393195487cm);

\draw[%
    yarn,%
  ]%
  (-0.1875279994715913cm,-0.45695234001202023cm)%
    circle(0.027706285393195487cm);

\draw[%
    yarn,%
  ]%
  (-0.08767799713363664cm,-0.45695234001202023cm)%
    circle(0.027706285393195487cm);

\draw[%
    yarn,%
  ]%
  (-0.13760299830261397cm,-0.4329097266051045cm)%
    circle(0.027706285393195487cm);

\draw[%
    assembled yarn,%
  ]%
  (-0.3025933883486113cm,-0.4173110156908959cm)%
    circle(0.0915627586722935cm);

\draw[%
    yarn,%
  ]%
  (-0.3302996737418068cm,-0.4748437101294059cm)%
    circle(0.027706285393195487cm);

\draw[%
    yarn,%
  ]%
  (-0.27488710295541585cm,-0.4748437101294059cm)%
    circle(0.027706285393195487cm);

\draw[%
    yarn,%
  ]%
  (-0.36484884652189675cm,-0.4315204177641172cm)%
    circle(0.027706285393195487cm);

\draw[%
    yarn,%
  ]%
  (-0.24033793017532587cm,-0.4315204177641172cm)%
    circle(0.027706285393195487cm);

\draw[%
    yarn,%
  ]%
  (-0.3025933883486113cm,-0.4173110156908959cm)%
    circle(0.027706285393195487cm);

\draw[%
    yarn,%
  ]%
  (-0.3525183895175887cm,-0.37749715581871357cm)%
    circle(0.027706285393195487cm);

\draw[%
    yarn,%
  ]%
  (-0.25266838717963397cm,-0.37749715581871357cm)%
    circle(0.027706285393195487cm);

\draw[%
    yarn,%
  ]%
  (-0.3025933883486113cm,-0.35345454241179786cm)%
    circle(0.027706285393195487cm);

\draw[%
    strand,%
  ]%
  (0.3025933883486113cm,-0.6283416453672137cm)%
    circle(0.3025933883486113cm);

\draw[%
    assembled yarn,%
  ]%
  (0.2110306296763178cm,-0.8184736728794204cm)%
    circle(0.0915627586722935cm);

\draw[%
    yarn,%
  ]%
  (0.18332434428312233cm,-0.8760063673179305cm)%
    circle(0.027706285393195487cm);

\draw[%
    yarn,%
  ]%
  (0.23873691506951328cm,-0.8760063673179305cm)%
    circle(0.027706285393195487cm);

\draw[%
    yarn,%
  ]%
  (0.14877517150303235cm,-0.8326830749526417cm)%
    circle(0.027706285393195487cm);

\draw[%
    yarn,%
  ]%
  (0.27328608784960323cm,-0.8326830749526417cm)%
    circle(0.027706285393195487cm);

\draw[%
    yarn,%
  ]%
  (0.2110306296763178cm,-0.8184736728794204cm)%
    circle(0.027706285393195487cm);

\draw[%
    yarn,%
  ]%
  (0.16110562850734048cm,-0.7786598130072381cm)%
    circle(0.027706285393195487cm);

\draw[%
    yarn,%
  ]%
  (0.26095563084529516cm,-0.7786598130072381cm)%
    circle(0.027706285393195487cm);

\draw[%
    yarn,%
  ]%
  (0.2110306296763178cm,-0.7546171996003224cm)%
    circle(0.027706285393195487cm);

\draw[%
    assembled yarn,%
  ]%
  (0.39415614702090485cm,-0.8184736728794204cm)%
    circle(0.0915627586722935cm);

\draw[%
    yarn,%
  ]%
  (0.3664498616277094cm,-0.8760063673179305cm)%
    circle(0.027706285393195487cm);

\draw[%
    yarn,%
  ]%
  (0.4218624324141003cm,-0.8760063673179305cm)%
    circle(0.027706285393195487cm);

\draw[%
    yarn,%
  ]%
  (0.3319006888476194cm,-0.8326830749526417cm)%
    circle(0.027706285393195487cm);

\draw[%
    yarn,%
  ]%
  (0.4564116051941903cm,-0.8326830749526417cm)%
    circle(0.027706285393195487cm);

\draw[%
    yarn,%
  ]%
  (0.39415614702090485cm,-0.8184736728794204cm)%
    circle(0.027706285393195487cm);

\draw[%
    yarn,%
  ]%
  (0.3442311458519275cm,-0.7786598130072381cm)%
    circle(0.027706285393195487cm);

\draw[%
    yarn,%
  ]%
  (0.4440811481898822cm,-0.7786598130072381cm)%
    circle(0.027706285393195487cm);

\draw[%
    yarn,%
  ]%
  (0.39415614702090485cm,-0.7546171996003224cm)%
    circle(0.027706285393195487cm);

\draw[%
    assembled yarn,%
  ]%
  (0.09685373715186318cm,-0.675300378176177cm)%
    circle(0.0915627586722935cm);

\draw[%
    yarn,%
  ]%
  (0.0691474517586677cm,-0.7328330726146871cm)%
    circle(0.027706285393195487cm);

\draw[%
    yarn,%
  ]%
  (0.12456002254505867cm,-0.7328330726146871cm)%
    circle(0.027706285393195487cm);

\draw[%
    yarn,%
  ]%
  (0.034598278978577736cm,-0.6895097802493984cm)%
    circle(0.027706285393195487cm);

\draw[%
    yarn,%
  ]%
  (0.15910919532514864cm,-0.6895097802493984cm)%
    circle(0.027706285393195487cm);

\draw[%
    yarn,%
  ]%
  (0.09685373715186318cm,-0.675300378176177cm)%
    circle(0.027706285393195487cm);

\draw[%
    yarn,%
  ]%
  (0.04692873598288585cm,-0.6354865183039947cm)%
    circle(0.027706285393195487cm);

\draw[%
    yarn,%
  ]%
  (0.1467787383208405cm,-0.6354865183039947cm)%
    circle(0.027706285393195487cm);

\draw[%
    yarn,%
  ]%
  (0.09685373715186318cm,-0.611443904897079cm)%
    circle(0.027706285393195487cm);

\draw[%
    assembled yarn,%
  ]%
  (0.5083330395453595cm,-0.675300378176177cm)%
    circle(0.0915627586722935cm);

\draw[%
    yarn,%
  ]%
  (0.480626754152164cm,-0.7328330726146871cm)%
    circle(0.027706285393195487cm);

\draw[%
    yarn,%
  ]%
  (0.536039324938555cm,-0.7328330726146871cm)%
    circle(0.027706285393195487cm);

\draw[%
    yarn,%
  ]%
  (0.44607758137207404cm,-0.6895097802493984cm)%
    circle(0.027706285393195487cm);

\draw[%
    yarn,%
  ]%
  (0.570588497718645cm,-0.6895097802493984cm)%
    circle(0.027706285393195487cm);

\draw[%
    yarn,%
  ]%
  (0.5083330395453595cm,-0.675300378176177cm)%
    circle(0.027706285393195487cm);

\draw[%
    yarn,%
  ]%
  (0.4584080383763821cm,-0.6354865183039947cm)%
    circle(0.027706285393195487cm);

\draw[%
    yarn,%
  ]%
  (0.5582580407143368cm,-0.6354865183039947cm)%
    circle(0.027706285393195487cm);

\draw[%
    yarn,%
  ]%
  (0.5083330395453595cm,-0.611443904897079cm)%
    circle(0.027706285393195487cm);

\draw[%
    assembled yarn,%
  ]%
  (0.3025933883486113cm,-0.6283416453672137cm)%
    circle(0.0915627586722935cm);

\draw[%
    yarn,%
  ]%
  (0.27488710295541585cm,-0.6858743398057238cm)%
    circle(0.027706285393195487cm);

\draw[%
    yarn,%
  ]%
  (0.3302996737418068cm,-0.6858743398057238cm)%
    circle(0.027706285393195487cm);

\draw[%
    yarn,%
  ]%
  (0.24033793017532587cm,-0.642551047440435cm)%
    circle(0.027706285393195487cm);

\draw[%
    yarn,%
  ]%
  (0.36484884652189675cm,-0.642551047440435cm)%
    circle(0.027706285393195487cm);

\draw[%
    yarn,%
  ]%
  (0.3025933883486113cm,-0.6283416453672137cm)%
    circle(0.027706285393195487cm);

\draw[%
    yarn,%
  ]%
  (0.25266838717963397cm,-0.5885277854950314cm)%
    circle(0.027706285393195487cm);

\draw[%
    yarn,%
  ]%
  (0.3525183895175887cm,-0.5885277854950314cm)%
    circle(0.027706285393195487cm);

\draw[%
    yarn,%
  ]%
  (0.3025933883486113cm,-0.5644851720881157cm)%
    circle(0.027706285393195487cm);

\draw[%
    assembled yarn,%
  ]%
  (0.13760299830261397cm,-0.49676619988420256cm)%
    circle(0.0915627586722935cm);

\draw[%
    yarn,%
  ]%
  (0.10989671290941848cm,-0.5542988943227126cm)%
    circle(0.027706285393195487cm);

\draw[%
    yarn,%
  ]%
  (0.16530928369580944cm,-0.5542988943227126cm)%
    circle(0.027706285393195487cm);

\draw[%
    yarn,%
  ]%
  (0.07534754012932851cm,-0.5109756019574239cm)%
    circle(0.027706285393195487cm);

\draw[%
    yarn,%
  ]%
  (0.19985845647589942cm,-0.5109756019574239cm)%
    circle(0.027706285393195487cm);

\draw[%
    yarn,%
  ]%
  (0.13760299830261397cm,-0.49676619988420256cm)%
    circle(0.027706285393195487cm);

\draw[%
    yarn,%
  ]%
  (0.08767799713363664cm,-0.45695234001202023cm)%
    circle(0.027706285393195487cm);

\draw[%
    yarn,%
  ]%
  (0.1875279994715913cm,-0.45695234001202023cm)%
    circle(0.027706285393195487cm);

\draw[%
    yarn,%
  ]%
  (0.13760299830261397cm,-0.4329097266051045cm)%
    circle(0.027706285393195487cm);

\draw[%
    assembled yarn,%
  ]%
  (0.4675837783946087cm,-0.49676619988420256cm)%
    circle(0.0915627586722935cm);

\draw[%
    yarn,%
  ]%
  (0.4398774930014132cm,-0.5542988943227126cm)%
    circle(0.027706285393195487cm);

\draw[%
    yarn,%
  ]%
  (0.49529006378780416cm,-0.5542988943227126cm)%
    circle(0.027706285393195487cm);

\draw[%
    yarn,%
  ]%
  (0.40532832022132326cm,-0.5109756019574239cm)%
    circle(0.027706285393195487cm);

\draw[%
    yarn,%
  ]%
  (0.5298392365678941cm,-0.5109756019574239cm)%
    circle(0.027706285393195487cm);

\draw[%
    yarn,%
  ]%
  (0.4675837783946087cm,-0.49676619988420256cm)%
    circle(0.027706285393195487cm);

\draw[%
    yarn,%
  ]%
  (0.41765877722563133cm,-0.45695234001202023cm)%
    circle(0.027706285393195487cm);

\draw[%
    yarn,%
  ]%
  (0.517508779563586cm,-0.45695234001202023cm)%
    circle(0.027706285393195487cm);

\draw[%
    yarn,%
  ]%
  (0.4675837783946087cm,-0.4329097266051045cm)%
    circle(0.027706285393195487cm);

\draw[%
    assembled yarn,%
  ]%
  (0.3025933883486113cm,-0.4173110156908959cm)%
    circle(0.0915627586722935cm);

\draw[%
    yarn,%
  ]%
  (0.27488710295541585cm,-0.4748437101294059cm)%
    circle(0.027706285393195487cm);

\draw[%
    yarn,%
  ]%
  (0.3302996737418068cm,-0.4748437101294059cm)%
    circle(0.027706285393195487cm);

\draw[%
    yarn,%
  ]%
  (0.24033793017532587cm,-0.4315204177641172cm)%
    circle(0.027706285393195487cm);

\draw[%
    yarn,%
  ]%
  (0.36484884652189675cm,-0.4315204177641172cm)%
    circle(0.027706285393195487cm);

\draw[%
    yarn,%
  ]%
  (0.3025933883486113cm,-0.4173110156908959cm)%
    circle(0.027706285393195487cm);

\draw[%
    yarn,%
  ]%
  (0.25266838717963397cm,-0.37749715581871357cm)%
    circle(0.027706285393195487cm);

\draw[%
    yarn,%
  ]%
  (0.3525183895175887cm,-0.37749715581871357cm)%
    circle(0.027706285393195487cm);

\draw[%
    yarn,%
  ]%
  (0.3025933883486113cm,-0.35345454241179786cm)%
    circle(0.027706285393195487cm);

\draw[%
    strand,%
  ]%
  (-0.6799211718390883cm,-0.15518757057197566cm)%
    circle(0.3025933883486113cm);

\draw[%
    assembled yarn,%
  ]%
  (-0.7714839305113818cm,-0.34531959808418233cm)%
    circle(0.0915627586722935cm);

\draw[%
    yarn,%
  ]%
  (-0.7991902159045773cm,-0.40285229252269233cm)%
    circle(0.027706285393195487cm);

\draw[%
    yarn,%
  ]%
  (-0.7437776451181862cm,-0.40285229252269233cm)%
    circle(0.027706285393195487cm);

\draw[%
    yarn,%
  ]%
  (-0.8337393886846672cm,-0.35952900015740363cm)%
    circle(0.027706285393195487cm);

\draw[%
    yarn,%
  ]%
  (-0.7092284723380963cm,-0.35952900015740363cm)%
    circle(0.027706285393195487cm);

\draw[%
    yarn,%
  ]%
  (-0.7714839305113818cm,-0.34531959808418233cm)%
    circle(0.027706285393195487cm);

\draw[%
    yarn,%
  ]%
  (-0.8214089316803591cm,-0.305505738212cm)%
    circle(0.027706285393195487cm);

\draw[%
    yarn,%
  ]%
  (-0.7215589293424044cm,-0.305505738212cm)%
    circle(0.027706285393195487cm);

\draw[%
    yarn,%
  ]%
  (-0.7714839305113818cm,-0.2814631248050843cm)%
    circle(0.027706285393195487cm);

\draw[%
    assembled yarn,%
  ]%
  (-0.5883584131667948cm,-0.34531959808418233cm)%
    circle(0.0915627586722935cm);

\draw[%
    yarn,%
  ]%
  (-0.6160646985599904cm,-0.40285229252269233cm)%
    circle(0.027706285393195487cm);

\draw[%
    yarn,%
  ]%
  (-0.5606521277735993cm,-0.40285229252269233cm)%
    circle(0.027706285393195487cm);

\draw[%
    yarn,%
  ]%
  (-0.6506138713400803cm,-0.35952900015740363cm)%
    circle(0.027706285393195487cm);

\draw[%
    yarn,%
  ]%
  (-0.5261029549935093cm,-0.35952900015740363cm)%
    circle(0.027706285393195487cm);

\draw[%
    yarn,%
  ]%
  (-0.5883584131667948cm,-0.34531959808418233cm)%
    circle(0.027706285393195487cm);

\draw[%
    yarn,%
  ]%
  (-0.6382834143357722cm,-0.305505738212cm)%
    circle(0.027706285393195487cm);

\draw[%
    yarn,%
  ]%
  (-0.5384334119978175cm,-0.305505738212cm)%
    circle(0.027706285393195487cm);

\draw[%
    yarn,%
  ]%
  (-0.5883584131667948cm,-0.2814631248050843cm)%
    circle(0.027706285393195487cm);

\draw[%
    assembled yarn,%
  ]%
  (-0.8856608230358365cm,-0.20214630338093903cm)%
    circle(0.0915627586722935cm);

\draw[%
    yarn,%
  ]%
  (-0.913367108429032cm,-0.25967899781944903cm)%
    circle(0.027706285393195487cm);

\draw[%
    yarn,%
  ]%
  (-0.857954537642641cm,-0.25967899781944903cm)%
    circle(0.027706285393195487cm);

\draw[%
    yarn,%
  ]%
  (-0.947916281209122cm,-0.21635570545416036cm)%
    circle(0.027706285393195487cm);

\draw[%
    yarn,%
  ]%
  (-0.823405364862551cm,-0.21635570545416036cm)%
    circle(0.027706285393195487cm);

\draw[%
    yarn,%
  ]%
  (-0.8856608230358365cm,-0.20214630338093903cm)%
    circle(0.027706285393195487cm);

\draw[%
    yarn,%
  ]%
  (-0.9355858242048138cm,-0.1623324435087567cm)%
    circle(0.027706285393195487cm);

\draw[%
    yarn,%
  ]%
  (-0.8357358218668591cm,-0.1623324435087567cm)%
    circle(0.027706285393195487cm);

\draw[%
    yarn,%
  ]%
  (-0.8856608230358365cm,-0.138289830101841cm)%
    circle(0.027706285393195487cm);

\draw[%
    assembled yarn,%
  ]%
  (-0.47418152064234015cm,-0.20214630338093903cm)%
    circle(0.0915627586722935cm);

\draw[%
    yarn,%
  ]%
  (-0.5018878060355356cm,-0.25967899781944903cm)%
    circle(0.027706285393195487cm);

\draw[%
    yarn,%
  ]%
  (-0.4464752352491447cm,-0.25967899781944903cm)%
    circle(0.027706285393195487cm);

\draw[%
    yarn,%
  ]%
  (-0.5364369788156256cm,-0.21635570545416036cm)%
    circle(0.027706285393195487cm);

\draw[%
    yarn,%
  ]%
  (-0.4119260624690547cm,-0.21635570545416036cm)%
    circle(0.027706285393195487cm);

\draw[%
    yarn,%
  ]%
  (-0.47418152064234015cm,-0.20214630338093903cm)%
    circle(0.027706285393195487cm);

\draw[%
    yarn,%
  ]%
  (-0.5241065218113174cm,-0.1623324435087567cm)%
    circle(0.027706285393195487cm);

\draw[%
    yarn,%
  ]%
  (-0.4242565194733628cm,-0.1623324435087567cm)%
    circle(0.027706285393195487cm);

\draw[%
    yarn,%
  ]%
  (-0.47418152064234015cm,-0.138289830101841cm)%
    circle(0.027706285393195487cm);

\draw[%
    assembled yarn,%
  ]%
  (-0.6799211718390883cm,-0.15518757057197566cm)%
    circle(0.0915627586722935cm);

\draw[%
    yarn,%
  ]%
  (-0.7076274572322838cm,-0.2127202650104857cm)%
    circle(0.027706285393195487cm);

\draw[%
    yarn,%
  ]%
  (-0.6522148864458928cm,-0.2127202650104857cm)%
    circle(0.027706285393195487cm);

\draw[%
    yarn,%
  ]%
  (-0.7421766300123738cm,-0.16939697264519699cm)%
    circle(0.027706285393195487cm);

\draw[%
    yarn,%
  ]%
  (-0.6176657136658028cm,-0.16939697264519699cm)%
    circle(0.027706285393195487cm);

\draw[%
    yarn,%
  ]%
  (-0.6799211718390883cm,-0.15518757057197566cm)%
    circle(0.027706285393195487cm);

\draw[%
    yarn,%
  ]%
  (-0.7298461730080656cm,-0.11537371069979332cm)%
    circle(0.027706285393195487cm);

\draw[%
    yarn,%
  ]%
  (-0.6299961706701109cm,-0.11537371069979332cm)%
    circle(0.027706285393195487cm);

\draw[%
    yarn,%
  ]%
  (-0.6799211718390883cm,-0.09133109729287764cm)%
    circle(0.027706285393195487cm);

\draw[%
    assembled yarn,%
  ]%
  (-0.8449115618850856cm,-0.023612125088964486cm)%
    circle(0.0915627586722935cm);

\draw[%
    yarn,%
  ]%
  (-0.8726178472782812cm,-0.0811448195274745cm)%
    circle(0.027706285393195487cm);

\draw[%
    yarn,%
  ]%
  (-0.8172052764918901cm,-0.0811448195274745cm)%
    circle(0.027706285393195487cm);

\draw[%
    yarn,%
  ]%
  (-0.9071670200583711cm,-0.037821527162185814cm)%
    circle(0.027706285393195487cm);

\draw[%
    yarn,%
  ]%
  (-0.7826561037118002cm,-0.037821527162185814cm)%
    circle(0.027706285393195487cm);

\draw[%
    yarn,%
  ]%
  (-0.8449115618850856cm,-0.023612125088964486cm)%
    circle(0.027706285393195487cm);

\draw[%
    yarn,%
  ]%
  (-0.894836563054063cm,0.016201734783217854cm)%
    circle(0.027706285393195487cm);

\draw[%
    yarn,%
  ]%
  (-0.7949865607161083cm,0.016201734783217854cm)%
    circle(0.027706285393195487cm);

\draw[%
    yarn,%
  ]%
  (-0.8449115618850856cm,0.04024434819013353cm)%
    circle(0.027706285393195487cm);

\draw[%
    assembled yarn,%
  ]%
  (-0.5149307817930909cm,-0.023612125088964486cm)%
    circle(0.0915627586722935cm);

\draw[%
    yarn,%
  ]%
  (-0.5426370671862865cm,-0.0811448195274745cm)%
    circle(0.027706285393195487cm);

\draw[%
    yarn,%
  ]%
  (-0.48722449639989546cm,-0.0811448195274745cm)%
    circle(0.027706285393195487cm);

\draw[%
    yarn,%
  ]%
  (-0.5771862399663764cm,-0.037821527162185814cm)%
    circle(0.027706285393195487cm);

\draw[%
    yarn,%
  ]%
  (-0.4526753236198055cm,-0.037821527162185814cm)%
    circle(0.027706285393195487cm);

\draw[%
    yarn,%
  ]%
  (-0.5149307817930909cm,-0.023612125088964486cm)%
    circle(0.027706285393195487cm);

\draw[%
    yarn,%
  ]%
  (-0.5648557829620683cm,0.016201734783217854cm)%
    circle(0.027706285393195487cm);

\draw[%
    yarn,%
  ]%
  (-0.4650057806241136cm,0.016201734783217854cm)%
    circle(0.027706285393195487cm);

\draw[%
    yarn,%
  ]%
  (-0.5149307817930909cm,0.04024434819013353cm)%
    circle(0.027706285393195487cm);

\draw[%
    assembled yarn,%
  ]%
  (-0.6799211718390883cm,0.055843059104342174cm)%
    circle(0.0915627586722935cm);

\draw[%
    yarn,%
  ]%
  (-0.7076274572322838cm,-0.001689635334167841cm)%
    circle(0.027706285393195487cm);

\draw[%
    yarn,%
  ]%
  (-0.6522148864458928cm,-0.001689635334167841cm)%
    circle(0.027706285393195487cm);

\draw[%
    yarn,%
  ]%
  (-0.7421766300123738cm,0.041633657031120846cm)%
    circle(0.027706285393195487cm);

\draw[%
    yarn,%
  ]%
  (-0.6176657136658028cm,0.041633657031120846cm)%
    circle(0.027706285393195487cm);

\draw[%
    yarn,%
  ]%
  (-0.6799211718390883cm,0.055843059104342174cm)%
    circle(0.027706285393195487cm);

\draw[%
    yarn,%
  ]%
  (-0.7298461730080656cm,0.09565691897652451cm)%
    circle(0.027706285393195487cm);

\draw[%
    yarn,%
  ]%
  (-0.6299961706701109cm,0.09565691897652451cm)%
    circle(0.027706285393195487cm);

\draw[%
    yarn,%
  ]%
  (-0.6799211718390883cm,0.1196995323834402cm)%
    circle(0.027706285393195487cm);

\draw[%
    strand,%
  ]%
  (0.6799211718390883cm,-0.15518757057197566cm)%
    circle(0.3025933883486113cm);

\draw[%
    assembled yarn,%
  ]%
  (0.5883584131667948cm,-0.34531959808418233cm)%
    circle(0.0915627586722935cm);

\draw[%
    yarn,%
  ]%
  (0.5606521277735993cm,-0.40285229252269233cm)%
    circle(0.027706285393195487cm);

\draw[%
    yarn,%
  ]%
  (0.6160646985599904cm,-0.40285229252269233cm)%
    circle(0.027706285393195487cm);

\draw[%
    yarn,%
  ]%
  (0.5261029549935093cm,-0.35952900015740363cm)%
    circle(0.027706285393195487cm);

\draw[%
    yarn,%
  ]%
  (0.6506138713400803cm,-0.35952900015740363cm)%
    circle(0.027706285393195487cm);

\draw[%
    yarn,%
  ]%
  (0.5883584131667948cm,-0.34531959808418233cm)%
    circle(0.027706285393195487cm);

\draw[%
    yarn,%
  ]%
  (0.5384334119978175cm,-0.305505738212cm)%
    circle(0.027706285393195487cm);

\draw[%
    yarn,%
  ]%
  (0.6382834143357722cm,-0.305505738212cm)%
    circle(0.027706285393195487cm);

\draw[%
    yarn,%
  ]%
  (0.5883584131667948cm,-0.2814631248050843cm)%
    circle(0.027706285393195487cm);

\draw[%
    assembled yarn,%
  ]%
  (0.7714839305113818cm,-0.34531959808418233cm)%
    circle(0.0915627586722935cm);

\draw[%
    yarn,%
  ]%
  (0.7437776451181862cm,-0.40285229252269233cm)%
    circle(0.027706285393195487cm);

\draw[%
    yarn,%
  ]%
  (0.7991902159045773cm,-0.40285229252269233cm)%
    circle(0.027706285393195487cm);

\draw[%
    yarn,%
  ]%
  (0.7092284723380963cm,-0.35952900015740363cm)%
    circle(0.027706285393195487cm);

\draw[%
    yarn,%
  ]%
  (0.8337393886846672cm,-0.35952900015740363cm)%
    circle(0.027706285393195487cm);

\draw[%
    yarn,%
  ]%
  (0.7714839305113818cm,-0.34531959808418233cm)%
    circle(0.027706285393195487cm);

\draw[%
    yarn,%
  ]%
  (0.7215589293424044cm,-0.305505738212cm)%
    circle(0.027706285393195487cm);

\draw[%
    yarn,%
  ]%
  (0.8214089316803591cm,-0.305505738212cm)%
    circle(0.027706285393195487cm);

\draw[%
    yarn,%
  ]%
  (0.7714839305113818cm,-0.2814631248050843cm)%
    circle(0.027706285393195487cm);

\draw[%
    assembled yarn,%
  ]%
  (0.47418152064234015cm,-0.20214630338093903cm)%
    circle(0.0915627586722935cm);

\draw[%
    yarn,%
  ]%
  (0.4464752352491447cm,-0.25967899781944903cm)%
    circle(0.027706285393195487cm);

\draw[%
    yarn,%
  ]%
  (0.5018878060355356cm,-0.25967899781944903cm)%
    circle(0.027706285393195487cm);

\draw[%
    yarn,%
  ]%
  (0.4119260624690547cm,-0.21635570545416036cm)%
    circle(0.027706285393195487cm);

\draw[%
    yarn,%
  ]%
  (0.5364369788156256cm,-0.21635570545416036cm)%
    circle(0.027706285393195487cm);

\draw[%
    yarn,%
  ]%
  (0.47418152064234015cm,-0.20214630338093903cm)%
    circle(0.027706285393195487cm);

\draw[%
    yarn,%
  ]%
  (0.4242565194733628cm,-0.1623324435087567cm)%
    circle(0.027706285393195487cm);

\draw[%
    yarn,%
  ]%
  (0.5241065218113174cm,-0.1623324435087567cm)%
    circle(0.027706285393195487cm);

\draw[%
    yarn,%
  ]%
  (0.47418152064234015cm,-0.138289830101841cm)%
    circle(0.027706285393195487cm);

\draw[%
    assembled yarn,%
  ]%
  (0.8856608230358365cm,-0.20214630338093903cm)%
    circle(0.0915627586722935cm);

\draw[%
    yarn,%
  ]%
  (0.857954537642641cm,-0.25967899781944903cm)%
    circle(0.027706285393195487cm);

\draw[%
    yarn,%
  ]%
  (0.913367108429032cm,-0.25967899781944903cm)%
    circle(0.027706285393195487cm);

\draw[%
    yarn,%
  ]%
  (0.823405364862551cm,-0.21635570545416036cm)%
    circle(0.027706285393195487cm);

\draw[%
    yarn,%
  ]%
  (0.947916281209122cm,-0.21635570545416036cm)%
    circle(0.027706285393195487cm);

\draw[%
    yarn,%
  ]%
  (0.8856608230358365cm,-0.20214630338093903cm)%
    circle(0.027706285393195487cm);

\draw[%
    yarn,%
  ]%
  (0.8357358218668591cm,-0.1623324435087567cm)%
    circle(0.027706285393195487cm);

\draw[%
    yarn,%
  ]%
  (0.9355858242048138cm,-0.1623324435087567cm)%
    circle(0.027706285393195487cm);

\draw[%
    yarn,%
  ]%
  (0.8856608230358365cm,-0.138289830101841cm)%
    circle(0.027706285393195487cm);

\draw[%
    assembled yarn,%
  ]%
  (0.6799211718390883cm,-0.15518757057197566cm)%
    circle(0.0915627586722935cm);

\draw[%
    yarn,%
  ]%
  (0.6522148864458928cm,-0.2127202650104857cm)%
    circle(0.027706285393195487cm);

\draw[%
    yarn,%
  ]%
  (0.7076274572322838cm,-0.2127202650104857cm)%
    circle(0.027706285393195487cm);

\draw[%
    yarn,%
  ]%
  (0.6176657136658028cm,-0.16939697264519699cm)%
    circle(0.027706285393195487cm);

\draw[%
    yarn,%
  ]%
  (0.7421766300123738cm,-0.16939697264519699cm)%
    circle(0.027706285393195487cm);

\draw[%
    yarn,%
  ]%
  (0.6799211718390883cm,-0.15518757057197566cm)%
    circle(0.027706285393195487cm);

\draw[%
    yarn,%
  ]%
  (0.6299961706701109cm,-0.11537371069979332cm)%
    circle(0.027706285393195487cm);

\draw[%
    yarn,%
  ]%
  (0.7298461730080656cm,-0.11537371069979332cm)%
    circle(0.027706285393195487cm);

\draw[%
    yarn,%
  ]%
  (0.6799211718390883cm,-0.09133109729287764cm)%
    circle(0.027706285393195487cm);

\draw[%
    assembled yarn,%
  ]%
  (0.5149307817930909cm,-0.023612125088964486cm)%
    circle(0.0915627586722935cm);

\draw[%
    yarn,%
  ]%
  (0.48722449639989546cm,-0.0811448195274745cm)%
    circle(0.027706285393195487cm);

\draw[%
    yarn,%
  ]%
  (0.5426370671862865cm,-0.0811448195274745cm)%
    circle(0.027706285393195487cm);

\draw[%
    yarn,%
  ]%
  (0.4526753236198055cm,-0.037821527162185814cm)%
    circle(0.027706285393195487cm);

\draw[%
    yarn,%
  ]%
  (0.5771862399663764cm,-0.037821527162185814cm)%
    circle(0.027706285393195487cm);

\draw[%
    yarn,%
  ]%
  (0.5149307817930909cm,-0.023612125088964486cm)%
    circle(0.027706285393195487cm);

\draw[%
    yarn,%
  ]%
  (0.4650057806241136cm,0.016201734783217854cm)%
    circle(0.027706285393195487cm);

\draw[%
    yarn,%
  ]%
  (0.5648557829620683cm,0.016201734783217854cm)%
    circle(0.027706285393195487cm);

\draw[%
    yarn,%
  ]%
  (0.5149307817930909cm,0.04024434819013353cm)%
    circle(0.027706285393195487cm);

\draw[%
    assembled yarn,%
  ]%
  (0.8449115618850856cm,-0.023612125088964486cm)%
    circle(0.0915627586722935cm);

\draw[%
    yarn,%
  ]%
  (0.8172052764918901cm,-0.0811448195274745cm)%
    circle(0.027706285393195487cm);

\draw[%
    yarn,%
  ]%
  (0.8726178472782812cm,-0.0811448195274745cm)%
    circle(0.027706285393195487cm);

\draw[%
    yarn,%
  ]%
  (0.7826561037118002cm,-0.037821527162185814cm)%
    circle(0.027706285393195487cm);

\draw[%
    yarn,%
  ]%
  (0.9071670200583711cm,-0.037821527162185814cm)%
    circle(0.027706285393195487cm);

\draw[%
    yarn,%
  ]%
  (0.8449115618850856cm,-0.023612125088964486cm)%
    circle(0.027706285393195487cm);

\draw[%
    yarn,%
  ]%
  (0.7949865607161083cm,0.016201734783217854cm)%
    circle(0.027706285393195487cm);

\draw[%
    yarn,%
  ]%
  (0.894836563054063cm,0.016201734783217854cm)%
    circle(0.027706285393195487cm);

\draw[%
    yarn,%
  ]%
  (0.8449115618850856cm,0.04024434819013353cm)%
    circle(0.027706285393195487cm);

\draw[%
    assembled yarn,%
  ]%
  (0.6799211718390883cm,0.055843059104342174cm)%
    circle(0.0915627586722935cm);

\draw[%
    yarn,%
  ]%
  (0.6522148864458928cm,-0.001689635334167841cm)%
    circle(0.027706285393195487cm);

\draw[%
    yarn,%
  ]%
  (0.7076274572322838cm,-0.001689635334167841cm)%
    circle(0.027706285393195487cm);

\draw[%
    yarn,%
  ]%
  (0.6176657136658028cm,0.041633657031120846cm)%
    circle(0.027706285393195487cm);

\draw[%
    yarn,%
  ]%
  (0.7421766300123738cm,0.041633657031120846cm)%
    circle(0.027706285393195487cm);

\draw[%
    yarn,%
  ]%
  (0.6799211718390883cm,0.055843059104342174cm)%
    circle(0.027706285393195487cm);

\draw[%
    yarn,%
  ]%
  (0.6299961706701109cm,0.09565691897652451cm)%
    circle(0.027706285393195487cm);

\draw[%
    yarn,%
  ]%
  (0.7298461730080656cm,0.09565691897652451cm)%
    circle(0.027706285393195487cm);

\draw[%
    yarn,%
  ]%
  (0.6799211718390883cm,0.1196995323834402cm)%
    circle(0.027706285393195487cm);

\draw[%
    strand,%
  ]%
  (0.0cm,0.0cm)%
    circle(0.3025933883486113cm);

\draw[%
    assembled yarn,%
  ]%
  (-0.0915627586722935cm,-0.1901320275122067cm)%
    circle(0.0915627586722935cm);

\draw[%
    yarn,%
  ]%
  (-0.119269044065489cm,-0.2476647219507167cm)%
    circle(0.027706285393195487cm);

\draw[%
    yarn,%
  ]%
  (-0.06385647327909802cm,-0.2476647219507167cm)%
    circle(0.027706285393195487cm);

\draw[%
    yarn,%
  ]%
  (-0.15381821684557895cm,-0.20434142958542803cm)%
    circle(0.027706285393195487cm);

\draw[%
    yarn,%
  ]%
  (-0.02930730049900806cm,-0.20434142958542803cm)%
    circle(0.027706285393195487cm);

\draw[%
    yarn,%
  ]%
  (-0.0915627586722935cm,-0.1901320275122067cm)%
    circle(0.027706285393195487cm);

\draw[%
    yarn,%
  ]%
  (-0.14148775984127085cm,-0.15031816764002437cm)%
    circle(0.027706285393195487cm);

\draw[%
    yarn,%
  ]%
  (-0.04163775750331617cm,-0.15031816764002437cm)%
    circle(0.027706285393195487cm);

\draw[%
    yarn,%
  ]%
  (-0.0915627586722935cm,-0.12627555423310868cm)%
    circle(0.027706285393195487cm);

\draw[%
    assembled yarn,%
  ]%
  (0.0915627586722935cm,-0.1901320275122067cm)%
    circle(0.0915627586722935cm);

\draw[%
    yarn,%
  ]%
  (0.06385647327909802cm,-0.2476647219507167cm)%
    circle(0.027706285393195487cm);

\draw[%
    yarn,%
  ]%
  (0.119269044065489cm,-0.2476647219507167cm)%
    circle(0.027706285393195487cm);

\draw[%
    yarn,%
  ]%
  (0.02930730049900806cm,-0.20434142958542803cm)%
    circle(0.027706285393195487cm);

\draw[%
    yarn,%
  ]%
  (0.15381821684557895cm,-0.20434142958542803cm)%
    circle(0.027706285393195487cm);

\draw[%
    yarn,%
  ]%
  (0.0915627586722935cm,-0.1901320275122067cm)%
    circle(0.027706285393195487cm);

\draw[%
    yarn,%
  ]%
  (0.04163775750331617cm,-0.15031816764002437cm)%
    circle(0.027706285393195487cm);

\draw[%
    yarn,%
  ]%
  (0.14148775984127085cm,-0.15031816764002437cm)%
    circle(0.027706285393195487cm);

\draw[%
    yarn,%
  ]%
  (0.0915627586722935cm,-0.12627555423310868cm)%
    circle(0.027706285393195487cm);

\draw[%
    assembled yarn,%
  ]%
  (-0.20573965119674814cm,-0.04695873280896336cm)%
    circle(0.0915627586722935cm);

\draw[%
    yarn,%
  ]%
  (-0.23344593658994361cm,-0.10449142724747337cm)%
    circle(0.027706285393195487cm);

\draw[%
    yarn,%
  ]%
  (-0.17803336580355267cm,-0.10449142724747337cm)%
    circle(0.027706285393195487cm);

\draw[%
    yarn,%
  ]%
  (-0.26799510937003357cm,-0.061168134882184685cm)%
    circle(0.027706285393195487cm);

\draw[%
    yarn,%
  ]%
  (-0.14348419302346269cm,-0.061168134882184685cm)%
    circle(0.027706285393195487cm);

\draw[%
    yarn,%
  ]%
  (-0.20573965119674814cm,-0.04695873280896336cm)%
    circle(0.027706285393195487cm);

\draw[%
    yarn,%
  ]%
  (-0.2556646523657255cm,-0.007144872936781017cm)%
    circle(0.027706285393195487cm);

\draw[%
    yarn,%
  ]%
  (-0.1558146500277708cm,-0.007144872936781017cm)%
    circle(0.027706285393195487cm);

\draw[%
    yarn,%
  ]%
  (-0.20573965119674814cm,0.016897740470134662cm)%
    circle(0.027706285393195487cm);

\draw[%
    assembled yarn,%
  ]%
  (0.20573965119674814cm,-0.04695873280896336cm)%
    circle(0.0915627586722935cm);

\draw[%
    yarn,%
  ]%
  (0.17803336580355267cm,-0.10449142724747337cm)%
    circle(0.027706285393195487cm);

\draw[%
    yarn,%
  ]%
  (0.23344593658994361cm,-0.10449142724747337cm)%
    circle(0.027706285393195487cm);

\draw[%
    yarn,%
  ]%
  (0.14348419302346269cm,-0.061168134882184685cm)%
    circle(0.027706285393195487cm);

\draw[%
    yarn,%
  ]%
  (0.26799510937003357cm,-0.061168134882184685cm)%
    circle(0.027706285393195487cm);

\draw[%
    yarn,%
  ]%
  (0.20573965119674814cm,-0.04695873280896336cm)%
    circle(0.027706285393195487cm);

\draw[%
    yarn,%
  ]%
  (0.1558146500277708cm,-0.007144872936781017cm)%
    circle(0.027706285393195487cm);

\draw[%
    yarn,%
  ]%
  (0.2556646523657255cm,-0.007144872936781017cm)%
    circle(0.027706285393195487cm);

\draw[%
    yarn,%
  ]%
  (0.20573965119674814cm,0.016897740470134662cm)%
    circle(0.027706285393195487cm);

\draw[%
    assembled yarn,%
  ]%
  (0.0cm,0.0cm)%
    circle(0.0915627586722935cm);

\draw[%
    yarn,%
  ]%
  (-0.027706285393195487cm,-0.057532694438510015cm)%
    circle(0.027706285393195487cm);

\draw[%
    yarn,%
  ]%
  (0.027706285393195487cm,-0.057532694438510015cm)%
    circle(0.027706285393195487cm);

\draw[%
    yarn,%
  ]%
  (-0.06225545817328545cm,-0.014209402073221324cm)%
    circle(0.027706285393195487cm);

\draw[%
    yarn,%
  ]%
  (0.06225545817328545cm,-0.014209402073221324cm)%
    circle(0.027706285393195487cm);

\draw[%
    yarn,%
  ]%
  (0.0cm,0.0cm)%
    circle(0.027706285393195487cm);

\draw[%
    yarn,%
  ]%
  (-0.049925001168977336cm,0.03981385987218234cm)%
    circle(0.027706285393195487cm);

\draw[%
    yarn,%
  ]%
  (0.049925001168977336cm,0.03981385987218234cm)%
    circle(0.027706285393195487cm);

\draw[%
    yarn,%
  ]%
  (0.0cm,0.06385647327909802cm)%
    circle(0.027706285393195487cm);

\draw[%
    assembled yarn,%
  ]%
  (-0.16499039004599736cm,0.13157544548301117cm)%
    circle(0.0915627586722935cm);

\draw[%
    yarn,%
  ]%
  (-0.19269667543919283cm,0.07404275104450116cm)%
    circle(0.027706285393195487cm);

\draw[%
    yarn,%
  ]%
  (-0.13728410465280189cm,0.07404275104450116cm)%
    circle(0.027706285393195487cm);

\draw[%
    yarn,%
  ]%
  (-0.22724584821928281cm,0.11736604340978984cm)%
    circle(0.027706285393195487cm);

\draw[%
    yarn,%
  ]%
  (-0.1027349318727119cm,0.11736604340978984cm)%
    circle(0.027706285393195487cm);

\draw[%
    yarn,%
  ]%
  (-0.16499039004599736cm,0.13157544548301117cm)%
    circle(0.027706285393195487cm);

\draw[%
    yarn,%
  ]%
  (-0.2149153912149747cm,0.1713893053551935cm)%
    circle(0.027706285393195487cm);

\draw[%
    yarn,%
  ]%
  (-0.11506538887702003cm,0.1713893053551935cm)%
    circle(0.027706285393195487cm);

\draw[%
    yarn,%
  ]%
  (-0.16499039004599736cm,0.1954319187621092cm)%
    circle(0.027706285393195487cm);

\draw[%
    assembled yarn,%
  ]%
  (0.16499039004599736cm,0.13157544548301117cm)%
    circle(0.0915627586722935cm);

\draw[%
    yarn,%
  ]%
  (0.13728410465280189cm,0.07404275104450116cm)%
    circle(0.027706285393195487cm);

\draw[%
    yarn,%
  ]%
  (0.19269667543919283cm,0.07404275104450116cm)%
    circle(0.027706285393195487cm);

\draw[%
    yarn,%
  ]%
  (0.1027349318727119cm,0.11736604340978984cm)%
    circle(0.027706285393195487cm);

\draw[%
    yarn,%
  ]%
  (0.22724584821928281cm,0.11736604340978984cm)%
    circle(0.027706285393195487cm);

\draw[%
    yarn,%
  ]%
  (0.16499039004599736cm,0.13157544548301117cm)%
    circle(0.027706285393195487cm);

\draw[%
    yarn,%
  ]%
  (0.11506538887702003cm,0.1713893053551935cm)%
    circle(0.027706285393195487cm);

\draw[%
    yarn,%
  ]%
  (0.2149153912149747cm,0.1713893053551935cm)%
    circle(0.027706285393195487cm);

\draw[%
    yarn,%
  ]%
  (0.16499039004599736cm,0.1954319187621092cm)%
    circle(0.027706285393195487cm);

\draw[%
    assembled yarn,%
  ]%
  (0.0cm,0.21103062967631783cm)%
    circle(0.0915627586722935cm);

\draw[%
    yarn,%
  ]%
  (-0.027706285393195487cm,0.1534979352378078cm)%
    circle(0.027706285393195487cm);

\draw[%
    yarn,%
  ]%
  (0.027706285393195487cm,0.1534979352378078cm)%
    circle(0.027706285393195487cm);

\draw[%
    yarn,%
  ]%
  (-0.06225545817328545cm,0.1968212276030965cm)%
    circle(0.027706285393195487cm);

\draw[%
    yarn,%
  ]%
  (0.06225545817328545cm,0.1968212276030965cm)%
    circle(0.027706285393195487cm);

\draw[%
    yarn,%
  ]%
  (0.0cm,0.21103062967631783cm)%
    circle(0.027706285393195487cm);

\draw[%
    yarn,%
  ]%
  (-0.049925001168977336cm,0.2508444895485002cm)%
    circle(0.027706285393195487cm);

\draw[%
    yarn,%
  ]%
  (0.049925001168977336cm,0.2508444895485002cm)%
    circle(0.027706285393195487cm);

\draw[%
    yarn,%
  ]%
  (0.0cm,0.27488710295541585cm)%
    circle(0.027706285393195487cm);

\draw[%
    strand,%
  ]%
  (-0.5452544450704108cm,0.4348259101134951cm)%
    circle(0.3025933883486113cm);

\draw[%
    assembled yarn,%
  ]%
  (-0.6368172037427042cm,0.24469388260128838cm)%
    circle(0.0915627586722935cm);

\draw[%
    yarn,%
  ]%
  (-0.6645234891358998cm,0.18716118816277838cm)%
    circle(0.027706285393195487cm);

\draw[%
    yarn,%
  ]%
  (-0.6091109183495087cm,0.18716118816277838cm)%
    circle(0.027706285393195487cm);

\draw[%
    yarn,%
  ]%
  (-0.6990726619159897cm,0.23048448052806705cm)%
    circle(0.027706285393195487cm);

\draw[%
    yarn,%
  ]%
  (-0.5745617455694187cm,0.23048448052806705cm)%
    circle(0.027706285393195487cm);

\draw[%
    yarn,%
  ]%
  (-0.6368172037427042cm,0.24469388260128838cm)%
    circle(0.027706285393195487cm);

\draw[%
    yarn,%
  ]%
  (-0.6867422049116816cm,0.2845077424734707cm)%
    circle(0.027706285393195487cm);

\draw[%
    yarn,%
  ]%
  (-0.5868922025737269cm,0.2845077424734707cm)%
    circle(0.027706285393195487cm);

\draw[%
    yarn,%
  ]%
  (-0.6368172037427042cm,0.3085503558803864cm)%
    circle(0.027706285393195487cm);

\draw[%
    assembled yarn,%
  ]%
  (-0.45369168639811724cm,0.24469388260128838cm)%
    circle(0.0915627586722935cm);

\draw[%
    yarn,%
  ]%
  (-0.4813979717913127cm,0.18716118816277838cm)%
    circle(0.027706285393195487cm);

\draw[%
    yarn,%
  ]%
  (-0.42598540100492177cm,0.18716118816277838cm)%
    circle(0.027706285393195487cm);

\draw[%
    yarn,%
  ]%
  (-0.5159471445714027cm,0.23048448052806705cm)%
    circle(0.027706285393195487cm);

\draw[%
    yarn,%
  ]%
  (-0.3914362282248318cm,0.23048448052806705cm)%
    circle(0.027706285393195487cm);

\draw[%
    yarn,%
  ]%
  (-0.45369168639811724cm,0.24469388260128838cm)%
    circle(0.027706285393195487cm);

\draw[%
    yarn,%
  ]%
  (-0.5036166875670945cm,0.2845077424734707cm)%
    circle(0.027706285393195487cm);

\draw[%
    yarn,%
  ]%
  (-0.4037666852291399cm,0.2845077424734707cm)%
    circle(0.027706285393195487cm);

\draw[%
    yarn,%
  ]%
  (-0.45369168639811724cm,0.3085503558803864cm)%
    circle(0.027706285393195487cm);

\draw[%
    assembled yarn,%
  ]%
  (-0.7509940962671589cm,0.38786717730453174cm)%
    circle(0.0915627586722935cm);

\draw[%
    yarn,%
  ]%
  (-0.7787003816603544cm,0.33033448286602174cm)%
    circle(0.027706285393195487cm);

\draw[%
    yarn,%
  ]%
  (-0.7232878108739633cm,0.33033448286602174cm)%
    circle(0.027706285393195487cm);

\draw[%
    yarn,%
  ]%
  (-0.8132495544404443cm,0.37365777523131044cm)%
    circle(0.027706285393195487cm);

\draw[%
    yarn,%
  ]%
  (-0.6887386380938734cm,0.37365777523131044cm)%
    circle(0.027706285393195487cm);

\draw[%
    yarn,%
  ]%
  (-0.7509940962671589cm,0.38786717730453174cm)%
    circle(0.027706285393195487cm);

\draw[%
    yarn,%
  ]%
  (-0.8009190974361362cm,0.4276810371767141cm)%
    circle(0.027706285393195487cm);

\draw[%
    yarn,%
  ]%
  (-0.7010690950981815cm,0.4276810371767141cm)%
    circle(0.027706285393195487cm);

\draw[%
    yarn,%
  ]%
  (-0.7509940962671589cm,0.45172365058362973cm)%
    circle(0.027706285393195487cm);

\draw[%
    assembled yarn,%
  ]%
  (-0.3395147938736626cm,0.38786717730453174cm)%
    circle(0.0915627586722935cm);

\draw[%
    yarn,%
  ]%
  (-0.3672210792668581cm,0.33033448286602174cm)%
    circle(0.027706285393195487cm);

\draw[%
    yarn,%
  ]%
  (-0.31180850848046715cm,0.33033448286602174cm)%
    circle(0.027706285393195487cm);

\draw[%
    yarn,%
  ]%
  (-0.40177025204694805cm,0.37365777523131044cm)%
    circle(0.027706285393195487cm);

\draw[%
    yarn,%
  ]%
  (-0.2772593357003772cm,0.37365777523131044cm)%
    circle(0.027706285393195487cm);

\draw[%
    yarn,%
  ]%
  (-0.3395147938736626cm,0.38786717730453174cm)%
    circle(0.027706285393195487cm);

\draw[%
    yarn,%
  ]%
  (-0.38943979504264cm,0.4276810371767141cm)%
    circle(0.027706285393195487cm);

\draw[%
    yarn,%
  ]%
  (-0.28958979270468527cm,0.4276810371767141cm)%
    circle(0.027706285393195487cm);

\draw[%
    yarn,%
  ]%
  (-0.3395147938736626cm,0.45172365058362973cm)%
    circle(0.027706285393195487cm);

\draw[%
    assembled yarn,%
  ]%
  (-0.5452544450704108cm,0.4348259101134951cm)%
    circle(0.0915627586722935cm);

\draw[%
    yarn,%
  ]%
  (-0.5729607304636063cm,0.3772932156749851cm)%
    circle(0.027706285393195487cm);

\draw[%
    yarn,%
  ]%
  (-0.5175481596772152cm,0.3772932156749851cm)%
    circle(0.027706285393195487cm);

\draw[%
    yarn,%
  ]%
  (-0.6075099032436962cm,0.4206165080402738cm)%
    circle(0.027706285393195487cm);

\draw[%
    yarn,%
  ]%
  (-0.48299898689712534cm,0.4206165080402738cm)%
    circle(0.027706285393195487cm);

\draw[%
    yarn,%
  ]%
  (-0.5452544450704108cm,0.4348259101134951cm)%
    circle(0.027706285393195487cm);

\draw[%
    yarn,%
  ]%
  (-0.5951794462393881cm,0.4746397699856774cm)%
    circle(0.027706285393195487cm);

\draw[%
    yarn,%
  ]%
  (-0.4953294439014334cm,0.4746397699856774cm)%
    circle(0.027706285393195487cm);

\draw[%
    yarn,%
  ]%
  (-0.5452544450704108cm,0.4986823833925931cm)%
    circle(0.027706285393195487cm);

\draw[%
    assembled yarn,%
  ]%
  (-0.7102448351164081cm,0.5664013555965063cm)%
    circle(0.0915627586722935cm);

\draw[%
    yarn,%
  ]%
  (-0.7379511205096037cm,0.5088686611579962cm)%
    circle(0.027706285393195487cm);

\draw[%
    yarn,%
  ]%
  (-0.6825385497232126cm,0.5088686611579962cm)%
    circle(0.027706285393195487cm);

\draw[%
    yarn,%
  ]%
  (-0.7725002932896936cm,0.552191953523285cm)%
    circle(0.027706285393195487cm);

\draw[%
    yarn,%
  ]%
  (-0.6479893769431226cm,0.552191953523285cm)%
    circle(0.027706285393195487cm);

\draw[%
    yarn,%
  ]%
  (-0.7102448351164081cm,0.5664013555965063cm)%
    circle(0.027706285393195487cm);

\draw[%
    yarn,%
  ]%
  (-0.7601698362853855cm,0.6062152154686886cm)%
    circle(0.027706285393195487cm);

\draw[%
    yarn,%
  ]%
  (-0.6603198339474308cm,0.6062152154686886cm)%
    circle(0.027706285393195487cm);

\draw[%
    yarn,%
  ]%
  (-0.7102448351164081cm,0.6302578288756043cm)%
    circle(0.027706285393195487cm);

\draw[%
    assembled yarn,%
  ]%
  (-0.3802640550244134cm,0.5664013555965063cm)%
    circle(0.0915627586722935cm);

\draw[%
    yarn,%
  ]%
  (-0.4079703404176089cm,0.5088686611579962cm)%
    circle(0.027706285393195487cm);

\draw[%
    yarn,%
  ]%
  (-0.35255776963121793cm,0.5088686611579962cm)%
    circle(0.027706285393195487cm);

\draw[%
    yarn,%
  ]%
  (-0.44251951319769883cm,0.552191953523285cm)%
    circle(0.027706285393195487cm);

\draw[%
    yarn,%
  ]%
  (-0.318008596851128cm,0.552191953523285cm)%
    circle(0.027706285393195487cm);

\draw[%
    yarn,%
  ]%
  (-0.3802640550244134cm,0.5664013555965063cm)%
    circle(0.027706285393195487cm);

\draw[%
    yarn,%
  ]%
  (-0.43018905619339076cm,0.6062152154686886cm)%
    circle(0.027706285393195487cm);

\draw[%
    yarn,%
  ]%
  (-0.33033905385543605cm,0.6062152154686886cm)%
    circle(0.027706285393195487cm);

\draw[%
    yarn,%
  ]%
  (-0.3802640550244134cm,0.6302578288756043cm)%
    circle(0.027706285393195487cm);

\draw[%
    assembled yarn,%
  ]%
  (-0.5452544450704108cm,0.645856539789813cm)%
    circle(0.0915627586722935cm);

\draw[%
    yarn,%
  ]%
  (-0.5729607304636063cm,0.5883238453513029cm)%
    circle(0.027706285393195487cm);

\draw[%
    yarn,%
  ]%
  (-0.5175481596772152cm,0.5883238453513029cm)%
    circle(0.027706285393195487cm);

\draw[%
    yarn,%
  ]%
  (-0.6075099032436962cm,0.6316471377165916cm)%
    circle(0.027706285393195487cm);

\draw[%
    yarn,%
  ]%
  (-0.48299898689712534cm,0.6316471377165916cm)%
    circle(0.027706285393195487cm);

\draw[%
    yarn,%
  ]%
  (-0.5452544450704108cm,0.645856539789813cm)%
    circle(0.027706285393195487cm);

\draw[%
    yarn,%
  ]%
  (-0.5951794462393881cm,0.6856703996619953cm)%
    circle(0.027706285393195487cm);

\draw[%
    yarn,%
  ]%
  (-0.4953294439014334cm,0.6856703996619953cm)%
    circle(0.027706285393195487cm);

\draw[%
    yarn,%
  ]%
  (-0.5452544450704108cm,0.709713013068911cm)%
    circle(0.027706285393195487cm);

\draw[%
    strand,%
  ]%
  (0.5452544450704108cm,0.4348259101134951cm)%
    circle(0.3025933883486113cm);

\draw[%
    assembled yarn,%
  ]%
  (0.45369168639811724cm,0.24469388260128838cm)%
    circle(0.0915627586722935cm);

\draw[%
    yarn,%
  ]%
  (0.42598540100492177cm,0.18716118816277838cm)%
    circle(0.027706285393195487cm);

\draw[%
    yarn,%
  ]%
  (0.4813979717913127cm,0.18716118816277838cm)%
    circle(0.027706285393195487cm);

\draw[%
    yarn,%
  ]%
  (0.3914362282248318cm,0.23048448052806705cm)%
    circle(0.027706285393195487cm);

\draw[%
    yarn,%
  ]%
  (0.5159471445714027cm,0.23048448052806705cm)%
    circle(0.027706285393195487cm);

\draw[%
    yarn,%
  ]%
  (0.45369168639811724cm,0.24469388260128838cm)%
    circle(0.027706285393195487cm);

\draw[%
    yarn,%
  ]%
  (0.4037666852291399cm,0.2845077424734707cm)%
    circle(0.027706285393195487cm);

\draw[%
    yarn,%
  ]%
  (0.5036166875670945cm,0.2845077424734707cm)%
    circle(0.027706285393195487cm);

\draw[%
    yarn,%
  ]%
  (0.45369168639811724cm,0.3085503558803864cm)%
    circle(0.027706285393195487cm);

\draw[%
    assembled yarn,%
  ]%
  (0.6368172037427042cm,0.24469388260128838cm)%
    circle(0.0915627586722935cm);

\draw[%
    yarn,%
  ]%
  (0.6091109183495087cm,0.18716118816277838cm)%
    circle(0.027706285393195487cm);

\draw[%
    yarn,%
  ]%
  (0.6645234891358998cm,0.18716118816277838cm)%
    circle(0.027706285393195487cm);

\draw[%
    yarn,%
  ]%
  (0.5745617455694187cm,0.23048448052806705cm)%
    circle(0.027706285393195487cm);

\draw[%
    yarn,%
  ]%
  (0.6990726619159897cm,0.23048448052806705cm)%
    circle(0.027706285393195487cm);

\draw[%
    yarn,%
  ]%
  (0.6368172037427042cm,0.24469388260128838cm)%
    circle(0.027706285393195487cm);

\draw[%
    yarn,%
  ]%
  (0.5868922025737269cm,0.2845077424734707cm)%
    circle(0.027706285393195487cm);

\draw[%
    yarn,%
  ]%
  (0.6867422049116816cm,0.2845077424734707cm)%
    circle(0.027706285393195487cm);

\draw[%
    yarn,%
  ]%
  (0.6368172037427042cm,0.3085503558803864cm)%
    circle(0.027706285393195487cm);

\draw[%
    assembled yarn,%
  ]%
  (0.3395147938736626cm,0.38786717730453174cm)%
    circle(0.0915627586722935cm);

\draw[%
    yarn,%
  ]%
  (0.31180850848046715cm,0.33033448286602174cm)%
    circle(0.027706285393195487cm);

\draw[%
    yarn,%
  ]%
  (0.3672210792668581cm,0.33033448286602174cm)%
    circle(0.027706285393195487cm);

\draw[%
    yarn,%
  ]%
  (0.2772593357003772cm,0.37365777523131044cm)%
    circle(0.027706285393195487cm);

\draw[%
    yarn,%
  ]%
  (0.40177025204694805cm,0.37365777523131044cm)%
    circle(0.027706285393195487cm);

\draw[%
    yarn,%
  ]%
  (0.3395147938736626cm,0.38786717730453174cm)%
    circle(0.027706285393195487cm);

\draw[%
    yarn,%
  ]%
  (0.28958979270468527cm,0.4276810371767141cm)%
    circle(0.027706285393195487cm);

\draw[%
    yarn,%
  ]%
  (0.38943979504264cm,0.4276810371767141cm)%
    circle(0.027706285393195487cm);

\draw[%
    yarn,%
  ]%
  (0.3395147938736626cm,0.45172365058362973cm)%
    circle(0.027706285393195487cm);

\draw[%
    assembled yarn,%
  ]%
  (0.7509940962671589cm,0.38786717730453174cm)%
    circle(0.0915627586722935cm);

\draw[%
    yarn,%
  ]%
  (0.7232878108739633cm,0.33033448286602174cm)%
    circle(0.027706285393195487cm);

\draw[%
    yarn,%
  ]%
  (0.7787003816603544cm,0.33033448286602174cm)%
    circle(0.027706285393195487cm);

\draw[%
    yarn,%
  ]%
  (0.6887386380938734cm,0.37365777523131044cm)%
    circle(0.027706285393195487cm);

\draw[%
    yarn,%
  ]%
  (0.8132495544404443cm,0.37365777523131044cm)%
    circle(0.027706285393195487cm);

\draw[%
    yarn,%
  ]%
  (0.7509940962671589cm,0.38786717730453174cm)%
    circle(0.027706285393195487cm);

\draw[%
    yarn,%
  ]%
  (0.7010690950981815cm,0.4276810371767141cm)%
    circle(0.027706285393195487cm);

\draw[%
    yarn,%
  ]%
  (0.8009190974361362cm,0.4276810371767141cm)%
    circle(0.027706285393195487cm);

\draw[%
    yarn,%
  ]%
  (0.7509940962671589cm,0.45172365058362973cm)%
    circle(0.027706285393195487cm);

\draw[%
    assembled yarn,%
  ]%
  (0.5452544450704108cm,0.4348259101134951cm)%
    circle(0.0915627586722935cm);

\draw[%
    yarn,%
  ]%
  (0.5175481596772152cm,0.3772932156749851cm)%
    circle(0.027706285393195487cm);

\draw[%
    yarn,%
  ]%
  (0.5729607304636063cm,0.3772932156749851cm)%
    circle(0.027706285393195487cm);

\draw[%
    yarn,%
  ]%
  (0.48299898689712534cm,0.4206165080402738cm)%
    circle(0.027706285393195487cm);

\draw[%
    yarn,%
  ]%
  (0.6075099032436962cm,0.4206165080402738cm)%
    circle(0.027706285393195487cm);

\draw[%
    yarn,%
  ]%
  (0.5452544450704108cm,0.4348259101134951cm)%
    circle(0.027706285393195487cm);

\draw[%
    yarn,%
  ]%
  (0.4953294439014334cm,0.4746397699856774cm)%
    circle(0.027706285393195487cm);

\draw[%
    yarn,%
  ]%
  (0.5951794462393881cm,0.4746397699856774cm)%
    circle(0.027706285393195487cm);

\draw[%
    yarn,%
  ]%
  (0.5452544450704108cm,0.4986823833925931cm)%
    circle(0.027706285393195487cm);

\draw[%
    assembled yarn,%
  ]%
  (0.3802640550244134cm,0.5664013555965063cm)%
    circle(0.0915627586722935cm);

\draw[%
    yarn,%
  ]%
  (0.35255776963121793cm,0.5088686611579962cm)%
    circle(0.027706285393195487cm);

\draw[%
    yarn,%
  ]%
  (0.4079703404176089cm,0.5088686611579962cm)%
    circle(0.027706285393195487cm);

\draw[%
    yarn,%
  ]%
  (0.318008596851128cm,0.552191953523285cm)%
    circle(0.027706285393195487cm);

\draw[%
    yarn,%
  ]%
  (0.44251951319769883cm,0.552191953523285cm)%
    circle(0.027706285393195487cm);

\draw[%
    yarn,%
  ]%
  (0.3802640550244134cm,0.5664013555965063cm)%
    circle(0.027706285393195487cm);

\draw[%
    yarn,%
  ]%
  (0.33033905385543605cm,0.6062152154686886cm)%
    circle(0.027706285393195487cm);

\draw[%
    yarn,%
  ]%
  (0.43018905619339076cm,0.6062152154686886cm)%
    circle(0.027706285393195487cm);

\draw[%
    yarn,%
  ]%
  (0.3802640550244134cm,0.6302578288756043cm)%
    circle(0.027706285393195487cm);

\draw[%
    assembled yarn,%
  ]%
  (0.7102448351164081cm,0.5664013555965063cm)%
    circle(0.0915627586722935cm);

\draw[%
    yarn,%
  ]%
  (0.6825385497232126cm,0.5088686611579962cm)%
    circle(0.027706285393195487cm);

\draw[%
    yarn,%
  ]%
  (0.7379511205096037cm,0.5088686611579962cm)%
    circle(0.027706285393195487cm);

\draw[%
    yarn,%
  ]%
  (0.6479893769431226cm,0.552191953523285cm)%
    circle(0.027706285393195487cm);

\draw[%
    yarn,%
  ]%
  (0.7725002932896936cm,0.552191953523285cm)%
    circle(0.027706285393195487cm);

\draw[%
    yarn,%
  ]%
  (0.7102448351164081cm,0.5664013555965063cm)%
    circle(0.027706285393195487cm);

\draw[%
    yarn,%
  ]%
  (0.6603198339474308cm,0.6062152154686886cm)%
    circle(0.027706285393195487cm);

\draw[%
    yarn,%
  ]%
  (0.7601698362853855cm,0.6062152154686886cm)%
    circle(0.027706285393195487cm);

\draw[%
    yarn,%
  ]%
  (0.7102448351164081cm,0.6302578288756043cm)%
    circle(0.027706285393195487cm);

\draw[%
    assembled yarn,%
  ]%
  (0.5452544450704108cm,0.645856539789813cm)%
    circle(0.0915627586722935cm);

\draw[%
    yarn,%
  ]%
  (0.5175481596772152cm,0.5883238453513029cm)%
    circle(0.027706285393195487cm);

\draw[%
    yarn,%
  ]%
  (0.5729607304636063cm,0.5883238453513029cm)%
    circle(0.027706285393195487cm);

\draw[%
    yarn,%
  ]%
  (0.48299898689712534cm,0.6316471377165916cm)%
    circle(0.027706285393195487cm);

\draw[%
    yarn,%
  ]%
  (0.6075099032436962cm,0.6316471377165916cm)%
    circle(0.027706285393195487cm);

\draw[%
    yarn,%
  ]%
  (0.5452544450704108cm,0.645856539789813cm)%
    circle(0.027706285393195487cm);

\draw[%
    yarn,%
  ]%
  (0.4953294439014334cm,0.6856703996619953cm)%
    circle(0.027706285393195487cm);

\draw[%
    yarn,%
  ]%
  (0.5951794462393881cm,0.6856703996619953cm)%
    circle(0.027706285393195487cm);

\draw[%
    yarn,%
  ]%
  (0.5452544450704108cm,0.709713013068911cm)%
    circle(0.027706285393195487cm);

\draw[%
    strand,%
  ]%
  (0.0cm,0.6974066116513887cm)%
    circle(0.3025933883486113cm);

\draw[%
    assembled yarn,%
  ]%
  (-0.0915627586722935cm,0.507274584139182cm)%
    circle(0.0915627586722935cm);

\draw[%
    yarn,%
  ]%
  (-0.119269044065489cm,0.449741889700672cm)%
    circle(0.027706285393195487cm);

\draw[%
    yarn,%
  ]%
  (-0.06385647327909802cm,0.449741889700672cm)%
    circle(0.027706285393195487cm);

\draw[%
    yarn,%
  ]%
  (-0.15381821684557895cm,0.4930651820659607cm)%
    circle(0.027706285393195487cm);

\draw[%
    yarn,%
  ]%
  (-0.02930730049900806cm,0.4930651820659607cm)%
    circle(0.027706285393195487cm);

\draw[%
    yarn,%
  ]%
  (-0.0915627586722935cm,0.507274584139182cm)%
    circle(0.027706285393195487cm);

\draw[%
    yarn,%
  ]%
  (-0.14148775984127085cm,0.5470884440113644cm)%
    circle(0.027706285393195487cm);

\draw[%
    yarn,%
  ]%
  (-0.04163775750331617cm,0.5470884440113644cm)%
    circle(0.027706285393195487cm);

\draw[%
    yarn,%
  ]%
  (-0.0915627586722935cm,0.5711310574182801cm)%
    circle(0.027706285393195487cm);

\draw[%
    assembled yarn,%
  ]%
  (0.0915627586722935cm,0.507274584139182cm)%
    circle(0.0915627586722935cm);

\draw[%
    yarn,%
  ]%
  (0.06385647327909802cm,0.449741889700672cm)%
    circle(0.027706285393195487cm);

\draw[%
    yarn,%
  ]%
  (0.119269044065489cm,0.449741889700672cm)%
    circle(0.027706285393195487cm);

\draw[%
    yarn,%
  ]%
  (0.02930730049900806cm,0.4930651820659607cm)%
    circle(0.027706285393195487cm);

\draw[%
    yarn,%
  ]%
  (0.15381821684557895cm,0.4930651820659607cm)%
    circle(0.027706285393195487cm);

\draw[%
    yarn,%
  ]%
  (0.0915627586722935cm,0.507274584139182cm)%
    circle(0.027706285393195487cm);

\draw[%
    yarn,%
  ]%
  (0.04163775750331617cm,0.5470884440113644cm)%
    circle(0.027706285393195487cm);

\draw[%
    yarn,%
  ]%
  (0.14148775984127085cm,0.5470884440113644cm)%
    circle(0.027706285393195487cm);

\draw[%
    yarn,%
  ]%
  (0.0915627586722935cm,0.5711310574182801cm)%
    circle(0.027706285393195487cm);

\draw[%
    assembled yarn,%
  ]%
  (-0.20573965119674814cm,0.6504478788424254cm)%
    circle(0.0915627586722935cm);

\draw[%
    yarn,%
  ]%
  (-0.23344593658994361cm,0.5929151844039153cm)%
    circle(0.027706285393195487cm);

\draw[%
    yarn,%
  ]%
  (-0.17803336580355267cm,0.5929151844039153cm)%
    circle(0.027706285393195487cm);

\draw[%
    yarn,%
  ]%
  (-0.26799510937003357cm,0.6362384767692041cm)%
    circle(0.027706285393195487cm);

\draw[%
    yarn,%
  ]%
  (-0.14348419302346269cm,0.6362384767692041cm)%
    circle(0.027706285393195487cm);

\draw[%
    yarn,%
  ]%
  (-0.20573965119674814cm,0.6504478788424254cm)%
    circle(0.027706285393195487cm);

\draw[%
    yarn,%
  ]%
  (-0.2556646523657255cm,0.6902617387146077cm)%
    circle(0.027706285393195487cm);

\draw[%
    yarn,%
  ]%
  (-0.1558146500277708cm,0.6902617387146077cm)%
    circle(0.027706285393195487cm);

\draw[%
    yarn,%
  ]%
  (-0.20573965119674814cm,0.7143043521215234cm)%
    circle(0.027706285393195487cm);

\draw[%
    assembled yarn,%
  ]%
  (0.20573965119674814cm,0.6504478788424254cm)%
    circle(0.0915627586722935cm);

\draw[%
    yarn,%
  ]%
  (0.17803336580355267cm,0.5929151844039153cm)%
    circle(0.027706285393195487cm);

\draw[%
    yarn,%
  ]%
  (0.23344593658994361cm,0.5929151844039153cm)%
    circle(0.027706285393195487cm);

\draw[%
    yarn,%
  ]%
  (0.14348419302346269cm,0.6362384767692041cm)%
    circle(0.027706285393195487cm);

\draw[%
    yarn,%
  ]%
  (0.26799510937003357cm,0.6362384767692041cm)%
    circle(0.027706285393195487cm);

\draw[%
    yarn,%
  ]%
  (0.20573965119674814cm,0.6504478788424254cm)%
    circle(0.027706285393195487cm);

\draw[%
    yarn,%
  ]%
  (0.1558146500277708cm,0.6902617387146077cm)%
    circle(0.027706285393195487cm);

\draw[%
    yarn,%
  ]%
  (0.2556646523657255cm,0.6902617387146077cm)%
    circle(0.027706285393195487cm);

\draw[%
    yarn,%
  ]%
  (0.20573965119674814cm,0.7143043521215234cm)%
    circle(0.027706285393195487cm);

\draw[%
    assembled yarn,%
  ]%
  (0.0cm,0.6974066116513887cm)%
    circle(0.0915627586722935cm);

\draw[%
    yarn,%
  ]%
  (-0.027706285393195487cm,0.6398739172128787cm)%
    circle(0.027706285393195487cm);

\draw[%
    yarn,%
  ]%
  (0.027706285393195487cm,0.6398739172128787cm)%
    circle(0.027706285393195487cm);

\draw[%
    yarn,%
  ]%
  (-0.06225545817328545cm,0.6831972095781674cm)%
    circle(0.027706285393195487cm);

\draw[%
    yarn,%
  ]%
  (0.06225545817328545cm,0.6831972095781674cm)%
    circle(0.027706285393195487cm);

\draw[%
    yarn,%
  ]%
  (0.0cm,0.6974066116513887cm)%
    circle(0.027706285393195487cm);

\draw[%
    yarn,%
  ]%
  (-0.049925001168977336cm,0.7372204715235711cm)%
    circle(0.027706285393195487cm);

\draw[%
    yarn,%
  ]%
  (0.049925001168977336cm,0.7372204715235711cm)%
    circle(0.027706285393195487cm);

\draw[%
    yarn,%
  ]%
  (0.0cm,0.7612630849304868cm)%
    circle(0.027706285393195487cm);

\draw[%
    assembled yarn,%
  ]%
  (-0.16499039004599736cm,0.8289820571343999cm)%
    circle(0.0915627586722935cm);

\draw[%
    yarn,%
  ]%
  (-0.19269667543919283cm,0.7714493626958898cm)%
    circle(0.027706285393195487cm);

\draw[%
    yarn,%
  ]%
  (-0.13728410465280189cm,0.7714493626958898cm)%
    circle(0.027706285393195487cm);

\draw[%
    yarn,%
  ]%
  (-0.22724584821928281cm,0.8147726550611786cm)%
    circle(0.027706285393195487cm);

\draw[%
    yarn,%
  ]%
  (-0.1027349318727119cm,0.8147726550611786cm)%
    circle(0.027706285393195487cm);

\draw[%
    yarn,%
  ]%
  (-0.16499039004599736cm,0.8289820571343999cm)%
    circle(0.027706285393195487cm);

\draw[%
    yarn,%
  ]%
  (-0.2149153912149747cm,0.8687959170065822cm)%
    circle(0.027706285393195487cm);

\draw[%
    yarn,%
  ]%
  (-0.11506538887702003cm,0.8687959170065822cm)%
    circle(0.027706285393195487cm);

\draw[%
    yarn,%
  ]%
  (-0.16499039004599736cm,0.8928385304134979cm)%
    circle(0.027706285393195487cm);

\draw[%
    assembled yarn,%
  ]%
  (0.16499039004599736cm,0.8289820571343999cm)%
    circle(0.0915627586722935cm);

\draw[%
    yarn,%
  ]%
  (0.13728410465280189cm,0.7714493626958898cm)%
    circle(0.027706285393195487cm);

\draw[%
    yarn,%
  ]%
  (0.19269667543919283cm,0.7714493626958898cm)%
    circle(0.027706285393195487cm);

\draw[%
    yarn,%
  ]%
  (0.1027349318727119cm,0.8147726550611786cm)%
    circle(0.027706285393195487cm);

\draw[%
    yarn,%
  ]%
  (0.22724584821928281cm,0.8147726550611786cm)%
    circle(0.027706285393195487cm);

\draw[%
    yarn,%
  ]%
  (0.16499039004599736cm,0.8289820571343999cm)%
    circle(0.027706285393195487cm);

\draw[%
    yarn,%
  ]%
  (0.11506538887702003cm,0.8687959170065822cm)%
    circle(0.027706285393195487cm);

\draw[%
    yarn,%
  ]%
  (0.2149153912149747cm,0.8687959170065822cm)%
    circle(0.027706285393195487cm);

\draw[%
    yarn,%
  ]%
  (0.16499039004599736cm,0.8928385304134979cm)%
    circle(0.027706285393195487cm);

\draw[%
    assembled yarn,%
  ]%
  (0.0cm,0.9084372413277065cm)%
    circle(0.0915627586722935cm);

\draw[%
    yarn,%
  ]%
  (-0.027706285393195487cm,0.8509045468891965cm)%
    circle(0.027706285393195487cm);

\draw[%
    yarn,%
  ]%
  (0.027706285393195487cm,0.8509045468891965cm)%
    circle(0.027706285393195487cm);

\draw[%
    yarn,%
  ]%
  (-0.06225545817328545cm,0.8942278392544852cm)%
    circle(0.027706285393195487cm);

\draw[%
    yarn,%
  ]%
  (0.06225545817328545cm,0.8942278392544852cm)%
    circle(0.027706285393195487cm);

\draw[%
    yarn,%
  ]%
  (0.0cm,0.9084372413277065cm)%
    circle(0.027706285393195487cm);

\draw[%
    yarn,%
  ]%
  (-0.049925001168977336cm,0.9482511011998889cm)%
    circle(0.027706285393195487cm);

\draw[%
    yarn,%
  ]%
  (0.049925001168977336cm,0.9482511011998889cm)%
    circle(0.027706285393195487cm);

\draw[%
    yarn,%
  ]%
  (0.0cm,0.9722937146068046cm)%
    circle(0.027706285393195487cm);

\end{tikzpicture}
