xi,sx,sy,cx,cy,ex,ey,ne
0,-0,-0,0,0,-0,-0,0
0.01,-0.0116273815,-0.0304469573,-0.0034228126,-0.0094508161,-0.0082045688,-0.0209961412,0.0225422469
0.02,-0.0219095357,-0.0554161747,-0.0069437918,-0.0188639515,-0.0149657439,-0.0365522233,0.0394973229
0.03,-0.0312067068,-0.0761866747,-0.0105683351,-0.0282361468,-0.0206383717,-0.0479505279,0.0522034052
0.04,-0.0398083647,-0.0937742234,-0.014302253,-0.0375637549,-0.0255061116,-0.0562104684,0.0617266433
0.05,-0.0479412745,-0.1089631444,-0.0181518063,-0.0468426848,-0.0297894682,-0.0621204596,0.0688938598
0.06,-0.0557775651,-0.1223381314,-0.0221237446,-0.0560683348,-0.0336538205,-0.0662697966,0.0743254033
0.07,-0.0634427982,-0.1343160611,-0.0262253494,-0.0652355155,-0.0372174489,-0.0690805456,0.0784682119
0.08,-0.0710240373,-0.1451778064,-0.0304644779,-0.074338359,-0.0405595594,-0.0708394475,0.0816290707
0.09,-0.0785779163,-0.1551000493,-0.0348496096,-0.0833702115,-0.0437283067,-0.0717298379,0.0840079428
0.1,-0.0861387086,-0.1641870939,-0.0393898927,-0.0923235078,-0.046748816,-0.0718635861,0.0857311309
0.11,-0.0937263344,-0.1725024222,-0.04409519,-0.101189623,-0.0496311444,-0.0713127992,0.0868836338
0.12,-0.1013527616,-0.1800935679,-0.0489761217,-0.1099586978,-0.0523766398,-0.0701348701,0.0875340643
0.13,-0.1090243304,-0.1870000256,-0.0540440996,-0.1186194328,-0.0549802308,-0.0683805928,0.0877424142
0.14,-0.1167424725,-0.1932544781,-0.0593113501,-0.1271588477,-0.0574311224,-0.0660956304,0.0875612139
0.15,-0.1245043673,-0.1988837665,-0.0647909165,-0.1355619988,-0.0597134509,-0.0633217677,0.0870364434
0.16,-0.1323035993,-0.2039098605,-0.0704966296,-0.1438116516,-0.0618069697,-0.0600982089,0.0862084463
0.17,-0.1401308148,-0.2083508277,-0.0764430342,-0.1518879033,-0.0636877806,-0.0564629244,0.0851128382
0.18,-0.1479743789,-0.2122218045,-0.0826452479,-0.1597677553,-0.065329131,-0.0524540492,0.0837813979
0.19,-0.1558210323,-0.2155359659,-0.0891187295,-0.1674246384,-0.0667023028,-0.0481113275,0.0822429148
0.2,-0.1636565485,-0.2183054952,-0.0958789213,-0.1748279016,-0.0677776272,-0.0434775936,0.0805239585
0.21,-0.1714663855,-0.220542546,-0.1029407235,-0.1819422909,-0.0685256619,-0.0386002551,0.0786495139
0.22,-0.1792362103,-0.2222599811,-0.1103177558,-0.1887274609,-0.0689184545,-0.0335325202,0.0766432207
0.23,-0.1869521005,-0.2234715464,-0.1180213552,-0.195137592,-0.0689307453,-0.0283339544,0.0745269121
0.24,-0.1946006174,-0.2241918233,-0.1260592727,-0.2011212228,-0.0685413447,-0.0230706005,0.0723199042
0.25,-0.2021688751,-0.2244361712,-0.1344340574,-0.2066214479,-0.0677348177,-0.0178147233,0.0700383459
0.26,-0.2096446091,-0.2242206714,-0.143141172,-0.2115766712,-0.0665034371,-0.0126440002,0.0676947405
0.27,-0.2170162451,-0.2235620697,-0.1521669761,-0.2159221197,-0.064849269,-0.0076399499,0.0652977528
0.28,-0.2242729675,-0.22247772,-0.1614868342,-0.2195922889,-0.0627861333,-0.002885431,0.0628524005
0.29,-0.2314047888,-0.2209855274,-0.171063737,-0.2225243705,-0.0603410518,0.0015388431,0.0603606707
0.3,-0.2384026176,-0.2191038915,-0.1808479057,-0.2246624969,-0.0575547119,0.0055586055,0.0578225125
0.31,-0.2452583271,-0.2168516486,-0.1907778136,-0.2259623422,-0.0544805136,0.0091106936,0.0552370446
0.32,-0.2519648072,-0.2142479958,-0.2007828423,-0.2263953448,-0.0511819648,0.012147349,0.0526037224
0.33,-0.2585159743,-0.2113123671,-0.2107874065,-0.2259517043,-0.0477285679,0.0146393373,0.0499232049
0.34,-0.2649067667,-0.2080642909,-0.2207159517,-0.2246414602,-0.0441908149,0.0165771692,0.0471977824
0.35,-0.2711331371,-0.2045232471,-0.2304979481,-0.2224933867,-0.040635189,0.0179701396,0.044431346
0.36,-0.2771920474,-0.2007085234,-0.2400719993,-0.2195519774,-0.0371200481,0.018843454,0.0416290011
0.37,-0.2830814616,-0.1966390727,-0.2493884786,-0.2158732116,-0.033692983,0.0192341389,0.0387965102
0.38,-0.2888003399,-0.1923333693,-0.258410532,-0.2115199545,-0.0303898079,0.0191865852,0.0359397478
0.39,-0.2943486321,-0.1878092664,-0.2671136676,-0.2065577205,-0.0272349645,0.0187484541,0.0330642983
0.4,-0.2997272716,-0.1830838524,-0.2754843676,-0.2010512566,-0.024242904,0.0179674042,0.0301752549
0.41,-0.3049381678,-0.1781733095,-0.2835181928,-0.1950621093,-0.021419975,0.0168887998,0.0272772229
0.42,-0.3099841731,-0.17309281,-0.2912177665,-0.1886471209,-0.0187664066,0.0155543109,0.0243744663
0.43,-0.314868983,-0.1678565112,-0.2985908924,-0.1818576845,-0.0162780906,0.0140011733,0.0214711222
0.44,-0.3195970107,-0.1624775878,-0.3056489424,-0.1747395515,-0.0139480684,0.0122619638,0.0185716011
0.45,-0.3241732608,-0.156968266,-0.3124055571,-0.167333003,-0.0117677037,0.010364737,0.0156814101
0.46,-0.3286032023,-0.151339858,-0.3188756475,-0.1596732338,-0.0097275548,0.0083333758,0.0128089998
0.47,-0.3328926427,-0.145602796,-0.3250746586,-0.1517908421,-0.0078179841,0.0061880462,0.0099705963
0.48,-0.3370476007,-0.1397666665,-0.3310180471,-0.1437123509,-0.0060295537,0.0039456844,0.007205827
0.49,-0.3410741804,-0.1338402444,-0.3367209248,-0.1354607182,-0.0043532556,0.0016204737,0.0046450802
0.5,-0.3449784441,-0.1278315276,-0.3421978282,-0.1270558119,-0.0027806158,-0.0007757157,0.0028867905
0.51,-0.3487662873,-0.1217477707,-0.3474625794,-0.1185148366,-0.001303708,-0.0032329342,0.0034859028
0.52,-0.352443343,-0.1155955238,-0.3525282114,-0.1098527101,8.48684e-05,-0.0057428137,0.0057434408
0.53,-0.3560149604,-0.1093806798,-0.3574069408,-0.1010823908,0.0013919804,-0.008298289,0.0084142266
0.54,-0.359486214,-0.103108526,-0.3621101698,-0.0922151591,0.0026239557,-0.0108933669,0.0112049358
0.55,-0.3628619137,-0.096783796,-0.3666485088,-0.0832608582,0.003786595,-0.0135229378,0.0140430819
0.56,-0.3661466145,-0.0904107213,-0.3710318118,-0.0742280992,0.0048851973,-0.0161826222,0.0169039171
0.57,-0.3693446262,-0.0839930827,-0.3752692187,-0.0651244352,0.0059245926,-0.0188686475,0.0197769223
0.58,-0.3724600238,-0.0775342623,-0.3793692011,-0.0559565099,0.0069091772,-0.0215777524,0.0226569223
0.59,-0.3754966573,-0.071037295,-0.3833396088,-0.0467301823,0.0078429516,-0.0243071127,0.0255410967
0.6,-0.3784581613,-0.0645049203,-0.3871877167,-0.037450634,0.0087295554,-0.0270542862,0.0284277952
0.61,-0.3813479656,-0.0579396319,-0.3909202682,-0.0281224602,0.0095723026,-0.0298171718,0.0313160136
0.62,-0.3841693155,-0.0513436817,-0.3945435183,-0.0187497461,0.0103742028,-0.0325939356,0.0342050979
0.63,-0.3869253171,-0.0447189642,-0.3980632724,-0.0093361337,0.0111379554,-0.0353828304,0.037094457
0.64,-0.3896189924,-0.0380668561,-0.4014849232,0.0001151219,0.0118659308,-0.0381819779,0.0399832934
0.65,-0.3922533357,-0.0313880527,-0.4048134842,0.0096011045,0.0125601485,-0.0409891571,0.0428703666
0.66,-0.3948313687,-0.0246824054,-0.4080536214,0.0191191949,0.0132222527,-0.0438016002,0.0457537774
0.67,-0.3973561968,-0.0179487582,-0.4112096813,0.0286670352,0.0138534846,-0.0466157934,0.0486307642
0.68,-0.3998310642,-0.011184785,-0.4142857172,0.038242498,0.014454653,-0.0494272831,0.0514975077
0.69,-0.4022594104,-0.0043868267,-0.4172855126,0.0478436596,0.0150261022,-0.0522304862,0.0543489415
0.7,-0.4046449252,0.0024502723,-0.4202126035,0.0574687764,0.0155676783,-0.0550185041,0.0571785659
0.71,-0.406991604,0.0093333242,-0.4230702976,0.0671162654,0.0160786936,-0.0577829412,0.0599782684
0.72,-0.4093037736,0.0162708952,-0.4258616929,0.0767846863,0.0165579193,-0.0605137911,0.0627382149
0.73,-0.411586046,0.0232732418,-0.4285896935,0.0864727257,0.0170036475,-0.0631994839,0.0654469159
0.74,-0.4138432438,0.0303521841,-0.4312570248,0.0961791844,0.017413781,-0.0658270003,0.0680913632
0.75,-0.4160803245,0.0375209761,-0.4338662473,0.105902965,0.0177859228,-0.0683819889,0.0706571684
0.76,-0.4183023046,0.0447941764,-0.4364197689,0.1156430615,0.0181174642,-0.070848885,0.0731287018
0.77,-0.420514184,0.0521875191,-0.4389198562,0.1253985504,0.0184056723,-0.0732110313,0.0754892302
0.78,-0.4227208697,0.0597177837,-0.4413686451,0.1351685825,0.0186477755,-0.0754507988,0.0777210561
0.79,-0.4249271007,0.0674026666,-0.4437681501,0.1449523754,0.0188410494,-0.0775497088,0.0798056544
0.8,-0.4271373719,0.075260651,-0.4461202728,0.1547492075,0.018982901,-0.0794885565,0.0817238102
0.81,-0.4293558608,0.0833108865,-0.4484268105,0.1645584122,0.0190709497,-0.0812475258,0.0834557461
0.82,-0.4315864226,0.0915732924,-0.4506894627,0.1743793727,0.0191030401,-0.0828060803,0.0849810159
0.83,-0.4338327571,0.100069231,-0.4529098383,0.1842115176,0.0190770813,-0.0841422866,0.0862778037
0.84,-0.4360986439,0.1088224043,-0.4550894619,0.1940543168,0.018990818,-0.0852319125,0.0873219908
0.85,-0.4383881804,0.11785976,-0.4572297787,0.203907278,0.0188415983,-0.086047518,0.0880862145
0.86,-0.4407060193,0.1272123975,-0.4593321606,0.2137699432,0.0186261413,-0.0865575458,0.0885389286
0.87,-0.4430576064,0.1369164734,-0.4613979104,0.2236418861,0.018340304,-0.0867254127,0.0886434654
0.88,-0.4454494186,0.1470141078,-0.4634282664,0.2335227091,0.0179788478,-0.0865086013,0.0883570997
0.89,-0.4478892012,0.1575542895,-0.4654244066,0.2434120412,0.0175352054,-0.0858577516,0.0876301144
0.9,-0.4503862061,0.1685937824,-0.4673874522,0.2533095357,0.0170012461,-0.0847157534,0.0864048681
0.91,-0.4529514626,0.1801982944,-0.4693184716,0.2632148685,0.016367009,-0.0830165741,0.0846146002
0.92,-0.4555989107,0.1924505008,-0.4712184829,0.2731277358,0.0156195721,-0.080677235,0.0821753448
0.93,-0.4583487257,0.2054754646,-0.4730884575,0.2830478531,0.0147397317,-0.0775723886,0.0789603392
0.94,-0.4612315037,0.2194729104,-0.4749293226,0.2929749535,0.013697819,-0.073502043,0.0747675101
0.95,-0.4642924816,0.2347497624,-0.4767419641,0.3029087861,0.0124494825,-0.0681590236,0.0692866662
0.96,-0.467595757,0.2517526816,-0.4785272284,0.3128491152,0.0109314714,-0.0610964336,0.0620666679
0.97,-0.4712285074,0.2711006036,-0.4802859253,0.3227957192,0.0090574179,-0.0516951157,0.0524825857
0.98,-0.4753052099,0.2936172761,-0.4820188295,0.3327483893,0.0067136195,-0.0391311131,0.0397028551
0.99,-0.4799718612,0.320363797,-0.483726683,0.3427069285,0.0037548218,-0.0223431315,0.0226564387
1,-0.4854101966,0.3526711514,-0.4854101966,0.3526711514,0,0,0
