idx,x,y
1,0.119223475036312640154349548741,-0.817524614940120529175029903555
2,-0.227647830857282892289894856893,-0.794189648722961211477247847553
3,-0.534208469909659210037310529515,-0.630223804461167061677080352035
4,0.572688850078452111726409741951,-0.595473101011747470466638727848
5,0.240840358965633297358710516610,-0.491835258276433350186482426868
6,-0.106030946927962235085533889024,-0.468500292059274032488700370866
7,-0.746174315006866908018035527939,-0.354661281586755054484790987413
8,0.766951902499478533930039780310,-0.307157145912571889442917189636
9,-0.404531766343473419740472906916,-0.290282772412768261748326331746
10,0.106213449349524655834533411104,-0.171304731324786505979819838671
11,0.453560126016751131750365771356,-0.156658581355681456026750154866
12,-0.631106465077612263792636630918,-0.026600900843601582532984886611
13,-0.200949464633371761189161504580,-0.008469944580000101382313174178
14,0.825407192077037264127093288218,0.035548562562043460212836759685
15,0.093651054298883051273302409598,0.176123548657249361559880110614
16,0.440997730966109527189134769850,0.190769698626354411512949794418
17,-0.427524163367510605241325228582,0.255211926989166577833028270957
18,-0.773372382238068970509320858617,0.290612958114638700926405696087
19,0.737703767104739227381688110026,0.371959520690361240060653425842
20,-0.145079050448194112270806894991,0.457916099833927829708564186512
21,0.199033388940469503015715690092,0.507422185910970913132709651171
22,-0.585346872149141880554721254418,0.583034966616876894733611646736
23,0.519371683509664951676573426500,0.642505865654986086006751982574
24,-0.293671251883911636688696381962,0.772216244875528846582691833568
25,0.051632791250992179686213418370,0.824352301455595120145282902561
