xi,s1,s2
0,-3.46289723194734e-24,-4.39828868294766e-24
0.01,-0.0164057049992833,0.00440503988547346
0.02,-0.0319894392505805,0.00876384955540082
0.03,-0.0468145428674523,0.0130810302230225
0.04,-0.0609405266661628,0.0173610455426151
0.05,-0.074423227813938,0.0216082225985868
0.06,-0.0873149622825531,0.0258267529240431
0.07,-0.0996646741072506,0.0300206935488225
0.08,-0.111518081450985,0.0341939680770007
0.09,-0.122917819474001,0.0383503677938666
0.1,-0.133903580008734,0.0424935528023662
0.11,-0.14451224804005,0.0466270531890173
0.12,-0.154778034990804,0.0507542702192942
0.13,-0.164732608812735,0.054878477562481
0.14,-0.174405220882689,0.0590028225459961
0.15,-0.183822829704166,0.0631303274391856
0.16,-0.193010221414206,0.0672638907665868
0.17,-0.201990127095595,0.0714062886506612
0.18,-0.210783336894404,0.0755601761839979
0.19,-0.219408810942861,0.0797280888309862
0.2,-0.227883787087543,0.0839124438589582
0.21,-0.236223885422908,0.0881155417988011
0.22,-0.244443209630147,0.0923395679350398
0.23,-0.252554445121374,0.0965865938253882
0.24,-0.260568953989136,0.100858578849772
0.25,-0.268496866761258,0.105157371788818
0.26,-0.276347170961019,0.109484712431819
0.27,-0.284127796472651,0.113842233214163
0.28,-0.291845697712174,0.118231460884231
0.29,-0.299506932603553,0.122653818199775
0.3,-0.307116738360192,0.127110625653751
0.31,-0.314679604071752,0.131603103229635
0.32,-0.322199340096299,0.136132372186198
0.33,-0.329679144257784,0.140699456871762
0.34,-0.337121664848848,0.145305286567913
0.35,-0.344529060438961,0.149950697362696
0.36,-0.351903056487886,0.15463643405327
0.37,-0.359244998764475,0.15936315207804
0.38,-0.366555903570794,0.164131419478256
0.39,-0.373836504771576,0.168941718889078
0.4,-0.381087297629004,0.173794449560118
0.41,-0.388308579442823,0.178689929405448
0.42,-0.395500486995781,0.183628397083074
0.43,-0.402663030804403,0.18861001410389
0.44,-0.409796126175085,0.193634866970091
0.45,-0.416899621065532,0.198702969343062
0.46,-0.423973320751505,0.203814264240734
0.47,-0.431017009298922,0.208968626264412
0.48,-0.438030467841265,0.214165863855073
0.49,-0.44501348966233,0.219405721579128
0.5,-0.451965892084303,0.224687882443666
0.51,-0.458887525167596,0.230011970245113
0.52,-0.465778277589013,0.235377552177179
0.53,-0.472638081640423,0.240784142894636
0.54,-0.479466919290117,0.246231211229481
0.55,-0.486264829673426,0.251718189785358
0.56,-0.493031918019011,0.257244487414156
0.57,-0.499768366010853,0.262809504574825
0.58,-0.506474443585921,0.268412651574382
0.59,-0.513150522167522,0.274053369691119
0.6,-0.519797089334348,0.279731155180009
0.61,-0.526414764925196,0.285445586160317
0.62,-0.533004318579384,0.291196352385401
0.63,-0.539566688712843,0.296983287894725
0.64,-0.5461030029299,0.302806406548057
0.65,-0.55261459987075,0.308665940441881
0.66,-0.559103052494604,0.314562381207999
0.67,-0.565570192798529,0.320496524194333
0.68,-0.572018137971974,0.326469515527935
0.69,-0.578449317986976,0.332482902060183
0.7,-0.58486650462406,0.338538684194192
0.71,-0.591272841933815,0.34463937159441
0.72,-0.597671878134163,0.350788041778423
0.73,-0.60406759894331,0.356988401590958
0.74,-0.610464462348382,0.36324485156008
0.75,-0.616867434809748,0.3695625531356
0.76,-0.623282028901031,0.375947498809667
0.77,-0.629714342384797,0.382406585119574
0.78,-0.636171098723937,0.388947688532757
0.79,-0.642659689028731,0.39557974421399
0.8,-0.649188215439599,0.402312827674788
0.81,-0.655765535945535,0.409158239305004
0.82,-0.662401310638229,0.416128591786625
0.83,-0.669106049401874,0.423237900389773
0.84,-0.675891161038657,0.430501676150897
0.85,-0.682769003829938,0.437937021933174
0.86,-0.689752937533113,0.445562731369102
0.87,-0.696857376814161,0.453399390685298
0.88,-0.70409784611588,0.461469483409491
0.89,-0.711491035961807,0.469797497959717
0.9,-0.71905486069582,0.478410038115716
0.91,-0.726808517657433,0.48733593637252
0.92,-0.734772547792768,0.496606370176253
0.93,-0.74296889770122,0.50625498104212
0.94,-0.751420983117803,0.5163179965546
0.95,-0.760153753831181,0.526834355249839
0.96,-0.769193760037389,0.537845834380241
0.97,-0.778569220129235,0.549397180561258
0.98,-0.788310089921389,0.561536243300384
0.99,-0.798448133311158,0.574314111408341
1,-0.809016994374947,0.587785252292473
