xi,sx,sy,cx,cy,ex,ey,ne
0,-0,-0,0,0,-0,-0,0
0.01,0.0151651435,-0.0219137738,0.0056111694,-0.0083879038,0.0095539741,-0.0135258701,0.0165598183
0.02,0.029054511,-0.0412035678,0.0113007859,-0.0167212476,0.017753725,-0.0244823202,0.0302420032
0.03,0.0418652077,-0.0582731924,0.0170705598,-0.0249977467,0.0247946479,-0.0332754457,0.0414973475
0.04,0.0537656836,-0.0734673744,0.0229222287,-0.0332149997,0.0308434549,-0.0402523747,0.0507106732
0.05,0.0648992189,-0.0870788208,0.0288575556,-0.0413704826,0.0360416633,-0.0457083382,0.0582087079
0.06,0.075387108,-0.0993546808,0.0348783264,-0.0494615424,0.0405087816,-0.0498931385,0.0642673063
0.07,0.0853315542,-0.1105024334,0.0409863468,-0.0574853904,0.0443452075,-0.053017043,0.069118046
0.08,0.0948182897,-0.1206952271,0.047183439,-0.0654390956,0.0476348507,-0.0552561315,0.0729542259
0.09,0.1039189343,-0.1300766999,0.0534714378,-0.0733195776,0.0504474965,-0.0567571224,0.0759362947
0.1,0.1126931073,-0.1387653056,0.0598521856,-0.0811235991,0.0528409217,-0.0576417065,0.0781967348
0.11,0.1211903055,-0.1468581742,0.0663275277,-0.0888477592,0.0548627778,-0.0580104151,0.0798444278
0.12,0.1294515612,-0.1544345336,0.0728993054,-0.0964884853,0.0565522558,-0.0579460483,0.0809685257
0.13,0.1375108952,-0.1615587186,0.0795693494,-0.1040420263,0.0579415457,-0.0575166923,0.0816418558
0.14,0.1453965767,-0.1682827964,0.0863394722,-0.1115044446,0.0590571045,-0.0567783518,0.0819238843
0.15,0.1531322058,-0.1746488333,0.0932114586,-0.1188716092,0.0599207472,-0.0557772242,0.0818632682
0.16,0.1607376306,-0.180690832,0.1001870561,-0.1261391883,0.0605505744,-0.0545516437,0.0815000239
0.17,0.168229714,-0.1864363643,0.1072679636,-0.1333026427,0.0609617504,-0.0531337216,0.0808673444
0.18,0.1756229641,-0.1919079289,0.1144558188,-0.1403572193,0.0611671453,-0.0515507096,0.0799930955
0.19,0.1829300401,-0.1971240592,0.1217521845,-0.1472979455,0.0611778556,-0.0498261137,0.0789010242
0.2,0.1901621504,-0.202100209,0.1291585335,-0.154119624,0.061003617,-0.047980585,0.0776117119
0.21,0.1973293542,-0.2068494442,0.1366762317,-0.160816829,0.0606531226,-0.0460326152,0.0761433052
0.22,0.2044407815,-0.2113829656,0.1443065199,-0.1673839034,0.0601342617,-0.0439990622,0.0745120588
0.23,0.2115047854,-0.2157104922,0.1520504939,-0.1738149572,0.0594542915,-0.0418955349,0.0727327205
0.24,0.2185290401,-0.2198405298,0.1599090833,-0.1801038683,0.0586199568,-0.0397366615,0.0708187941
0.25,0.2255205985,-0.2237805544,0.1678830285,-0.1862442845,0.05763757,-0.0375362699,0.0687827088
0.26,0.2324859236,-0.2275371352,0.1759728561,-0.1922296286,0.0565130674,-0.0353075066,0.0666359273
0.27,0.2394309058,-0.2311160258,0.1841788533,-0.1980531059,0.0552520525,-0.0330629199,0.0643890206
0.28,0.2463608789,-0.2345222415,0.1925010407,-0.2037077143,0.0538598382,-0.0308145273,0.0620517305
0.29,0.2532806352,-0.2377601326,0.2009391443,-0.2091862589,0.0523414908,-0.0285738737,0.0596330271
0.3,0.2601944424,-0.2408334514,0.209492567,-0.2144813696,0.0507018754,-0.0263520818,0.0571411619
0.31,0.2671060614,-0.2437454156,0.218160359,-0.2195855228,0.0489457025,-0.0241598928,0.0545837174
0.32,0.2740187646,-0.246498767,0.2269411893,-0.2244910679,0.0470775753,-0.0220076991,0.0519676526
0.33,0.280935355,-0.2490958255,0.235833317,-0.2291902585,0.045102038,-0.019905567,0.0492993452
0.34,0.2878581868,-0.2515385397,0.2448345643,-0.2336752881,0.0430236226,-0.0178632516,0.0465846311
0.35,0.2947891861,-0.2538285329,0.2539422913,-0.2379383315,0.0408468948,-0.0158902015,0.0438288411
0.36,0.3017298719,-0.2559671455,0.2631533734,-0.2419715902,0.0385764984,-0.0139955553,0.0410368347
0.37,0.3086813791,-0.2579554735,0.2724641826,-0.2457673439,0.0362171965,-0.0121881296,0.0382130322
0.38,0.315644481,-0.2597944035,0.2818705722,-0.2493180049,0.0337739088,-0.0104763986,0.0353614457
0.39,0.3226196124,-0.2614846446,0.2913678681,-0.2526161783,0.0312517443,-0.0088684663,0.0324857079
0.4,0.3296068941,-0.2630267567,0.300950865,-0.2556547241,0.0286560291,-0.0073720326,0.0295891005
0.41,0.3366061571,-0.2644211756,0.3106138302,-0.2584268226,0.0259923269,-0.005994353,0.026674582
0.42,0.3436169672,-0.2656682353,0.320350514,-0.2609260407,0.0232664532,-0.0047421946,0.0237448153
0.43,0.3506386509,-0.2667681877,0.3301541691,-0.2631463988,0.0204844818,-0.0036217889,0.0208021958
0.44,0.3576703206,-0.2677212193,0.3400175777,-0.2650824362,0.017652743,-0.0026387831,0.0178488798
0.45,0.3647109009,-0.2685274652,0.3499330869,-0.2667292736,0.0147778139,-0.0017981916,0.0148868156
0.46,0.3717591546,-0.2691870214,0.3598926531,-0.2680826721,0.0118665015,-0.0011043494,0.0119177786
0.47,0.3788137098,-0.2696999542,0.3698878929,-0.2691390851,0.0089258169,-0.0005608691,0.0089434211
0.48,0.3858730859,-0.2700663077,0.379910142,-0.2698957046,0.0059629439,-0.0001706031,0.0059653839
0.49,0.3929357213,-0.2702861097,0.3899505202,-0.2703504973,0.0029852012,6.43877e-05,0.0029858955
0.5,0.4,-0.2703593754,0.4,-0.2705022323,-0,0.0001428569,0.0001428569
0.51,0.4070642787,-0.2702861097,0.4100494798,-0.2703504973,-0.0029852012,6.43877e-05,0.0029858955
0.52,0.4141269141,-0.2700663077,0.420089858,-0.2698957046,-0.0059629439,-0.0001706031,0.0059653839
0.53,0.4211862902,-0.2696999542,0.4301121071,-0.2691390851,-0.0089258169,-0.0005608691,0.0089434211
0.54,0.4282408454,-0.2691870214,0.4401073469,-0.2680826721,-0.0118665015,-0.0011043494,0.0119177786
0.55,0.4352890991,-0.2685274652,0.4500669131,-0.2667292736,-0.0147778139,-0.0017981916,0.0148868156
0.56,0.4423296794,-0.2677212193,0.4599824223,-0.2650824362,-0.017652743,-0.0026387831,0.0178488798
0.57,0.4493613491,-0.2667681877,0.4698458309,-0.2631463988,-0.0204844818,-0.0036217889,0.0208021958
0.58,0.4563830328,-0.2656682353,0.479649486,-0.2609260407,-0.0232664532,-0.0047421946,0.0237448153
0.59,0.4633938429,-0.2644211756,0.4893861698,-0.2584268226,-0.0259923269,-0.005994353,0.026674582
0.6,0.4703931059,-0.2630267567,0.499049135,-0.2556547241,-0.0286560291,-0.0073720326,0.0295891005
0.61,0.4773803876,-0.2614846446,0.5086321319,-0.2526161783,-0.0312517443,-0.0088684663,0.0324857079
0.62,0.484355519,-0.2597944035,0.5181294278,-0.2493180049,-0.0337739088,-0.0104763986,0.0353614457
0.63,0.4913186209,-0.2579554735,0.5275358174,-0.2457673439,-0.0362171965,-0.0121881296,0.0382130322
0.64,0.4982701281,-0.2559671455,0.5368466266,-0.2419715902,-0.0385764984,-0.0139955553,0.0410368347
0.65,0.5052108139,-0.2538285329,0.5460577087,-0.2379383315,-0.0408468948,-0.0158902015,0.0438288411
0.66,0.5121418132,-0.2515385397,0.5551654357,-0.2336752881,-0.0430236226,-0.0178632516,0.0465846311
0.67,0.519064645,-0.2490958255,0.564166683,-0.2291902585,-0.045102038,-0.019905567,0.0492993452
0.68,0.5259812354,-0.246498767,0.5730588107,-0.2244910679,-0.0470775753,-0.0220076991,0.0519676526
0.69,0.5328939386,-0.2437454156,0.581839641,-0.2195855228,-0.0489457025,-0.0241598928,0.0545837174
0.7,0.5398055576,-0.2408334514,0.590507433,-0.2144813696,-0.0507018754,-0.0263520818,0.0571411619
0.71,0.5467193648,-0.2377601326,0.5990608557,-0.2091862589,-0.0523414908,-0.0285738737,0.0596330271
0.72,0.5536391211,-0.2345222415,0.6074989593,-0.2037077143,-0.0538598382,-0.0308145273,0.0620517305
0.73,0.5605690942,-0.2311160258,0.6158211467,-0.1980531059,-0.0552520525,-0.0330629199,0.0643890206
0.74,0.5675140764,-0.2275371352,0.6240271439,-0.1922296286,-0.0565130674,-0.0353075066,0.0666359273
0.75,0.5744794015,-0.2237805544,0.6321169715,-0.1862442845,-0.05763757,-0.0375362699,0.0687827088
0.76,0.5814709599,-0.2198405298,0.6400909167,-0.1801038683,-0.0586199568,-0.0397366615,0.0708187941
0.77,0.5884952146,-0.2157104922,0.6479495061,-0.1738149572,-0.0594542915,-0.0418955349,0.0727327205
0.78,0.5955592185,-0.2113829656,0.6556934801,-0.1673839034,-0.0601342617,-0.0439990622,0.0745120588
0.79,0.6026706458,-0.2068494442,0.6633237683,-0.160816829,-0.0606531226,-0.0460326152,0.0761433052
0.8,0.6098378496,-0.202100209,0.6708414665,-0.154119624,-0.061003617,-0.047980585,0.0776117119
0.81,0.6170699599,-0.1971240592,0.6782478155,-0.1472979455,-0.0611778556,-0.0498261137,0.0789010242
0.82,0.6243770359,-0.1919079289,0.6855441812,-0.1403572193,-0.0611671453,-0.0515507096,0.0799930955
0.83,0.631770286,-0.1864363643,0.6927320364,-0.1333026427,-0.0609617504,-0.0531337216,0.0808673444
0.84,0.6392623694,-0.180690832,0.6998129439,-0.1261391883,-0.0605505744,-0.0545516437,0.0815000239
0.85,0.6468677942,-0.1746488333,0.7067885414,-0.1188716092,-0.0599207472,-0.0557772242,0.0818632682
0.86,0.6546034233,-0.1682827964,0.7136605278,-0.1115044446,-0.0590571045,-0.0567783518,0.0819238843
0.87,0.6624891048,-0.1615587186,0.7204306506,-0.1040420263,-0.0579415457,-0.0575166923,0.0816418558
0.88,0.6705484388,-0.1544345336,0.7271006946,-0.0964884853,-0.0565522558,-0.0579460483,0.0809685257
0.89,0.6788096945,-0.1468581742,0.7336724723,-0.0888477592,-0.0548627778,-0.0580104151,0.0798444278
0.9,0.6873068927,-0.1387653056,0.7401478144,-0.0811235991,-0.0528409217,-0.0576417065,0.0781967348
0.91,0.6960810657,-0.1300766999,0.7465285622,-0.0733195776,-0.0504474965,-0.0567571224,0.0759362947
0.92,0.7051817103,-0.1206952271,0.752816561,-0.0654390956,-0.0476348507,-0.0552561315,0.0729542259
0.93,0.7146684458,-0.1105024334,0.7590136532,-0.0574853904,-0.0443452075,-0.053017043,0.069118046
0.94,0.724612892,-0.0993546808,0.7651216736,-0.0494615424,-0.0405087816,-0.0498931385,0.0642673063
0.95,0.7351007811,-0.0870788208,0.7711424444,-0.0413704826,-0.0360416633,-0.0457083382,0.0582087079
0.96,0.7462343164,-0.0734673744,0.7770777713,-0.0332149997,-0.0308434549,-0.0402523747,0.0507106732
0.97,0.7581347923,-0.0582731924,0.7829294402,-0.0249977467,-0.0247946479,-0.0332754457,0.0414973475
0.98,0.770945489,-0.0412035678,0.7886992141,-0.0167212476,-0.017753725,-0.0244823202,0.0302420032
0.99,0.7848348565,-0.0219137738,0.7943888306,-0.0083879038,-0.0095539741,-0.0135258701,0.0165598183
1,0.8,-0,0.8,0,-0,-0,0
