xi,sx,sy,cx,cy,ex,ey,ne
0,-0,0,0,0,-0,0,0
0.01,0.0163483401,0.0008068536,0.0037914556,-0.0092733906,0.0125568845,0.0100802442,0.016102381
0.02,0.0322622145,0.0018373409,0.0078891869,-0.0184138633,0.0243730276,0.0202512042,0.0316884166
0.03,0.0477416231,0.0030914619,0.012340816,-0.0273855114,0.0354008071,0.0304769732,0.0467125577
0.04,0.062786566,0.0045692165,0.0172036767,-0.0361391581,0.0455828893,0.0407083746,0.0611144137
0.05,0.0773970431,0.0062706048,0.0225463053,-0.0446063701,0.0548507378,0.0508769749,0.0748135684
0.06,0.0915730545,0.0081956268,0.0284489904,-0.0526905994,0.0631240642,0.0608862262,0.0877027937
0.07,0.1053146002,0.0103442825,0.035001493,-0.0602545109,0.0703131072,0.0705987934,0.0996399652
0.08,0.1186216801,0.0127165719,0.0422939508,-0.0671034437,0.0763277293,0.0798200155,0.1104407404
0.09,0.1314942942,0.0153124949,0.0503939155,-0.0729687461,0.0811003788,0.088281241,0.1198784757
0.1,0.1439324426,0.0181320516,0.0593014077,-0.0775046952,0.084631035,0.0956367468,0.1277059099
0.11,0.1559361253,0.021175242,0.0688854156,-0.0803279778,0.0870507097,0.1015032197,0.1337188456
0.12,0.1675053422,0.024442066,0.0788417152,-0.0811260621,0.088663627,0.1055681281,0.1378617729
0.13,0.1786400934,0.0279325238,0.0887416831,-0.0797975972,0.0898984103,0.1077301209,0.1403121632
0.14,0.1893403788,0.0316466152,0.0981769446,-0.0765079,0.0911634342,0.1081545151,0.1414502417
0.15,0.1996061985,0.0355843402,0.1068869689,-0.0716009419,0.0927192296,0.1071852821,0.141723464
0.16,0.2094375525,0.039745699,0.1147797361,-0.0654579425,0.0946578163,0.1052036415,0.1415199928
0.17,0.2188344407,0.0441306914,0.121877855,-0.0584066237,0.0969565856,0.1025373152,0.1411186752
0.18,0.2277968631,0.0487393176,0.1282578349,-0.0506957853,0.0995390282,0.0994351029,0.1406959766
0.19,0.2363248198,0.0535715773,0.1340111868,-0.0425039434,0.1023136331,0.0960755208,0.1403516484
0.2,0.2444183108,0.0586274708,0.1392257778,-0.0339567272,0.105192533,0.092584198,0.1401331606
0.21,0.252077336,0.063906998,0.1439789901,-0.0251425672,0.1080983459,0.0890495651,0.1400538376
0.22,0.2593018955,0.0694101588,0.1483364263,-0.0161243387,0.1109654691,0.0855344975,0.1401052661
0.23,0.2660919892,0.0751369533,0.152352818,-0.0069474009,0.1137391712,0.0820843542,0.1402656061
0.24,0.2724476172,0.0810873814,0.1560736002,0.00235499,0.116374017,0.0787323915,0.1405051646
0.25,0.2783687794,0.0872614433,0.1595365209,0.0117580498,0.1188322585,0.0755033935,0.1407901563
0.26,0.2839587852,0.0935864458,0.1627730627,0.0212430145,0.1211857225,0.0723434313,0.1411366409
0.27,0.2893209437,0.0999896959,0.1658096253,0.0307954655,0.1235113184,0.0691942304,0.1415729046
0.28,0.2944552551,0.1064711936,0.1686684829,0.0404041688,0.1257867722,0.0660670247,0.1420815393
0.29,0.2993617193,0.1130309389,0.1713685493,0.0500602595,0.12799317,0.0629706794,0.1426448668
0.3,0.3040403362,0.1196689318,0.1739259874,0.0597566589,0.1301143489,0.0599122729,0.1432453288
0.31,0.308491106,0.1263851724,0.1763546957,0.0694876535,0.1321364103,0.0568975188,0.1438657658
0.32,0.3127140286,0.1331796605,0.1786666968,0.0792485855,0.1340473318,0.053931075,0.1444896121
0.33,0.3167091039,0.1400523963,0.1808724492,0.0890356225,0.1358366547,0.0510167737,0.1451010267
0.34,0.3204763321,0.1470033796,0.1829811004,0.0988455849,0.1374952317,0.0481577948,0.145684975
0.35,0.3240157131,0.1540326106,0.185000691,0.1086758135,0.1390150221,0.0453567971,0.1462272731
0.36,0.3273272468,0.1611400892,0.1869383226,0.1185240688,0.1403889243,0.0426160204,0.1467146048
0.37,0.3304109334,0.1683258154,0.1888002955,0.1283884514,0.1416106378,0.039937364,0.147134516
0.38,0.3332667727,0.1755897892,0.1905922229,0.138267341,0.1426745498,0.0373224482,0.1474753956
0.39,0.3358947649,0.1829320106,0.192319125,0.1481593467,0.1435756398,0.0347726639,0.1477264449
0.4,0.3382949099,0.1903524796,0.1939855091,0.1580632685,0.1443094008,0.0322892112,0.1478776397
0.41,0.3404672076,0.1978511963,0.1955954354,0.1679780656,0.1448717723,0.0298731307,0.1479196888
0.42,0.3424116582,0.2054281605,0.1971525741,0.1779028312,0.1452590841,0.0275253293,0.1478439896
0.43,0.3441282615,0.2130833724,0.1986602528,0.1878367716,0.1454680087,0.0252466008,0.1476425833
0.44,0.3456170177,0.2208168318,0.2001214977,0.1977791891,0.14549552,0.0230376427,0.1473081102
0.45,0.3468779266,0.2286285389,0.2015390681,0.2077294683,0.1453388586,0.0208990706,0.1468337664
0.46,0.3479109884,0.2365184936,0.2029154868,0.217687064,0.1449955016,0.0188314296,0.1462132629
0.47,0.348716203,0.2444866959,0.2042530662,0.2276514917,0.1444631368,0.0168352042,0.1454407852
0.48,0.3492935703,0.2525331458,0.2055539308,0.2376223195,0.1437396395,0.0149108263,0.1445109571
0.49,0.3496430905,0.2606578433,0.2068200367,0.2475991609,0.1428230538,0.0130586824,0.1434188058
0.5,0.3497647634,0.2688607884,0.2080531891,0.2575816694,0.1417115743,0.011279119,0.14215973
0.51,0.3497131172,0.2770886528,0.2092550569,0.267569533,0.1404580602,0.0095191198,0.1407802555
0.52,0.3495426797,0.2852881081,0.2104271865,0.2775624705,0.1391154932,0.0077256375,0.1393298457
0.53,0.3492534509,0.2934591543,0.2115710129,0.2875602275,0.137682438,0.0058989267,0.1378087482
0.54,0.3488454309,0.3016017914,0.2126878704,0.2975625734,0.1361575605,0.004039218,0.1362174605
0.55,0.3483186196,0.3097160194,0.2137790018,0.3075692986,0.1345396178,0.0021467209,0.1345567433
0.56,0.3476730172,0.3178018384,0.2148455663,0.3175802122,0.1328274509,0.0002216262,0.1328276358
0.57,0.3469086234,0.3258592482,0.2158886468,0.3275951401,0.1310199766,-0.0017358919,0.1310314756
0.58,0.3460254384,0.333888249,0.2169092567,0.3376139232,0.1291161817,-0.0037256742,0.1291699231
0.59,0.3450234622,0.3418888406,0.2179083455,0.3476364154,0.1271151167,-0.0057475748,0.1272449902
0.6,0.3439026947,0.3498610232,0.2188868038,0.3576624829,0.1250158909,-0.0078014596,0.1252590746
0.61,0.342663136,0.3578047967,0.2198454686,0.3676920025,0.1228176674,-0.0098872057,0.1232150002
0.62,0.341304786,0.3657201611,0.220785127,0.3777248608,0.1205196591,-0.0120046996,0.1211160643
0.63,0.3398276448,0.3736071164,0.2217065203,0.3877609531,0.1181211245,-0.0141538367,0.1189660924
0.64,0.3382317124,0.3814656627,0.2226103475,0.3978001828,0.1156213648,-0.0163345201,0.1167695018
0.65,0.3365169887,0.3892957998,0.2234972684,0.4078424604,0.1130197203,-0.0185466606,0.1145313747
0.66,0.3346834737,0.3970975279,0.2243679063,0.4178877029,0.1103155674,-0.020790175,0.1122575423
0.67,0.3327311675,0.4048708468,0.2252228509,0.4279358334,0.1075083166,-0.0230649865,0.1099546805
0.68,0.3306600701,0.4126157567,0.2260626605,0.4379867803,0.1045974096,-0.0253710236,0.1076304183
0.69,0.3284701814,0.4203322575,0.2268878642,0.448040477,0.1015823172,-0.0277082195,0.1052934595
0.7,0.3261615015,0.4280203492,0.227698964,0.4580968616,0.0984625375,-0.0300765124,0.1029537172
0.71,0.3237340303,0.4356800318,0.2284964365,0.4681558762,0.0952375938,-0.0324758443,0.1006224614
0.72,0.3211877679,0.4433113054,0.2292807346,0.4782174666,0.0919070333,-0.0349061613,0.0983124757
0.73,0.3185227142,0.4509141698,0.230052289,0.4882815825,0.0884704252,-0.0373674127,0.0960382198
0.74,0.3157388693,0.4584886251,0.2308115099,0.4983481764,0.0849273594,-0.0398595513,0.0938159912
0.75,0.3128362332,0.4660346714,0.2315587878,0.5084172041,0.0812774454,-0.0423825327,0.0916640726
0.76,0.3098876864,0.4737369363,0.2322944951,0.5184886239,0.0775931913,-0.0447516876,0.0895735278
0.77,0.3069661098,0.4817800476,0.2330189871,0.5285623969,0.0739471227,-0.0467823493,0.0875029437
0.78,0.3040715033,0.4901640053,0.2337326031,0.5386384863,0.0703389002,-0.048474481,0.0854244473
0.79,0.3012038669,0.4988888094,0.234435667,0.5487168577,0.0667681999,-0.0498280482,0.0833116252
0.8,0.2983632006,0.5079544599,0.2351284888,0.5587974784,0.0632347117,-0.0508430184,0.0811396407
0.81,0.2955495043,0.5173609568,0.235811365,0.5688803179,0.0597381394,-0.051519361,0.0788852956
0.82,0.2927627782,0.5271083001,0.2364845792,0.5789653472,0.056278199,-0.0518570471,0.0765270476
0.83,0.2900030222,0.5371964898,0.2371484033,0.5890525392,0.0528546189,-0.0518560493,0.0740449903
0.84,0.2872702363,0.5476255259,0.2378030978,0.5991418679,0.0494671385,-0.051516342,0.0714208042
0.85,0.2845644205,0.5583954084,0.2384489127,0.609233309,0.0461155078,-0.0508379007,0.0686376879
0.86,0.2818855748,0.5695061373,0.2390860876,0.6193268396,0.0427994872,-0.0498207023,0.0656802747
0.87,0.2792336992,0.5809577125,0.2397148528,0.6294224376,0.0395188464,-0.0484647251,0.0625345408
0.88,0.2766087937,0.5927501342,0.2403354294,0.6395200824,0.0362733642,-0.0467699482,0.05918771
0.89,0.2740108583,0.6048834022,0.24094803,0.6496197544,0.0330628283,-0.0447363522,0.0556281567
0.9,0.2714398929,0.6173575167,0.2415528589,0.6597214349,0.029887034,-0.0423639182,0.051845312
0.91,0.2688958977,0.6301724776,0.2421501128,0.6698251063,0.0267457849,-0.0396526288,0.0478295722
0.92,0.2663788726,0.6433282848,0.242739981,0.6799307517,0.0236388916,-0.0366024669,0.0435722134
0.93,0.2638888176,0.6568249384,0.2433226458,0.6900383552,0.0205661718,-0.0332134167,0.0390653104
0.94,0.2614257327,0.6706624385,0.2438982828,0.7001479015,0.0175274499,-0.029485463,0.0343016621
0.95,0.258989618,0.6848407849,0.2444670614,0.7102593761,0.0145225566,-0.0254185911,0.0292747233
0.96,0.2565804733,0.6993599778,0.2450291447,0.7203727652,0.0115513285,-0.0210127875,0.023978541
0.97,0.2541982987,0.714220017,0.2455846904,0.7304880557,0.0086136083,-0.0162680388,0.0184076977
0.98,0.2518430942,0.7294209026,0.2461338503,0.7406052351,0.0057092438,-0.0111843325,0.0125572592
0.99,0.2495148598,0.7449626346,0.2466767714,0.7507242914,0.0028380883,-0.0057616567,0.0064227279
1,0.2472135955,0.760845213,0.2472135955,0.760845213,0,0,0
