xi,s1,s2
0,-3.3108016250181e-26,-1.38483998379025e-25
0.01,0.00649614388034363,0.00765751154146155
0.02,0.0129287321713631,0.0153718421757632
0.03,0.0192716111119392,0.0231621383488002
0.04,0.0255058982940109,0.0310408131533063
0.05,0.0316185974187075,0.0390150522029434
0.06,0.0376014207431009,0.0470880565061802
0.07,0.0434497945240623,0.0552600591956989
0.08,0.0491620250484902,0.0635291488640514
0.09,0.0547386049642435,0.0718919285037817
0.1,0.0601816416010804,0.0803440356282046
0.11,0.0654943908031107,0.0888805460363425
0.12,0.0706808814908897,0.0974962808619099
0.13,0.0757456177392254,0.106186033992297
0.14,0.0806933466027708,0.114944734640686
0.15,0.0855288812520272,0.123767557784978
0.16,0.0902569702037931,0.132649993334248
0.17,0.094882204548452,0.141587883230746
0.18,0.099408956097687,0.150577434227757
0.19,0.10384134030594,0.159615212786239
0.2,0.108183198662681,0.168698127392223
0.21,0.112438096015635,0.177823402599334
0.22,0.116609328972613,0.186988548233971
0.23,0.12069994214648,0.196191326452943
0.24,0.124712749558733,0.205429718703558
0.25,0.128650359006779,0.214701894093813
0.26,0.132515197632613,0.224006180225622
0.27,0.136309537310457,0.233341037167708
0.28,0.140035518801973,0.242705034938248
0.29,0.143695173913848,0.252096834622492
0.3,0.14729044513749,0.26151517305992
0.31,0.150823202457791,0.270958850892063
0.32,0.154295257190816,0.280426723659475
0.33,0.157708372851987,0.289917695568481
0.34,0.161064273169928,0.299430715509914
0.35,0.16436464744951,0.308964774897983
0.36,0.167611153553509,0.318518906903201
0.37,0.170805418818214,0.328092186674832
0.38,0.173949039246814,0.337683732181904
0.39,0.177043577337659,0.347292705344126
0.4,0.180090558904765,0.356918313172226
0.41,0.18309146923716,0.366559808688627
0.42,0.186047748923828,0.376216491451843
0.43,0.188960789643738,0.385887707559603
0.44,0.191831930187466,0.395572849054926
0.45,0.194662452939711,0.405271352704811
0.46,0.197453581011851,0.414982698161957
0.47,0.20020647617204,0.424706405555146
0.48,0.202922237678101,0.43444203258303
0.49,0.205601902076855,0.44418917120888
0.5,0.208246443993362,0.453947444070108
0.51,0.210856777895629,0.463716500726241
0.52,0.213433760785391,0.473496013872644
0.53,0.215978195734219,0.483285675645126
0.54,0.218490836156858,0.49308519413301
0.55,0.220972390690849,0.502894290206049
0.56,0.223423528533373,0.512712694744263
0.57,0.2258448850731,0.522540146340312
0.58,0.228237067646819,0.532376389522121
0.59,0.230600661247653,0.542221173520026
0.6,0.232936234013874,0.552074251578684
0.61,0.235244342334429,0.561935380790193
0.62,0.237525535419173,0.571804322402216
0.63,0.239780359198158,0.581680842534315
0.64,0.24200935943479,0.591564713217829
0.65,0.244213083961849,0.601455713660386
0.66,0.246392083976774,0.611353631626013
0.67,0.248546914362668,0.621258264816459
0.68,0.250678133033611,0.631169422139139
0.69,0.252786299336411,0.641086924752301
0.7,0.254871971575082,0.651010606788826
0.71,0.256935703758486,0.660940315676362
0.72,0.258978041704701,0.670875911993034
0.73,0.260999518667104,0.680817268824362
0.74,0.263000650675802,0.690764270617503
0.75,0.264981931813098,0.700716811562646
0.76,0.266943829662047,0.710674793567068
0.77,0.268886781181852,0.720638123923612
0.78,0.270811189271868,0.730606712810307
0.79,0.272717420286092,0.740580470789478
0.8,0.274605802751315,0.750559306500571
0.81,0.276476627523243,0.760543124758163
0.82,0.278330149584863,0.770531825272252
0.83,0.280166591648901,0.780525302198157
0.84,0.281986149670173,0.790523444694499
0.85,0.283789000302837,0.80052613861516
0.86,0.285575310250734,0.810533269380209
0.87,0.287345247354984,0.820544725956103
0.88,0.289098993140539,0.830560405721353
0.89,0.290836756401297,0.840580219794006
0.9,0.292558787240337,0.850604098144912
0.91,0.294265390796803,0.860631993508591
0.92,0.295956939682517,0.870663882723688
0.93,0.297633883918549,0.880699763679051
0.94,0.29929675690339,0.890739645500477
0.95,0.300946175658942,0.900783528977401
0.96,0.302582833287146,0.910831373488101
0.97,0.304207481227505,0.920883045825497
0.98,0.305820898533033,0.930938245341697
0.99,0.307423844978059,0.940996398706003
1,0.309016994374947,0.951056516295154
