xi,s1,s2
0,3.99579573465913e-26,-1.52385674311792e-26
0.01,-0.0179133435551093,-0.022681502568333
0.02,-0.0339692179200169,-0.042675460008155
0.03,-0.0484581562151057,-0.0604120237365169
0.04,-0.0616299742149875,-0.0762599769171727
0.05,-0.0736979892681562,-0.0905331620033619
0.06,-0.0848430029481032,-0.103496545930573
0.07,-0.0952170474358955,-0.115371922959291
0.08,-0.104946895634216,-0.126343255167722
0.09,-0.114137335012866,-0.136561650594507
0.1,-0.12287420518573,-0.146149979031408
0.11,-0.131227199219204,-0.155207125465985
0.12,-0.139252428672083,-0.163811881174247
0.13,-0.146994752366914,-0.172026472463292
0.14,-0.154489868892813,-0.179899727063921
0.15,-0.161766172839736,-0.18746987817324
0.16,-0.168846374764222,-0.194767006147243
0.17,-0.175748884886594,-0.201815117843371
0.18,-0.182488960519622,-0.208633863613058
0.19,-0.189079617228647,-0.215239891944263
0.2,-0.195532303723173,-0.22164784175397
0.21,-0.20185734080255,-0.227870972828454
0.22,-0.208064142745951,-0.233921462784218
0.23,-0.214161318582408,-0.239810520876328
0.24,-0.220156750676665,-0.245548468980874
0.25,-0.226057669021053,-0.251144818124473
0.26,-0.231870721556015,-0.256608341058592
0.27,-0.237602040519274,-0.26194714087869
0.28,-0.24325730482367,-0.267168715688171
0.29,-0.248841798463628,-0.272280019307158
0.3,-0.254360464950295,-0.277287518026085
0.31,-0.259817957775314,-0.282197243404106
0.32,-0.26521868690326,-0.287014841112314
0.33,-0.270566861292723,-0.291745615821788
0.34,-0.27586652744604,-0.29639457213645
0.35,-0.281121603987683,-0.300966451570739
0.36,-0.286335912271294,-0.305465765572107
0.37,-0.291513203015377,-0.309896824588326
0.38,-0.296657178967635,-0.314263763179619
0.39,-0.301771513597961,-0.318570561175597
0.4,-0.306859865820083,-0.322821060877027
0.41,-0.311925890747443,-0.327018980307234
0.42,-0.316973246801807,-0.331167922788335
0.43,-0.322005600862024,-0.335271384300292
0.44,-0.327026633140369,-0.339332760080761
0.45,-0.332040042104949,-0.343355350740939
0.46,-0.337049549453773,-0.347342367902217
0.47,-0.342058905140462,-0.351296939353655
0.48,-0.347071892451632,-0.355222113730267
0.49,-0.352092333135917,-0.359120864712126
0.5,-0.357124092584655,-0.362996094744278
0.51,-0.36217108506423,-0.366850638277481
0.52,-0.367237279000065,-0.370687264529748
0.53,-0.37232670231227,-0.374508679768713
0.54,-0.377443447802949,-0.378317529114808
0.55,-0.38259167859516,-0.38211639786526
0.56,-0.387775633623531,-0.385907812338897
0.57,-0.392999633176528,-0.389694240241776
0.58,-0.398268084490381,-0.393478090553619
0.59,-0.403585487394668,-0.397261712935069
0.6,-0.408956440009547,-0.401047396655762
0.61,-0.414385644502497,-0.404837369047481
0.62,-0.419877913352037,-0.408633793725811
0.63,-0.425438178489224,-0.412438769869942
0.64,-0.43107150568773,-0.416254333850294
0.65,-0.436783114649984,-0.420082463447351
0.66,-0.442578404797213,-0.423925084665998
0.67,-0.44846298676339,-0.427784081145346
0.68,-0.454442719593089,-0.431661306164051
0.69,-0.46052375364324,-0.435558597241124
0.7,-0.466712579188802,-0.439477793332242
0.71,-0.473016080732324,-0.443420754621537
0.72,-0.479441597017426,-0.447389384908892
0.73,-0.485996986746178,-0.451385656592724
0.74,-0.492690700000388,-0.455411638248258
0.75,-0.499531855366792,-0.4594695248013
0.76,-0.506530322766153,-0.463561670297494
0.77,-0.513696811986263,-0.467690623267078
0.78,-0.521042966918853,-0.471859164685138
0.79,-0.528581465500404,-0.476070348527338
0.8,-0.536326125356868,-0.480327544921163
0.81,-0.544292015740299,-0.484634485929636
0.82,-0.552495609273584,-0.488995316076415
0.83,-0.560955151080359,-0.493414658785593
0.84,-0.56969142287715,-0.497897709909556
0.85,-0.57872893554395,-0.502450360453783
0.86,-0.588097550761238,-0.507079348535563
0.87,-0.597834531713429,-0.511792440576657
0.88,-0.607987022858771,-0.51659864172988
0.89,-0.618614958765671,-0.521508435539621
0.9,-0.629794402015465,-0.526534052836291
0.91,-0.641621310171625,-0.531689769864704
0.92,-0.654215731815401,-0.536992235646386
0.93,-0.667726431647905,-0.542460828575823
0.94,-0.682335944658632,-0.548118042250624
0.95,-0.698266059360416,-0.553989900535636
0.96,-0.715783730090829,-0.560106401860974
0.97,-0.735207418380011,-0.566501992753986
0.98,-0.756913863384948,-0.573216070605156
0.99,-0.78134528139018,-0.58029351566793
1,-0.809016994374947,-0.587785252292473
