xi,s1,s2
0,0,0
0.01,-0.00289560718190077,-0.00969859995413489
0.02,-0.00582633224879267,-0.0193851045136035
0.03,-0.00879300719428849,-0.0290591179134494
0.04,-0.0117964922810474,-0.0387202248408332
0.05,-0.0148376772436081,-0.0483679892457868
0.06,-0.0179174825490821,-0.0580019530667534
0.07,-0.0210368607184318,-0.0676216348639556
0.08,-0.0241967977111365,-0.0772265283530195
0.09,-0.0273983143761051,-0.0868161008305841
0.1,-0.030642467971742,-0.0963897914828802
0.11,-0.0339303537580971,-0.105947009567433
0.12,-0.0372631066640299,-0.115487132457135
0.13,-0.0406419030322897,-0.125009503534944
0.14,-0.0440679624453426,-0.134513429926365
0.15,-0.0475425496346584,-0.143998180055687
0.16,-0.0510669764759971,-0.153462981010621
0.17,-0.0546426040729857,-0.162907015698562
0.18,-0.0582708449309448,-0.172329419776106
0.19,-0.0619531652224844,-0.181729278331753
0.2,-0.0656910871458267,-0.191105622299804
0.21,-0.0694861913760966,-0.200457424581454
0.22,-0.0733401196089236,-0.209783595846776
0.23,-0.0772545771945829,-0.219082979988901
0.24,-0.08123133585953,-0.228354349199002
0.25,-0.0852722365104926,-0.23759639862783
0.26,-0.0893791921142368,-0.246807740596449
0.27,-0.0935541906436222,-0.25598689831543
0.28,-0.0977992980775529,-0.265132299068242
0.29,-0.102116661438803,-0.274242266810704
0.3,-0.106508511849328,-0.283315014134362
0.31,-0.110977167577482,-0.292348633537426
0.32,-0.115525037045294,-0.301341087942517
0.33,-0.120154621756604,-0.310290200396025
0.34,-0.124868519098007,-0.319193642879408
0.35,-0.129669424954164,-0.328048924158461
0.36,-0.134560136066741,-0.336853376592505
0.37,-0.139543552051733,-0.345604141822002
0.38,-0.144622676972953,-0.354298155250365
0.39,-0.149800620349573,-0.362932129234314
0.4,-0.155080597452462,-0.371502534897357
0.41,-0.160465928717189,-0.380005582483598
0.42,-0.165960038070599,-0.388437200174886
0.43,-0.171566449932334,-0.396793011304283
0.44,-0.177288784612218,-0.405068309914308
0.45,-0.183130751778793,-0.413258034630894
0.46,-0.189096141623273,-0.421356740855394
0.47,-0.195188813287028,-0.429358571319604
0.48,-0.201412680059762,-0.437257225105257
0.49,-0.207771690790913,-0.445045925303018
0.5,-0.214269806890273,-0.452717385580112
0.51,-0.220910974228024,-0.46026377604434
0.52,-0.227699089183592,-0.467676688939475
0.53,-0.234637958042487,-0.474947104886951
0.54,-0.241731248908648,-0.482065360605006
0.55,-0.248982435297016,-0.489021119291535
0.56,-0.256394730610307,-0.495803345151495
0.57,-0.263971012801567,-0.502400283881037
0.58,-0.271713738699303,-0.508799451281439
0.59,-0.279624847746317,-0.514987632552262
0.6,-0.287705655299753,-0.520950895182233
0.61,-0.295956736179477,-0.526674618684543
0.62,-0.304377799851565,-0.532143544664113
0.63,-0.312967559499589,-0.537341850798233
0.64,-0.321723598258577,-0.542253252186917
0.65,-0.330642237030333,-0.546861133105333
0.66,-0.339718409497983,-0.551148711388178
0.67,-0.348945551108119,-0.555099236428305
0.68,-0.358315509747852,-0.558696220044084
0.69,-0.367818486435779,-0.561923697278481
0.7,-0.377443014378343,-0.564766511627389
0.71,-0.387175984036005,-0.567210616432601
0.72,-0.397002720266933,-0.569243381483526
0.73,-0.406907115132114,-0.570853891591069
0.74,-0.41687181664818,-0.572033222399039
0.75,-0.426878469906494,-0.572774678324591
0.76,-0.43690800292391,-0.5730739785077
0.77,-0.446940945832406,-0.572929379067278
0.78,-0.456957769050616,-0.572341723661475
0.79,-0.466939224333697,-0.571314418972663
0.8,-0.476866672329524,-0.569853336760785
0.81,-0.486722381519528,-0.567966648956525
0.82,-0.496489786003614,-0.565664606338157
0.83,-0.506153693124772,-0.562959274228663
0.84,-0.515700435936686,-0.559864240139239
0.85,-0.525117969499937,-0.55639430836692
0.86,-0.534395913524153,-0.552565195412818
0.87,-0.543525546659122,-0.548393238037541
0.88,-0.5524997596326,-0.543895123180871
0.89,-0.561312975431864,-0.539087646200699
0.9,-0.569961044932615,-0.533987501227337
0.91,-0.578441125960245,-0.528611105093
0.92,-0.58675155291629,-0.522974454401564
0.93,-0.594891703001107,-0.517093013890508
0.94,-0.60286186386774,-0.510981633285666
0.95,-0.610663106369477,-0.504654489302146
0.96,-0.618297164993616,-0.49812504922478
0.97,-0.625766327651312,-0.4914060525277
0.98,-0.633073335735825,-0.484509507189699
0.99,-0.640221294767518,-0.477446697665705
1,-0.647213595499958,-0.470228201833979
