\begin{tikzpicture}[%
    yarn/.style={%
      /cdpr/cable,%
      draw=Black,%
      draw opacity=1.00,%
      fill=Red,%
      fill opacity=0.80,%
    },%
    assembled yarn/.style={%
      /cdpr/cable,%
      draw=Black,%
      draw opacity=1.00,%
      fill=Red,%
      fill opacity=0.60,%
    },%
    strand/.style={%
      /cdpr/cable,%
      draw=Black,%
      draw opacity=1.00,%
      fill=Red,%
      fill opacity=0.40,%
    },%
    rope/.style={%
      /cdpr/cable,%
      draw=Black,%
      draw opacity=1.00,%
      fill=Red,%
      fill opacity=0.20,%
    },%
  ]%
  


\draw[%
    rope,%
  ]%
  (0cm,0cm)%
    circle(1cm);

\draw[%
    strand,%
  ]%
  (-0.3333333333333333cm,-0.5773502691896257cm)%
    circle(0.3333333333333333cm);

\draw[%
    assembled yarn,%
  ]%
  (-0.4444444444444444cm,-0.7698003589195009cm)%
    circle(0.1111111111111111cm);

\draw[%
    yarn,%
  ]%
  (-0.48148148148148145cm,-0.8339503888294594cm)%
    circle(0.037037037037037035cm);

\draw[%
    yarn,%
  ]%
  (-0.4074074074074074cm,-0.8339503888294594cm)%
    circle(0.037037037037037035cm);

\draw[%
    yarn,%
  ]%
  (-0.5185185185185185cm,-0.7698003589195009cm)%
    circle(0.037037037037037035cm);

\draw[%
    yarn,%
  ]%
  (-0.37037037037037035cm,-0.7698003589195009cm)%
    circle(0.037037037037037035cm);

\draw[%
    yarn,%
  ]%
  (-0.48148148148148145cm,-0.7056503290095425cm)%
    circle(0.037037037037037035cm);

\draw[%
    yarn,%
  ]%
  (-0.4074074074074074cm,-0.7056503290095425cm)%
    circle(0.037037037037037035cm);

\draw[%
    assembled yarn,%
  ]%
  (-0.2222222222222222cm,-0.7698003589195009cm)%
    circle(0.1111111111111111cm);

\draw[%
    yarn,%
  ]%
  (-0.25925925925925924cm,-0.8339503888294594cm)%
    circle(0.037037037037037035cm);

\draw[%
    yarn,%
  ]%
  (-0.18518518518518517cm,-0.8339503888294594cm)%
    circle(0.037037037037037035cm);

\draw[%
    yarn,%
  ]%
  (-0.2962962962962963cm,-0.7698003589195009cm)%
    circle(0.037037037037037035cm);

\draw[%
    yarn,%
  ]%
  (-0.14814814814814814cm,-0.7698003589195009cm)%
    circle(0.037037037037037035cm);

\draw[%
    yarn,%
  ]%
  (-0.25925925925925924cm,-0.7056503290095425cm)%
    circle(0.037037037037037035cm);

\draw[%
    yarn,%
  ]%
  (-0.18518518518518517cm,-0.7056503290095425cm)%
    circle(0.037037037037037035cm);

\draw[%
    assembled yarn,%
  ]%
  (-0.5555555555555556cm,-0.5773502691896257cm)%
    circle(0.1111111111111111cm);

\draw[%
    yarn,%
  ]%
  (-0.5925925925925926cm,-0.6415002990995842cm)%
    circle(0.037037037037037035cm);

\draw[%
    yarn,%
  ]%
  (-0.5185185185185186cm,-0.6415002990995842cm)%
    circle(0.037037037037037035cm);

\draw[%
    yarn,%
  ]%
  (-0.6296296296296297cm,-0.5773502691896257cm)%
    circle(0.037037037037037035cm);

\draw[%
    yarn,%
  ]%
  (-0.4814814814814815cm,-0.5773502691896257cm)%
    circle(0.037037037037037035cm);

\draw[%
    yarn,%
  ]%
  (-0.5925925925925926cm,-0.5132002392796673cm)%
    circle(0.037037037037037035cm);

\draw[%
    yarn,%
  ]%
  (-0.5185185185185186cm,-0.5132002392796673cm)%
    circle(0.037037037037037035cm);

\draw[%
    assembled yarn,%
  ]%
  (-0.1111111111111111cm,-0.5773502691896257cm)%
    circle(0.1111111111111111cm);

\draw[%
    yarn,%
  ]%
  (-0.14814814814814814cm,-0.6415002990995842cm)%
    circle(0.037037037037037035cm);

\draw[%
    yarn,%
  ]%
  (-0.07407407407407407cm,-0.6415002990995842cm)%
    circle(0.037037037037037035cm);

\draw[%
    yarn,%
  ]%
  (-0.18518518518518517cm,-0.5773502691896257cm)%
    circle(0.037037037037037035cm);

\draw[%
    yarn,%
  ]%
  (-0.037037037037037035cm,-0.5773502691896257cm)%
    circle(0.037037037037037035cm);

\draw[%
    yarn,%
  ]%
  (-0.14814814814814814cm,-0.5132002392796673cm)%
    circle(0.037037037037037035cm);

\draw[%
    yarn,%
  ]%
  (-0.07407407407407407cm,-0.5132002392796673cm)%
    circle(0.037037037037037035cm);

\draw[%
    assembled yarn,%
  ]%
  (-0.4444444444444444cm,-0.3849001794597505cm)%
    circle(0.1111111111111111cm);

\draw[%
    yarn,%
  ]%
  (-0.48148148148148145cm,-0.44905020936970896cm)%
    circle(0.037037037037037035cm);

\draw[%
    yarn,%
  ]%
  (-0.4074074074074074cm,-0.44905020936970896cm)%
    circle(0.037037037037037035cm);

\draw[%
    yarn,%
  ]%
  (-0.5185185185185185cm,-0.3849001794597505cm)%
    circle(0.037037037037037035cm);

\draw[%
    yarn,%
  ]%
  (-0.37037037037037035cm,-0.3849001794597505cm)%
    circle(0.037037037037037035cm);

\draw[%
    yarn,%
  ]%
  (-0.48148148148148145cm,-0.3207501495497921cm)%
    circle(0.037037037037037035cm);

\draw[%
    yarn,%
  ]%
  (-0.4074074074074074cm,-0.3207501495497921cm)%
    circle(0.037037037037037035cm);

\draw[%
    assembled yarn,%
  ]%
  (-0.2222222222222222cm,-0.3849001794597505cm)%
    circle(0.1111111111111111cm);

\draw[%
    yarn,%
  ]%
  (-0.25925925925925924cm,-0.44905020936970896cm)%
    circle(0.037037037037037035cm);

\draw[%
    yarn,%
  ]%
  (-0.18518518518518517cm,-0.44905020936970896cm)%
    circle(0.037037037037037035cm);

\draw[%
    yarn,%
  ]%
  (-0.2962962962962963cm,-0.3849001794597505cm)%
    circle(0.037037037037037035cm);

\draw[%
    yarn,%
  ]%
  (-0.14814814814814814cm,-0.3849001794597505cm)%
    circle(0.037037037037037035cm);

\draw[%
    yarn,%
  ]%
  (-0.25925925925925924cm,-0.3207501495497921cm)%
    circle(0.037037037037037035cm);

\draw[%
    yarn,%
  ]%
  (-0.18518518518518517cm,-0.3207501495497921cm)%
    circle(0.037037037037037035cm);

\draw[%
    strand,%
  ]%
  (0.3333333333333333cm,-0.5773502691896257cm)%
    circle(0.3333333333333333cm);

\draw[%
    assembled yarn,%
  ]%
  (0.2222222222222222cm,-0.7698003589195009cm)%
    circle(0.1111111111111111cm);

\draw[%
    yarn,%
  ]%
  (0.18518518518518517cm,-0.8339503888294594cm)%
    circle(0.037037037037037035cm);

\draw[%
    yarn,%
  ]%
  (0.25925925925925924cm,-0.8339503888294594cm)%
    circle(0.037037037037037035cm);

\draw[%
    yarn,%
  ]%
  (0.14814814814814814cm,-0.7698003589195009cm)%
    circle(0.037037037037037035cm);

\draw[%
    yarn,%
  ]%
  (0.2962962962962963cm,-0.7698003589195009cm)%
    circle(0.037037037037037035cm);

\draw[%
    yarn,%
  ]%
  (0.18518518518518517cm,-0.7056503290095425cm)%
    circle(0.037037037037037035cm);

\draw[%
    yarn,%
  ]%
  (0.25925925925925924cm,-0.7056503290095425cm)%
    circle(0.037037037037037035cm);

\draw[%
    assembled yarn,%
  ]%
  (0.4444444444444444cm,-0.7698003589195009cm)%
    circle(0.1111111111111111cm);

\draw[%
    yarn,%
  ]%
  (0.4074074074074074cm,-0.8339503888294594cm)%
    circle(0.037037037037037035cm);

\draw[%
    yarn,%
  ]%
  (0.48148148148148145cm,-0.8339503888294594cm)%
    circle(0.037037037037037035cm);

\draw[%
    yarn,%
  ]%
  (0.37037037037037035cm,-0.7698003589195009cm)%
    circle(0.037037037037037035cm);

\draw[%
    yarn,%
  ]%
  (0.5185185185185185cm,-0.7698003589195009cm)%
    circle(0.037037037037037035cm);

\draw[%
    yarn,%
  ]%
  (0.4074074074074074cm,-0.7056503290095425cm)%
    circle(0.037037037037037035cm);

\draw[%
    yarn,%
  ]%
  (0.48148148148148145cm,-0.7056503290095425cm)%
    circle(0.037037037037037035cm);

\draw[%
    assembled yarn,%
  ]%
  (0.1111111111111111cm,-0.5773502691896257cm)%
    circle(0.1111111111111111cm);

\draw[%
    yarn,%
  ]%
  (0.07407407407407407cm,-0.6415002990995842cm)%
    circle(0.037037037037037035cm);

\draw[%
    yarn,%
  ]%
  (0.14814814814814814cm,-0.6415002990995842cm)%
    circle(0.037037037037037035cm);

\draw[%
    yarn,%
  ]%
  (0.037037037037037035cm,-0.5773502691896257cm)%
    circle(0.037037037037037035cm);

\draw[%
    yarn,%
  ]%
  (0.18518518518518517cm,-0.5773502691896257cm)%
    circle(0.037037037037037035cm);

\draw[%
    yarn,%
  ]%
  (0.07407407407407407cm,-0.5132002392796673cm)%
    circle(0.037037037037037035cm);

\draw[%
    yarn,%
  ]%
  (0.14814814814814814cm,-0.5132002392796673cm)%
    circle(0.037037037037037035cm);

\draw[%
    assembled yarn,%
  ]%
  (0.5555555555555556cm,-0.5773502691896257cm)%
    circle(0.1111111111111111cm);

\draw[%
    yarn,%
  ]%
  (0.5185185185185186cm,-0.6415002990995842cm)%
    circle(0.037037037037037035cm);

\draw[%
    yarn,%
  ]%
  (0.5925925925925926cm,-0.6415002990995842cm)%
    circle(0.037037037037037035cm);

\draw[%
    yarn,%
  ]%
  (0.4814814814814815cm,-0.5773502691896257cm)%
    circle(0.037037037037037035cm);

\draw[%
    yarn,%
  ]%
  (0.6296296296296297cm,-0.5773502691896257cm)%
    circle(0.037037037037037035cm);

\draw[%
    yarn,%
  ]%
  (0.5185185185185186cm,-0.5132002392796673cm)%
    circle(0.037037037037037035cm);

\draw[%
    yarn,%
  ]%
  (0.5925925925925926cm,-0.5132002392796673cm)%
    circle(0.037037037037037035cm);

\draw[%
    assembled yarn,%
  ]%
  (0.2222222222222222cm,-0.3849001794597505cm)%
    circle(0.1111111111111111cm);

\draw[%
    yarn,%
  ]%
  (0.18518518518518517cm,-0.44905020936970896cm)%
    circle(0.037037037037037035cm);

\draw[%
    yarn,%
  ]%
  (0.25925925925925924cm,-0.44905020936970896cm)%
    circle(0.037037037037037035cm);

\draw[%
    yarn,%
  ]%
  (0.14814814814814814cm,-0.3849001794597505cm)%
    circle(0.037037037037037035cm);

\draw[%
    yarn,%
  ]%
  (0.2962962962962963cm,-0.3849001794597505cm)%
    circle(0.037037037037037035cm);

\draw[%
    yarn,%
  ]%
  (0.18518518518518517cm,-0.3207501495497921cm)%
    circle(0.037037037037037035cm);

\draw[%
    yarn,%
  ]%
  (0.25925925925925924cm,-0.3207501495497921cm)%
    circle(0.037037037037037035cm);

\draw[%
    assembled yarn,%
  ]%
  (0.4444444444444444cm,-0.3849001794597505cm)%
    circle(0.1111111111111111cm);

\draw[%
    yarn,%
  ]%
  (0.4074074074074074cm,-0.44905020936970896cm)%
    circle(0.037037037037037035cm);

\draw[%
    yarn,%
  ]%
  (0.48148148148148145cm,-0.44905020936970896cm)%
    circle(0.037037037037037035cm);

\draw[%
    yarn,%
  ]%
  (0.37037037037037035cm,-0.3849001794597505cm)%
    circle(0.037037037037037035cm);

\draw[%
    yarn,%
  ]%
  (0.5185185185185185cm,-0.3849001794597505cm)%
    circle(0.037037037037037035cm);

\draw[%
    yarn,%
  ]%
  (0.4074074074074074cm,-0.3207501495497921cm)%
    circle(0.037037037037037035cm);

\draw[%
    yarn,%
  ]%
  (0.48148148148148145cm,-0.3207501495497921cm)%
    circle(0.037037037037037035cm);

\draw[%
    strand,%
  ]%
  (-0.6666666666666666cm,0.0cm)%
    circle(0.3333333333333333cm);

\draw[%
    assembled yarn,%
  ]%
  (-0.7777777777777777cm,-0.19245008972987523cm)%
    circle(0.1111111111111111cm);

\draw[%
    yarn,%
  ]%
  (-0.8148148148148147cm,-0.25660011963983365cm)%
    circle(0.037037037037037035cm);

\draw[%
    yarn,%
  ]%
  (-0.7407407407407407cm,-0.25660011963983365cm)%
    circle(0.037037037037037035cm);

\draw[%
    yarn,%
  ]%
  (-0.8518518518518517cm,-0.19245008972987523cm)%
    circle(0.037037037037037035cm);

\draw[%
    yarn,%
  ]%
  (-0.7037037037037036cm,-0.19245008972987523cm)%
    circle(0.037037037037037035cm);

\draw[%
    yarn,%
  ]%
  (-0.8148148148148147cm,-0.12830005981991682cm)%
    circle(0.037037037037037035cm);

\draw[%
    yarn,%
  ]%
  (-0.7407407407407407cm,-0.12830005981991682cm)%
    circle(0.037037037037037035cm);

\draw[%
    assembled yarn,%
  ]%
  (-0.5555555555555556cm,-0.19245008972987523cm)%
    circle(0.1111111111111111cm);

\draw[%
    yarn,%
  ]%
  (-0.5925925925925926cm,-0.25660011963983365cm)%
    circle(0.037037037037037035cm);

\draw[%
    yarn,%
  ]%
  (-0.5185185185185186cm,-0.25660011963983365cm)%
    circle(0.037037037037037035cm);

\draw[%
    yarn,%
  ]%
  (-0.6296296296296297cm,-0.19245008972987523cm)%
    circle(0.037037037037037035cm);

\draw[%
    yarn,%
  ]%
  (-0.4814814814814815cm,-0.19245008972987523cm)%
    circle(0.037037037037037035cm);

\draw[%
    yarn,%
  ]%
  (-0.5925925925925926cm,-0.12830005981991682cm)%
    circle(0.037037037037037035cm);

\draw[%
    yarn,%
  ]%
  (-0.5185185185185186cm,-0.12830005981991682cm)%
    circle(0.037037037037037035cm);

\draw[%
    assembled yarn,%
  ]%
  (-0.8888888888888888cm,0.0cm)%
    circle(0.1111111111111111cm);

\draw[%
    yarn,%
  ]%
  (-0.9259259259259258cm,-0.06415002990995841cm)%
    circle(0.037037037037037035cm);

\draw[%
    yarn,%
  ]%
  (-0.8518518518518519cm,-0.06415002990995841cm)%
    circle(0.037037037037037035cm);

\draw[%
    yarn,%
  ]%
  (-0.9629629629629629cm,0.0cm)%
    circle(0.037037037037037035cm);

\draw[%
    yarn,%
  ]%
  (-0.8148148148148148cm,0.0cm)%
    circle(0.037037037037037035cm);

\draw[%
    yarn,%
  ]%
  (-0.9259259259259258cm,0.06415002990995841cm)%
    circle(0.037037037037037035cm);

\draw[%
    yarn,%
  ]%
  (-0.8518518518518519cm,0.06415002990995841cm)%
    circle(0.037037037037037035cm);

\draw[%
    assembled yarn,%
  ]%
  (-0.4444444444444444cm,0.0cm)%
    circle(0.1111111111111111cm);

\draw[%
    yarn,%
  ]%
  (-0.48148148148148145cm,-0.06415002990995841cm)%
    circle(0.037037037037037035cm);

\draw[%
    yarn,%
  ]%
  (-0.4074074074074074cm,-0.06415002990995841cm)%
    circle(0.037037037037037035cm);

\draw[%
    yarn,%
  ]%
  (-0.5185185185185185cm,0.0cm)%
    circle(0.037037037037037035cm);

\draw[%
    yarn,%
  ]%
  (-0.37037037037037035cm,0.0cm)%
    circle(0.037037037037037035cm);

\draw[%
    yarn,%
  ]%
  (-0.48148148148148145cm,0.06415002990995841cm)%
    circle(0.037037037037037035cm);

\draw[%
    yarn,%
  ]%
  (-0.4074074074074074cm,0.06415002990995841cm)%
    circle(0.037037037037037035cm);

\draw[%
    assembled yarn,%
  ]%
  (-0.7777777777777777cm,0.19245008972987523cm)%
    circle(0.1111111111111111cm);

\draw[%
    yarn,%
  ]%
  (-0.8148148148148147cm,0.12830005981991682cm)%
    circle(0.037037037037037035cm);

\draw[%
    yarn,%
  ]%
  (-0.7407407407407407cm,0.12830005981991682cm)%
    circle(0.037037037037037035cm);

\draw[%
    yarn,%
  ]%
  (-0.8518518518518517cm,0.19245008972987523cm)%
    circle(0.037037037037037035cm);

\draw[%
    yarn,%
  ]%
  (-0.7037037037037036cm,0.19245008972987523cm)%
    circle(0.037037037037037035cm);

\draw[%
    yarn,%
  ]%
  (-0.8148148148148147cm,0.25660011963983365cm)%
    circle(0.037037037037037035cm);

\draw[%
    yarn,%
  ]%
  (-0.7407407407407407cm,0.25660011963983365cm)%
    circle(0.037037037037037035cm);

\draw[%
    assembled yarn,%
  ]%
  (-0.5555555555555556cm,0.19245008972987523cm)%
    circle(0.1111111111111111cm);

\draw[%
    yarn,%
  ]%
  (-0.5925925925925926cm,0.12830005981991682cm)%
    circle(0.037037037037037035cm);

\draw[%
    yarn,%
  ]%
  (-0.5185185185185186cm,0.12830005981991682cm)%
    circle(0.037037037037037035cm);

\draw[%
    yarn,%
  ]%
  (-0.6296296296296297cm,0.19245008972987523cm)%
    circle(0.037037037037037035cm);

\draw[%
    yarn,%
  ]%
  (-0.4814814814814815cm,0.19245008972987523cm)%
    circle(0.037037037037037035cm);

\draw[%
    yarn,%
  ]%
  (-0.5925925925925926cm,0.25660011963983365cm)%
    circle(0.037037037037037035cm);

\draw[%
    yarn,%
  ]%
  (-0.5185185185185186cm,0.25660011963983365cm)%
    circle(0.037037037037037035cm);

\draw[%
    strand,%
  ]%
  (0.6666666666666666cm,0.0cm)%
    circle(0.3333333333333333cm);

\draw[%
    assembled yarn,%
  ]%
  (0.5555555555555556cm,-0.19245008972987523cm)%
    circle(0.1111111111111111cm);

\draw[%
    yarn,%
  ]%
  (0.5185185185185186cm,-0.25660011963983365cm)%
    circle(0.037037037037037035cm);

\draw[%
    yarn,%
  ]%
  (0.5925925925925926cm,-0.25660011963983365cm)%
    circle(0.037037037037037035cm);

\draw[%
    yarn,%
  ]%
  (0.4814814814814815cm,-0.19245008972987523cm)%
    circle(0.037037037037037035cm);

\draw[%
    yarn,%
  ]%
  (0.6296296296296297cm,-0.19245008972987523cm)%
    circle(0.037037037037037035cm);

\draw[%
    yarn,%
  ]%
  (0.5185185185185186cm,-0.12830005981991682cm)%
    circle(0.037037037037037035cm);

\draw[%
    yarn,%
  ]%
  (0.5925925925925926cm,-0.12830005981991682cm)%
    circle(0.037037037037037035cm);

\draw[%
    assembled yarn,%
  ]%
  (0.7777777777777777cm,-0.19245008972987523cm)%
    circle(0.1111111111111111cm);

\draw[%
    yarn,%
  ]%
  (0.7407407407407407cm,-0.25660011963983365cm)%
    circle(0.037037037037037035cm);

\draw[%
    yarn,%
  ]%
  (0.8148148148148147cm,-0.25660011963983365cm)%
    circle(0.037037037037037035cm);

\draw[%
    yarn,%
  ]%
  (0.7037037037037036cm,-0.19245008972987523cm)%
    circle(0.037037037037037035cm);

\draw[%
    yarn,%
  ]%
  (0.8518518518518517cm,-0.19245008972987523cm)%
    circle(0.037037037037037035cm);

\draw[%
    yarn,%
  ]%
  (0.7407407407407407cm,-0.12830005981991682cm)%
    circle(0.037037037037037035cm);

\draw[%
    yarn,%
  ]%
  (0.8148148148148147cm,-0.12830005981991682cm)%
    circle(0.037037037037037035cm);

\draw[%
    assembled yarn,%
  ]%
  (0.4444444444444444cm,0.0cm)%
    circle(0.1111111111111111cm);

\draw[%
    yarn,%
  ]%
  (0.4074074074074074cm,-0.06415002990995841cm)%
    circle(0.037037037037037035cm);

\draw[%
    yarn,%
  ]%
  (0.48148148148148145cm,-0.06415002990995841cm)%
    circle(0.037037037037037035cm);

\draw[%
    yarn,%
  ]%
  (0.37037037037037035cm,0.0cm)%
    circle(0.037037037037037035cm);

\draw[%
    yarn,%
  ]%
  (0.5185185185185185cm,0.0cm)%
    circle(0.037037037037037035cm);

\draw[%
    yarn,%
  ]%
  (0.4074074074074074cm,0.06415002990995841cm)%
    circle(0.037037037037037035cm);

\draw[%
    yarn,%
  ]%
  (0.48148148148148145cm,0.06415002990995841cm)%
    circle(0.037037037037037035cm);

\draw[%
    assembled yarn,%
  ]%
  (0.8888888888888888cm,0.0cm)%
    circle(0.1111111111111111cm);

\draw[%
    yarn,%
  ]%
  (0.8518518518518519cm,-0.06415002990995841cm)%
    circle(0.037037037037037035cm);

\draw[%
    yarn,%
  ]%
  (0.9259259259259258cm,-0.06415002990995841cm)%
    circle(0.037037037037037035cm);

\draw[%
    yarn,%
  ]%
  (0.8148148148148148cm,0.0cm)%
    circle(0.037037037037037035cm);

\draw[%
    yarn,%
  ]%
  (0.9629629629629629cm,0.0cm)%
    circle(0.037037037037037035cm);

\draw[%
    yarn,%
  ]%
  (0.8518518518518519cm,0.06415002990995841cm)%
    circle(0.037037037037037035cm);

\draw[%
    yarn,%
  ]%
  (0.9259259259259258cm,0.06415002990995841cm)%
    circle(0.037037037037037035cm);

\draw[%
    assembled yarn,%
  ]%
  (0.5555555555555556cm,0.19245008972987523cm)%
    circle(0.1111111111111111cm);

\draw[%
    yarn,%
  ]%
  (0.5185185185185186cm,0.12830005981991682cm)%
    circle(0.037037037037037035cm);

\draw[%
    yarn,%
  ]%
  (0.5925925925925926cm,0.12830005981991682cm)%
    circle(0.037037037037037035cm);

\draw[%
    yarn,%
  ]%
  (0.4814814814814815cm,0.19245008972987523cm)%
    circle(0.037037037037037035cm);

\draw[%
    yarn,%
  ]%
  (0.6296296296296297cm,0.19245008972987523cm)%
    circle(0.037037037037037035cm);

\draw[%
    yarn,%
  ]%
  (0.5185185185185186cm,0.25660011963983365cm)%
    circle(0.037037037037037035cm);

\draw[%
    yarn,%
  ]%
  (0.5925925925925926cm,0.25660011963983365cm)%
    circle(0.037037037037037035cm);

\draw[%
    assembled yarn,%
  ]%
  (0.7777777777777777cm,0.19245008972987523cm)%
    circle(0.1111111111111111cm);

\draw[%
    yarn,%
  ]%
  (0.7407407407407407cm,0.12830005981991682cm)%
    circle(0.037037037037037035cm);

\draw[%
    yarn,%
  ]%
  (0.8148148148148147cm,0.12830005981991682cm)%
    circle(0.037037037037037035cm);

\draw[%
    yarn,%
  ]%
  (0.7037037037037036cm,0.19245008972987523cm)%
    circle(0.037037037037037035cm);

\draw[%
    yarn,%
  ]%
  (0.8518518518518517cm,0.19245008972987523cm)%
    circle(0.037037037037037035cm);

\draw[%
    yarn,%
  ]%
  (0.7407407407407407cm,0.25660011963983365cm)%
    circle(0.037037037037037035cm);

\draw[%
    yarn,%
  ]%
  (0.8148148148148147cm,0.25660011963983365cm)%
    circle(0.037037037037037035cm);

\draw[%
    strand,%
  ]%
  (-0.3333333333333333cm,0.5773502691896257cm)%
    circle(0.3333333333333333cm);

\draw[%
    assembled yarn,%
  ]%
  (-0.4444444444444444cm,0.3849001794597505cm)%
    circle(0.1111111111111111cm);

\draw[%
    yarn,%
  ]%
  (-0.48148148148148145cm,0.3207501495497921cm)%
    circle(0.037037037037037035cm);

\draw[%
    yarn,%
  ]%
  (-0.4074074074074074cm,0.3207501495497921cm)%
    circle(0.037037037037037035cm);

\draw[%
    yarn,%
  ]%
  (-0.5185185185185185cm,0.3849001794597505cm)%
    circle(0.037037037037037035cm);

\draw[%
    yarn,%
  ]%
  (-0.37037037037037035cm,0.3849001794597505cm)%
    circle(0.037037037037037035cm);

\draw[%
    yarn,%
  ]%
  (-0.48148148148148145cm,0.44905020936970896cm)%
    circle(0.037037037037037035cm);

\draw[%
    yarn,%
  ]%
  (-0.4074074074074074cm,0.44905020936970896cm)%
    circle(0.037037037037037035cm);

\draw[%
    assembled yarn,%
  ]%
  (-0.2222222222222222cm,0.3849001794597505cm)%
    circle(0.1111111111111111cm);

\draw[%
    yarn,%
  ]%
  (-0.25925925925925924cm,0.3207501495497921cm)%
    circle(0.037037037037037035cm);

\draw[%
    yarn,%
  ]%
  (-0.18518518518518517cm,0.3207501495497921cm)%
    circle(0.037037037037037035cm);

\draw[%
    yarn,%
  ]%
  (-0.2962962962962963cm,0.3849001794597505cm)%
    circle(0.037037037037037035cm);

\draw[%
    yarn,%
  ]%
  (-0.14814814814814814cm,0.3849001794597505cm)%
    circle(0.037037037037037035cm);

\draw[%
    yarn,%
  ]%
  (-0.25925925925925924cm,0.44905020936970896cm)%
    circle(0.037037037037037035cm);

\draw[%
    yarn,%
  ]%
  (-0.18518518518518517cm,0.44905020936970896cm)%
    circle(0.037037037037037035cm);

\draw[%
    assembled yarn,%
  ]%
  (-0.5555555555555556cm,0.5773502691896257cm)%
    circle(0.1111111111111111cm);

\draw[%
    yarn,%
  ]%
  (-0.5925925925925926cm,0.5132002392796673cm)%
    circle(0.037037037037037035cm);

\draw[%
    yarn,%
  ]%
  (-0.5185185185185186cm,0.5132002392796673cm)%
    circle(0.037037037037037035cm);

\draw[%
    yarn,%
  ]%
  (-0.6296296296296297cm,0.5773502691896257cm)%
    circle(0.037037037037037035cm);

\draw[%
    yarn,%
  ]%
  (-0.4814814814814815cm,0.5773502691896257cm)%
    circle(0.037037037037037035cm);

\draw[%
    yarn,%
  ]%
  (-0.5925925925925926cm,0.6415002990995842cm)%
    circle(0.037037037037037035cm);

\draw[%
    yarn,%
  ]%
  (-0.5185185185185186cm,0.6415002990995842cm)%
    circle(0.037037037037037035cm);

\draw[%
    assembled yarn,%
  ]%
  (-0.1111111111111111cm,0.5773502691896257cm)%
    circle(0.1111111111111111cm);

\draw[%
    yarn,%
  ]%
  (-0.14814814814814814cm,0.5132002392796673cm)%
    circle(0.037037037037037035cm);

\draw[%
    yarn,%
  ]%
  (-0.07407407407407407cm,0.5132002392796673cm)%
    circle(0.037037037037037035cm);

\draw[%
    yarn,%
  ]%
  (-0.18518518518518517cm,0.5773502691896257cm)%
    circle(0.037037037037037035cm);

\draw[%
    yarn,%
  ]%
  (-0.037037037037037035cm,0.5773502691896257cm)%
    circle(0.037037037037037035cm);

\draw[%
    yarn,%
  ]%
  (-0.14814814814814814cm,0.6415002990995842cm)%
    circle(0.037037037037037035cm);

\draw[%
    yarn,%
  ]%
  (-0.07407407407407407cm,0.6415002990995842cm)%
    circle(0.037037037037037035cm);

\draw[%
    assembled yarn,%
  ]%
  (-0.4444444444444444cm,0.7698003589195009cm)%
    circle(0.1111111111111111cm);

\draw[%
    yarn,%
  ]%
  (-0.48148148148148145cm,0.7056503290095425cm)%
    circle(0.037037037037037035cm);

\draw[%
    yarn,%
  ]%
  (-0.4074074074074074cm,0.7056503290095425cm)%
    circle(0.037037037037037035cm);

\draw[%
    yarn,%
  ]%
  (-0.5185185185185185cm,0.7698003589195009cm)%
    circle(0.037037037037037035cm);

\draw[%
    yarn,%
  ]%
  (-0.37037037037037035cm,0.7698003589195009cm)%
    circle(0.037037037037037035cm);

\draw[%
    yarn,%
  ]%
  (-0.48148148148148145cm,0.8339503888294594cm)%
    circle(0.037037037037037035cm);

\draw[%
    yarn,%
  ]%
  (-0.4074074074074074cm,0.8339503888294594cm)%
    circle(0.037037037037037035cm);

\draw[%
    assembled yarn,%
  ]%
  (-0.2222222222222222cm,0.7698003589195009cm)%
    circle(0.1111111111111111cm);

\draw[%
    yarn,%
  ]%
  (-0.25925925925925924cm,0.7056503290095425cm)%
    circle(0.037037037037037035cm);

\draw[%
    yarn,%
  ]%
  (-0.18518518518518517cm,0.7056503290095425cm)%
    circle(0.037037037037037035cm);

\draw[%
    yarn,%
  ]%
  (-0.2962962962962963cm,0.7698003589195009cm)%
    circle(0.037037037037037035cm);

\draw[%
    yarn,%
  ]%
  (-0.14814814814814814cm,0.7698003589195009cm)%
    circle(0.037037037037037035cm);

\draw[%
    yarn,%
  ]%
  (-0.25925925925925924cm,0.8339503888294594cm)%
    circle(0.037037037037037035cm);

\draw[%
    yarn,%
  ]%
  (-0.18518518518518517cm,0.8339503888294594cm)%
    circle(0.037037037037037035cm);

\draw[%
    strand,%
  ]%
  (0.3333333333333333cm,0.5773502691896257cm)%
    circle(0.3333333333333333cm);

\draw[%
    assembled yarn,%
  ]%
  (0.2222222222222222cm,0.3849001794597505cm)%
    circle(0.1111111111111111cm);

\draw[%
    yarn,%
  ]%
  (0.18518518518518517cm,0.3207501495497921cm)%
    circle(0.037037037037037035cm);

\draw[%
    yarn,%
  ]%
  (0.25925925925925924cm,0.3207501495497921cm)%
    circle(0.037037037037037035cm);

\draw[%
    yarn,%
  ]%
  (0.14814814814814814cm,0.3849001794597505cm)%
    circle(0.037037037037037035cm);

\draw[%
    yarn,%
  ]%
  (0.2962962962962963cm,0.3849001794597505cm)%
    circle(0.037037037037037035cm);

\draw[%
    yarn,%
  ]%
  (0.18518518518518517cm,0.44905020936970896cm)%
    circle(0.037037037037037035cm);

\draw[%
    yarn,%
  ]%
  (0.25925925925925924cm,0.44905020936970896cm)%
    circle(0.037037037037037035cm);

\draw[%
    assembled yarn,%
  ]%
  (0.4444444444444444cm,0.3849001794597505cm)%
    circle(0.1111111111111111cm);

\draw[%
    yarn,%
  ]%
  (0.4074074074074074cm,0.3207501495497921cm)%
    circle(0.037037037037037035cm);

\draw[%
    yarn,%
  ]%
  (0.48148148148148145cm,0.3207501495497921cm)%
    circle(0.037037037037037035cm);

\draw[%
    yarn,%
  ]%
  (0.37037037037037035cm,0.3849001794597505cm)%
    circle(0.037037037037037035cm);

\draw[%
    yarn,%
  ]%
  (0.5185185185185185cm,0.3849001794597505cm)%
    circle(0.037037037037037035cm);

\draw[%
    yarn,%
  ]%
  (0.4074074074074074cm,0.44905020936970896cm)%
    circle(0.037037037037037035cm);

\draw[%
    yarn,%
  ]%
  (0.48148148148148145cm,0.44905020936970896cm)%
    circle(0.037037037037037035cm);

\draw[%
    assembled yarn,%
  ]%
  (0.1111111111111111cm,0.5773502691896257cm)%
    circle(0.1111111111111111cm);

\draw[%
    yarn,%
  ]%
  (0.07407407407407407cm,0.5132002392796673cm)%
    circle(0.037037037037037035cm);

\draw[%
    yarn,%
  ]%
  (0.14814814814814814cm,0.5132002392796673cm)%
    circle(0.037037037037037035cm);

\draw[%
    yarn,%
  ]%
  (0.037037037037037035cm,0.5773502691896257cm)%
    circle(0.037037037037037035cm);

\draw[%
    yarn,%
  ]%
  (0.18518518518518517cm,0.5773502691896257cm)%
    circle(0.037037037037037035cm);

\draw[%
    yarn,%
  ]%
  (0.07407407407407407cm,0.6415002990995842cm)%
    circle(0.037037037037037035cm);

\draw[%
    yarn,%
  ]%
  (0.14814814814814814cm,0.6415002990995842cm)%
    circle(0.037037037037037035cm);

\draw[%
    assembled yarn,%
  ]%
  (0.5555555555555556cm,0.5773502691896257cm)%
    circle(0.1111111111111111cm);

\draw[%
    yarn,%
  ]%
  (0.5185185185185186cm,0.5132002392796673cm)%
    circle(0.037037037037037035cm);

\draw[%
    yarn,%
  ]%
  (0.5925925925925926cm,0.5132002392796673cm)%
    circle(0.037037037037037035cm);

\draw[%
    yarn,%
  ]%
  (0.4814814814814815cm,0.5773502691896257cm)%
    circle(0.037037037037037035cm);

\draw[%
    yarn,%
  ]%
  (0.6296296296296297cm,0.5773502691896257cm)%
    circle(0.037037037037037035cm);

\draw[%
    yarn,%
  ]%
  (0.5185185185185186cm,0.6415002990995842cm)%
    circle(0.037037037037037035cm);

\draw[%
    yarn,%
  ]%
  (0.5925925925925926cm,0.6415002990995842cm)%
    circle(0.037037037037037035cm);

\draw[%
    assembled yarn,%
  ]%
  (0.2222222222222222cm,0.7698003589195009cm)%
    circle(0.1111111111111111cm);

\draw[%
    yarn,%
  ]%
  (0.18518518518518517cm,0.7056503290095425cm)%
    circle(0.037037037037037035cm);

\draw[%
    yarn,%
  ]%
  (0.25925925925925924cm,0.7056503290095425cm)%
    circle(0.037037037037037035cm);

\draw[%
    yarn,%
  ]%
  (0.14814814814814814cm,0.7698003589195009cm)%
    circle(0.037037037037037035cm);

\draw[%
    yarn,%
  ]%
  (0.2962962962962963cm,0.7698003589195009cm)%
    circle(0.037037037037037035cm);

\draw[%
    yarn,%
  ]%
  (0.18518518518518517cm,0.8339503888294594cm)%
    circle(0.037037037037037035cm);

\draw[%
    yarn,%
  ]%
  (0.25925925925925924cm,0.8339503888294594cm)%
    circle(0.037037037037037035cm);

\draw[%
    assembled yarn,%
  ]%
  (0.4444444444444444cm,0.7698003589195009cm)%
    circle(0.1111111111111111cm);

\draw[%
    yarn,%
  ]%
  (0.4074074074074074cm,0.7056503290095425cm)%
    circle(0.037037037037037035cm);

\draw[%
    yarn,%
  ]%
  (0.48148148148148145cm,0.7056503290095425cm)%
    circle(0.037037037037037035cm);

\draw[%
    yarn,%
  ]%
  (0.37037037037037035cm,0.7698003589195009cm)%
    circle(0.037037037037037035cm);

\draw[%
    yarn,%
  ]%
  (0.5185185185185185cm,0.7698003589195009cm)%
    circle(0.037037037037037035cm);

\draw[%
    yarn,%
  ]%
  (0.4074074074074074cm,0.8339503888294594cm)%
    circle(0.037037037037037035cm);

\draw[%
    yarn,%
  ]%
  (0.48148148148148145cm,0.8339503888294594cm)%
    circle(0.037037037037037035cm);

\end{tikzpicture}
