xi,s1,s2
0,3.76087605399001e-26,4.70803433417713e-25
0.01,0.0187656920904985,0.0230629383347917
0.02,0.0344579176776947,0.0435750589090979
0.03,0.047683184239798,0.0619986226212224
0.04,0.0589374687543967,0.0787134924589795
0.05,0.0686227822278915,0.0940294768814499
0.06,0.0770619481391127,0.10819733668043
0.07,0.0845116982160766,0.121418533015656
0.08,0.09117418896483,0.133853794317891
0.09,0.0972070423693387,0.145630579753948
0.1,0.10273201418137,0.156849516947736
0.11,0.107842393219321,0.167589891651412
0.12,0.112609235094953,0.177914267060719
0.13,0.117086533786967,0.18787231046859
0.14,0.121315434480396,0.197503904951103
0.15,0.125327591090744,0.20684162377987
0.16,0.129147771891842,0.215912645254942
0.17,0.132795816666363,0.224740185652298
0.18,0.136288048797949,0.233344527980029
0.19,0.13963824572391,0.241743724237271
0.2,0.142858271167439,0.24995404886998
0.21,0.145958472548114,0.257990281102395
0.22,0.148947944547448,0.265865891993808
0.23,0.151834735767714,0.273593193915444
0.24,0.154626026659058,0.281183473314277
0.25,0.157328282851361,0.288647109475763
0.26,0.159947385605334,0.295993680168268
0.27,0.162488741077115,0.303232055036733
0.28,0.164957370090656,0.310370477613108
0.29,0.167357980112185,0.317416636811099
0.3,0.169695021121023,0.324377728772751
0.31,0.171972727071042,0.331260509934419
0.32,0.174195144637031,0.338071342179655
0.33,0.176366150940288,0.344816230946546
0.34,0.178489461947675,0.351500857157047
0.35,0.180568633238455,0.358130603835841
0.36,0.182607054833183,0.364710578286261
0.37,0.184607941778917,0.371245630690816
0.38,0.186574322185061,0.377740370003852
0.39,0.188509024404102,0.384199178003892
0.4,0.190414665051524,0.390626222373177
0.41,0.192293639558743,0.397025469671765
0.42,0.194148116898544,0.403400699049439
0.43,0.195980039583247,0.409755517299781
0.44,0.197791128941881,0.416093375376153
0.45,0.199582895143364,0.422417586250402
0.46,0.201356651378371,0.428731343971042
0.47,0.203113531612088,0.435037743777464
0.48,0.204854511320083,0.441339803126731
0.49,0.206580430619511,0.447640483489507
0.5,0.208292019207855,0.45394271277167
0.51,0.209989922521435,0.460249408218169
0.52,0.211674728525893,0.466563499655669
0.53,0.213346994550872,0.472887952930537
0.54,0.215007273581111,0.479225793398731
0.55,0.216656139416157,0.485580129324128
0.56,0.218294210110933,0.491954175041862
0.57,0.219922169109358,0.498351273743205
0.58,0.221540783483244,0.504774919738563
0.59,0.223150918688695,0.511228780055115
0.6,0.224753549252202,0.517716715225678
0.61,0.226349764798992,0.524242799125538
0.62,0.227940770874162,0.530811337739916
0.63,0.229527884384467,0.537426887001701
0.64,0.231112524253991,0.544094270360297
0.65,0.23269619826426,0.550818596999459
0.66,0.234280487087362,0.557605281647809
0.67,0.235867026520948,0.564460066926012
0.68,0.237457488933998,0.571389049174527
0.69,0.23905356493224,0.578398708705891
0.7,0.240656946252097,0.585495945425483
0.71,0.242269310892045,0.5926881207647
0.72,0.243892311490262,0.599983106870503
0.73,0.245527567957457,0.607389343995264
0.74,0.24717666537375,0.614915907030872
0.75,0.24884115815849,0.622572582131024
0.76,0.250522581521898,0.63036995436567
0.77,0.252222471207404,0.638319507351525
0.78,0.253942392533571,0.646433735802627
0.79,0.255683979744476,0.65472627194485
0.8,0.25744898667745,0.66321202673835
0.81,0.259239349759195,0.671907346878432
0.82,0.261057264600866,0.680830191734911
0.83,0.262905280038505,0.690000366045904
0.84,0.264786418690348,0.699439908397554
0.85,0.266704335678372,0.709173767177134
0.86,0.268663527420949,0.719230898876446
0.87,0.270669602405656,0.729645923649053
0.88,0.272729625851263,0.74046147302485
0.89,0.274852550167968,0.751731364685498
0.9,0.277049743124888,0.763524739204245
0.91,0.27933562563387,0.775931293653645
0.92,0.281728431058645,0.7890677469847
0.93,0.284251097958379,0.803085672080937
0.94,0.28693230817465,0.818180829390951
0.95,0.289807682170897,0.834604137042922
0.96,0.292921143533379,0.852674412344627
0.97,0.296326464542685,0.872793019572473
0.98,0.300089004724834,0.895460558953061
0.99,0.304287654291008,0.921295731740812
1,0.309016994374947,0.951056516295154
