xi,s1,s2
0,0,0
0.01,0.000351554307272364,-0.010113903770279
0.02,0.000707622061264341,-0.0202261094605366
0.03,0.00106832201496372,-0.0303366107936684
0.04,0.00143377766754969,-0.0404454011555192
0.05,0.00180411752055966,-0.050552473571958
0.06,0.00217947535156335,-0.0606578206840616
0.07,0.00255999050679836,-0.0707614347212126
0.08,0.00294580821436543,-0.0808633074719134
0.09,0.00333707991973938,-0.0909634302520801
0.1,0.00373396364553046,-0.101061793870561
0.11,0.00413662437762836,-0.111158388591596
0.12,0.00454523448008314,-0.121253204093887
0.13,0.00495997414132624,-0.131346229425926
0.14,0.00538103185461331,-0.141437452957172
0.15,0.00580860493588481,-0.151526862324617
0.16,0.00624290008259307,-0.161614444374232
0.17,0.00668413397744384,-0.171700185096702
0.18,0.00713253394145034,-0.181784069556802
0.19,0.00758833864120856,-0.191866081815654
0.2,0.00805179885588137,-0.201946204845029
0.21,0.00852317831003732,-0.212024420432715
0.22,0.00900275457924039,-0.222100709077851
0.23,0.00949082007614299,-0.232175049874971
0.24,0.00998768312581473,-0.2422474203853
0.25,0.0104936691401636,-0.252317796493644
0.26,0.0110091219025984,-0.262386152248959
0.27,0.0115344049755701,-0.272452459686387
0.28,0.0120699032453516,-0.282516688628192
0.29,0.0126160246204078,-0.292578806460627
0.3,0.0131732019020242,-0.30263877788327
0.31,0.0137418948485583,-0.312696564626782
0.32,0.0143225924578324,-0.322752125134349
0.33,0.0149158154958757,-0.332805414201254
0.34,0.0155221193045697,-0.342856382565999
0.35,0.0161420969258678,-0.35290497644524
0.36,0.0167763825863244,-0.362951137003298
0.37,0.0174256555928659,-0.372994799745283
0.38,0.018090644699321,-0.38303589382069
0.39,0.0187721330134973,-0.393074341221682
0.4,0.0194709635269404,-0.40311005585704
0.41,0.0201880453644059,-0.413142942478701
0.42,0.0209243608681373,-0.423172895432812
0.43,0.0216809736540356,-0.43319979720094
0.44,0.0224590378037237,-0.443223516689191
0.45,0.0232598083896173,-0.453243907212983
0.46,0.0240846535710592,-0.463260804112509
0.47,0.0249350685505005,-0.473274021917592
0.48,0.0258126917424196,-0.483283350959561
0.49,0.0267193235878835,-0.493288553300367
0.5,0.0276569485493058,-0.503289357813245
0.51,0.0286277609496806,-0.513285454201699
0.52,0.0296341954873522,-0.52327648568029
0.53,0.0306789634734778,-0.533262039955411
0.54,0.0317650961216722,-0.543241638028384
0.55,0.0328959965914404,-0.553214720183885
0.56,0.0340755029820597,-0.563180628305393
0.57,0.0353079651387501,-0.573138583347881
0.58,0.0365983390362119,-0.583087656353963
0.59,0.0379523037449648,-0.593026730757718
0.6,0.0393764077096867,-0.602954452777825
0.61,0.0408782534949286,-0.612869165294575
0.62,0.0424667336146992,-0.62276881846696
0.63,0.0441523350706289,-0.632650847031908
0.64,0.045947537579108,-0.642511998980756
0.65,0.0478673414390717,-0.652348091805023
0.66,0.0499299776130492,-0.662153658367328
0.67,0.0521578781552185,-0.671921420285306
0.68,0.0545790249481972,-0.681641484111902
0.69,0.0572288572862733,-0.691300077939816
0.7,0.0601530168996809,-0.700877499321533
0.71,0.0634113582975602,-0.7103446574048
0.72,0.0670838574289992,-0.719657005204231
0.73,0.0712792348815283,-0.728743422562495
0.74,0.0761468040077165,-0.737484980340269
0.75,0.0818891721616921,-0.745673219276286
0.76,0.0887599516644271,-0.752929974295253
0.77,0.0969844965153683,-0.758581264905451
0.78,0.10646969286944,-0.761613675277717
0.79,0.116407595136662,-0.761156915033136
0.8,0.125619926567159,-0.757361911435762
0.81,0.13349238567247,-0.75122244552332
0.82,0.140054126536658,-0.74368188145764
0.83,0.145554118757718,-0.735327352076062
0.84,0.150235760825229,-0.726483918526728
0.85,0.154287347617853,-0.717331843833498
0.86,0.157846714246263,-0.707975153857632
0.87,0.161014358499668,-0.698476805713044
0.88,0.163864503085201,-0.688876668916626
0.89,0.166452957800671,-0.67920103242537
0.9,0.168822478633906,-0.669467850818905
0.91,0.171006408989565,-0.659689765604707
0.92,0.17303118060861,-0.64987591554648
0.93,0.174918058920918,-0.640033060878353
0.94,0.176684382552439,-0.630166304093604
0.95,0.178344459018366,-0.620279565408959
0.96,0.179910222800854,-0.610375904456107
0.97,0.181391726424123,-0.600457742923243
0.98,0.182797512232903,-0.59052702181063
0.99,0.184134897630371,-0.580585314556571
1,0.185410196624966,-0.570633909777092
