xi,s1,s2
0,-4.34761613936817e-27,-7.55828417251251e-27
0.01,-0.014420592148483,-0.0234720541251434
0.02,-0.0278979093883803,-0.0439186701988181
0.03,-0.0405761311256324,-0.0616997217707329
0.04,-0.0525854648525003,-0.0771456966460648
0.05,-0.0640421461475652,-0.0905576968854592
0.06,-0.0750484386757286,-0.10220743880503
0.07,-0.0856926341882123,-0.112337252976359
0.08,-0.0960490525225583,-0.121160084226497
0.09,-0.106178041602629,-0.128859491637962
0.1,-0.116125977438607,-0.135589648548742
0.11,-0.125925264126995,-0.141475342552293
0.12,-0.135594333850616,-0.146611975497537
0.13,-0.145137686042725,-0.151065635715334
0.14,-0.154548863859399,-0.154878587229876
0.15,-0.163819461924946,-0.158085881845819
0.16,-0.172942102804292,-0.16072084835969
0.17,-0.181910476167099,-0.162815164786343
0.18,-0.190719338787757,-0.164398858358966
0.19,-0.199364514545392,-0.165500305529078
0.2,-0.207842894423859,-0.166146231966531
0.21,-0.216152436511747,-0.166361712559507
0.22,-0.224292166002376,-0.166170171414521
0.23,-0.232262175193799,-0.165593381856419
0.24,-0.2400636234888,-0.164651466428379
0.25,-0.247698737394895,-0.163362896891912
0.26,-0.255170759053875,-0.161744544153075
0.27,-0.262483380066749,-0.159812227450855
0.28,-0.269640175318695,-0.157581263545548
0.29,-0.276644551508599,-0.155066516644975
0.3,-0.283499747149057,-0.152282398404484
0.31,-0.290208832566372,-0.149242867926947
0.32,-0.296774709900556,-0.145961431762762
0.33,-0.303200113105332,-0.142451143909855
0.34,-0.309487607948129,-0.138724605813674
0.35,-0.315639592010085,-0.134793966367196
0.36,-0.321658294686047,-0.13067092191092
0.37,-0.327545777184573,-0.126366716232873
0.38,-0.333303933255913,-0.121892140521133
0.39,-0.338934544519094,-0.117257529755744
0.4,-0.344439447899123,-0.112472751789512
0.41,-0.349820590954062,-0.107547203739923
0.42,-0.355080032603018,-0.102489811941666
0.43,-0.360219943126146,-0.0973090319466336
0.44,-0.365242604164643,-0.0920128485239227
0.45,-0.370150408720751,-0.0866087756598337
0.46,-0.374945861157759,-0.0811038565578708
0.47,-0.379631577199999,-0.0755046636387422
0.48,-0.384210283932849,-0.0698172985403595
0.49,-0.38868481980273,-0.0640473921178382
0.5,-0.393058134617111,-0.0582001044434978
0.51,-0.397333283151677,-0.0522801360083344
0.52,-0.401513354829242,-0.046291850938227
0.53,-0.405601403398657,-0.0402394002101423
0.54,-0.409600440541985,-0.0341267328536087
0.55,-0.413513435874497,-0.0279575959507154
0.56,-0.417343316944679,-0.0217355346361132
0.57,-0.421092969234225,-0.0154638920970141
0.58,-0.424765236158041,-0.0091458095731912
0.59,-0.428362919064244,-0.00278422635697918
0.6,-0.431888777234161,0.00361812020672621
0.61,-0.435345527882332,0.0100586947204679
0.62,-0.438735846156505,0.0165351637342275
0.63,-0.442062365817502,0.0230453986239774
0.64,-0.445327730908526,0.0295876943616237
0.65,-0.448534752122829,0.0361614315819408
0.66,-0.451686458473026,0.0427672953525142
0.67,-0.45478609797095,0.0494072780522929
0.68,-0.457837137627657,0.0560846793715891
0.69,-0.460843263453423,0.062804106312078
0.7,-0.463808380457746,0.0695714731867986
0.71,-0.466736612649343,0.0763940016201526
0.72,-0.469632303036154,0.0832802205479054
0.73,-0.472500013625339,0.0902399662171854
0.74,-0.475344525423278,0.0972843821864843
0.75,-0.478170838435575,0.104425919325657
0.76,-0.480984167188291,0.111678335042828
0.77,-0.483789891461588,0.119056684780344
0.78,-0.486593507023359,0.126577313510735
0.79,-0.489400621150474,0.134257854963619
0.8,-0.492216952628776,0.142117231625698
0.81,-0.495048331753083,0.150175654740763
0.82,-0.497900700327186,0.158454624309688
0.83,-0.500780111663852,0.166976929090438
0.84,-0.50369273058482,0.175766646598063
0.85,-0.506644833420805,0.184849143104698
0.86,-0.509642808011495,0.194251073639566
0.87,-0.512693153705555,0.204000381988978
0.88,-0.515802496818739,0.214126387830906
0.89,-0.518978765450986,0.224666408962868
0.9,-0.52223474485391,0.235685802254717
0.91,-0.525589252247895,0.247284585876522
0.92,-0.529067152280205,0.259597526433145
0.93,-0.532699357024993,0.272794138964241
0.94,-0.536522825983295,0.287078686944258
0.95,-0.540580566083033,0.302690182282438
0.96,-0.544921631679013,0.319902385322814
0.97,-0.549601124552927,0.339023804844215
0.98,-0.554680193913351,0.36039769806026
0.99,-0.560226036395747,0.384402070619364
1,-0.566311896062463,0.411449676604731
