xi,s1,s2
0,0,0
0.01,0.000792579639080601,-0.0100086475628051
0.02,0.00161668694388043,-0.0200132074584042
0.03,0.00247493565947393,-0.0300133551526935
0.04,0.0033702772956492,-0.0400087086627676
0.05,0.00430606168003734,-0.0499988152870117
0.06,0.00528611164815696,-0.0599831344886793
0.07,0.00631481600171285,-0.0699610155700025
0.08,0.00739724633758626,-0.079931668194394
0.09,0.00853930544698697,-0.0898941229431208
0.1,0.00974791802074689,-0.0998471777579191
0.11,0.0110312788689413,-0.109789324032224
0.12,0.0123991805723572,-0.119718642769051
0.13,0.0138634527525502,-0.129632655729879
0.14,0.0154385612106621,-0.139528107216356
0.15,0.0171424409100213,-0.149400635939363
0.16,0.0189976790276484,-0.159244267185505
0.17,0.0210332355626694,-0.169050600510769
0.18,0.0232870124822821,-0.178807460070551
0.19,0.0258098018098162,-0.188496550974699
0.2,0.0286715395456521,-0.198089174837972
0.21,0.0319715025506224,-0.207537913218187
0.22,0.0358552424657019,-0.21675933240455
0.23,0.0405420846916601,-0.225595224202728
0.24,0.0463617606700213,-0.233720025290317
0.25,0.0537476751351049,-0.240423872233346
0.26,0.0628979259304963,-0.244289435374612
0.27,0.0727887359613192,-0.243721221126174
0.28,0.0815450789056532,-0.239006789033706
0.29,0.0885160725865713,-0.231863521148349
0.3,0.0940268770508277,-0.223523083997846
0.31,0.0984956713958431,-0.21457363903311
0.32,0.102222660122656,-0.205287021392105
0.33,0.105406286342891,-0.195797917967768
0.34,0.108178949413437,-0.186178718593308
0.35,0.110631653552053,-0.176471236099799
0.36,0.112828995156806,-0.166701117382867
0.37,0.114818209780519,-0.1568848940106
0.38,0.116634756912892,-0.147033670197659
0.39,0.118305871527164,-0.137155166734937
0.4,0.119852891647865,-0.127254911322203
0.41,0.121292827414539,-0.117336961912799
0.42,0.1226394463504,-0.107404362717157
0.43,0.123904041579348,-0.0974594409935752
0.44,0.125095987029922,-0.0875040056875094
0.45,0.126223146246877,-0.077539483693648
0.46,0.127292178506633,-0.0675670153935934
0.47,0.128308771534787,-0.0575875229598503
0.48,0.129277820869633,-0.0476017600519634
0.49,0.130203569839361,-0.0376103485499791
0.5,0.131089720051871,-0.0276138060981853
0.51,0.131939519521915,-0.0176125670293455
0.52,0.132755833636932,-0.00760699845099047
0.53,0.133541202808868,0.00240258725154699
0.54,0.134297889692331,0.0124159225987476
0.55,0.135027918149749,0.0224327772377889
0.56,0.135733105631758,0.032452951724491
0.57,0.136415090261413,0.0424762725130853
0.58,0.137075353626529,0.0525025878889551
0.59,0.137715240069575,0.062531764643794
0.6,0.138335973100506,0.0725636853398899
0.61,0.138938669431615,0.0825982460453491
0.62,0.139524351035526,0.0926353544483939
0.63,0.140093955550785,0.102674928278777
0.64,0.140648345299115,0.112716893979539
0.65,0.141188315130533,0.122761185584025
0.66,0.141714599274285,0.132807743762092
0.67,0.142227877342866,0.14285651500653
0.68,0.142728779611562,0.152907450936236
0.69,0.143217891675838,0.162960507697048
0.7,0.143695758572421,0.173015645444664
0.71,0.144162888436448,0.183072827896815
0.72,0.144619755755902,0.193132021944107
0.73,0.145066804275355,0.203193197310775
0.74,0.145504449593372,0.213256326258029
0.75,0.145933081491521,0.223321383323887
0.76,0.14635306602756,0.233388345094371
0.77,0.146764747420875,0.243457190001737
0.78,0.147168449754404,0.253527898146089
0.79,0.147564478514055,0.263600451137275
0.8,0.14795312198388,0.273674831954435
0.81,0.148334652512913,0.283751024820924
0.82,0.148709327667572,0.293829015092706
0.83,0.1490773912818,0.303908789158537
0.84,0.14943907441564,0.313990334350525
0.85,0.149794596231658,0.32407363886382
0.86,0.150144164797504,0.334158691684367
0.87,0.150487977821971,0.344245482523799
0.88,0.150826223331033,0.354334001760656
0.89,0.151159080289653,0.36442424038722
0.9,0.151486719174492,0.374516189961362
0.91,0.15180930250209,0.384609842562845
0.92,0.152126985316619,0.394705190753619
0.93,0.152439915640857,0.404802227541686
0.94,0.152748234893659,0.414900946348166
0.95,0.153052078276871,0.425001340977232
0.96,0.153351575134326,0.435103405588643
0.97,0.153646849285314,0.445207134672595
0.98,0.153938019334655,0.455312523026688
0.99,0.154225198961338,0.465419565734781
1,0.154508497187461,0.475528258147577
