xi,sx,sy,cx,cy,ex,ey,ne
0,0,-0,0,0,0,-0,0
0.01,-0.0048449915,-0.0222581783,0.001275299,-0.0099514048,-0.0061202905,-0.0123067735,0.0137446219
0.02,-0.0070528975,-0.0428290847,0.0026126844,-0.019893112,-0.0096655819,-0.0229359726,0.0248894016
0.03,-0.0069586161,-0.0616856624,0.0040184702,-0.0298238331,-0.0109770863,-0.0318618293,0.0336997417
0.04,-0.0048725508,-0.0788192878,0.0054999738,-0.0397419947,-0.0103725246,-0.0390772931,0.0404304849
0.05,-0.0010816194,-0.0942376123,0.0070657376,-0.0496456556,-0.008147357,-0.0445919566,0.0453301448
0.06,0.0041497537,-0.1079625376,0.0087258141,-0.0595323943,-0.0045760604,-0.0484301433,0.048645854
0.07,0.0105786626,-0.1200283202,0.0104921377,-0.0693991511,8.65249e-05,-0.0506291691,0.050629243
0.08,0.0179827623,-0.1304798005,0.012379016,-0.0792420058,0.0056037463,-0.0512377947,0.0515433175
0.09,0.0261593269,-0.1393707554,0.0144037876,-0.0890558558,0.0117555393,-0.0503148996,0.0516699315
0.1,0.0349243235,-0.1467623682,0.016587718,-0.098833941,0.0183366055,-0.0479284271,0.0513163252
0.11,0.0441115025,-0.1527218134,0.0189572388,-0.1085671226,0.0251542637,-0.0441546908,0.0508170611
0.12,0.0535715033,-0.1573209536,0.0215456935,-0.1182427591,0.0320258098,-0.0390781944,0.0505248233
0.13,0.0631709746,-0.1606351424,0.0243958381,-0.1278428959,0.0387751365,-0.0327922464,0.0507823063
0.14,0.0727917109,-0.1627421325,0.0275634824,-0.1373412441,0.0452282285,-0.0254008884,0.0518729003
0.15,0.0823298036,-0.163721083,0.031122849,-0.1466979341,0.0512069546,-0.0170231489,0.0539623924
0.16,0.0916948077,-0.1636516634,0.0351744358,-0.1558500088,0.0565203719,-0.0078016546,0.0570562727
0.17,0.1008089236,-0.1626132502,0.0398560779,-0.1646934423,0.0609528458,0.0020801921,0.0609883317
0.18,0.1096061944,-0.1606842125,0.0453560701,-0.1730479717,0.0642501243,0.0123637592,0.0654289005
0.19,0.118031719,-0.1579412821,0.0519178109,-0.1805885357,0.066113908,0.0226472537,0.0698852412
0.2,0.1260408811,-0.1544590056,0.0597902701,-0.1867280017,0.066250611,0.0322689961,0.073691462
0.21,0.1335985943,-0.1503092736,0.0690026015,-0.1905230053,0.0645959928,0.0402137317,0.0760906466
0.22,0.1406785644,-0.1455609234,0.0789405038,-0.1909797655,0.0617380606,0.0454188421,0.0766450217
0.23,0.1472625679,-0.1402794116,0.0884257001,-0.1879473551,0.0588368678,0.0476679435,0.0757232451
0.24,0.1533397491,-0.1345265526,0.096650245,-0.1822960645,0.0566895042,0.0477695119,0.0741324905
0.25,0.1589059347,-0.1283603184,0.1035210245,-0.1750393095,0.0553849103,0.0466789911,0.072432151
0.26,0.1639629675,-0.1218346978,0.1092633926,-0.1668510706,0.0546995748,0.0450163728,0.0708414943
0.27,0.1685180592,-0.1149996077,0.1141309617,-0.1581095128,0.0543870975,0.0431099051,0.0694004343
0.28,0.1725831643,-0.1079008566,0.1183263392,-0.1490230954,0.0542568252,0.0411222389,0.068079671
0.29,0.1761743742,-0.1005801524,0.1219988383,-0.1397107476,0.0541755359,0.0391305952,0.0668295756
0.3,0.1793113334,-0.0930751535,0.1252571797,-0.1302435895,0.0540541537,0.037168436,0.0655998793
0.31,0.1820166788,-0.0854195575,0.1281813393,-0.1206661682,0.0538353394,0.0352466107,0.0643472403
0.32,0.1843155024,-0.0776432235,0.1308311717,-0.1110075743,0.0534843308,0.0333643508,0.0630377153
0.33,0.1862348398,-0.0697723256,0.1332523185,-0.1012875105,0.0529825213,0.0315151849,0.0616470149
0.34,0.187803183,-0.0618295307,0.135480219,-0.0915197486,0.052322964,0.0296902179,0.0601598005
0.35,0.1890500222,-0.0538341994,0.1375428552,-0.081714182,0.0515071671,0.0278799826,0.0585686067
0.36,0.1900054147,-0.0458026037,0.139462659,-0.0718780892,0.0505427556,0.0260754855,0.0568726744
0.37,0.1906995835,-0.0377481586,0.1412578615,-0.0620169373,0.049441722,0.0242687787,0.0550768326
0.38,0.1911625474,-0.0296816634,0.142943463,-0.0521349087,0.0482190844,0.0224532453,0.0531904909
0.39,0.1914237811,-0.021611549,0.1445319431,-0.0422352555,0.046891838,0.0206237065,0.0512267678
0.4,0.191511909,-0.0135441284,0.1460337889,-0.032320543,0.0454781201,0.0187764146,0.0492017596
0.41,0.1914544305,-0.0054838455,0.1474578929,-0.022392821,0.0439965376,0.0169089755,0.047133945
0.42,0.1912774789,0.0025664782,0.1488118576,-0.0124537466,0.0424656214,0.0150202248,0.0450437138
0.43,0.1910056138,0.0106054038,0.1501022315,-0.0025046736,0.0409033824,0.0131100774,0.0429530071
0.44,0.1906616457,0.0186326438,0.1513346936,0.0074532815,0.0393269521,0.0111793623,0.0408850499
0.45,0.1902664945,0.0266488415,0.1525142,0.0174191896,0.0377522945,0.0092296519,0.0388641507
0.46,0.1898390799,0.0346553637,0.1536451005,0.0273922717,0.0361939794,0.0072630919,0.036915534
0.47,0.1893962444,0.0426541072,0.1547312331,0.0373718698,0.0346650113,0.0052822374,0.0350651542
0.48,0.188952707,0.0506473231,0.1557760011,0.0473574241,0.0331767059,0.003289899,0.0333394248
0.49,0.1885210473,0.0586374568,0.1567824357,0.0573484556,0.0317386116,0.0012890012,0.031764776
0.5,0.188111719,0.0666270078,0.1577532481,0.067344552,0.0303584709,-0.0007175442,0.0303669496
0.51,0.1877330911,0.0746184088,0.158690873,0.0773453565,0.0290422181,-0.0027269477,0.0291699618
0.52,0.1873915155,0.0826139245,0.1595975049,0.0873505588,0.0277940107,-0.0047366343,0.0281947288
0.53,0.1870914194,0.0906155714,0.1604751281,0.0973598879,0.0266162913,-0.0067443165,0.027457472
0.54,0.1868354203,0.0986250573,0.161325543,0.1073731057,0.0255098773,-0.0087480484,0.0269681699
0.55,0.1866244624,0.1066437426,0.1621503882,0.1173900026,0.0244740742,-0.01074626,0.0267294297
0.56,0.186457971,0.114672621,0.1629511588,0.1274103931,0.0235068122,-0.0127377721,0.0267361377
0.57,0.1863340236,0.1227123197,0.163729223,0.1374341126,0.0226048006,-0.0147217928,0.0269760671
0.58,0.1862495344,0.1307631194,0.1644858357,0.1474610143,0.0217636986,-0.016697895,0.0274313375
0.59,0.1862004499,0.138824991,0.1652221512,0.1574909673,0.0209782987,-0.0186659763,0.028080379
0.6,0.1861819526,0.1468976503,0.1659392331,0.1675238539,0.0202427195,-0.0206262036,0.0288999649
0.61,0.1861886687,0.1549806264,0.1666380636,0.1775595686,0.0195506051,-0.0225789422,0.0298669515
0.62,0.1862148788,0.1630733448,0.1673195519,0.187598016,0.0188953269,-0.0245246712,0.0309595361
0.63,0.1862547251,0.1711752214,0.167984541,0.19763911,0.0182701841,-0.0264638887,0.032158001
0.64,0.1863024145,0.1792857657,0.168633814,0.2076827728,0.0176686005,-0.0283970071,0.0334450214
0.65,0.1863524109,0.1874046916,0.1692680997,0.2177289333,0.0170843112,-0.0303242418,0.0348056508
0.66,0.1863996148,0.1955320316,0.1698880773,0.2277775272,0.0165115375,-0.0322454956,0.0362271011
0.67,0.1864395253,0.2036682534,0.1704943811,0.2378284956,0.0159451441,-0.0341602422,0.0376984054
0.68,0.1864683793,0.2118143737,0.1710876042,0.2478817846,0.0153807751,-0.0360674109,0.039210029
0.69,0.186483265,0.2199720681,0.1716683018,0.2579373451,0.0148149632,-0.037965277,0.0407534709
0.7,0.1864822033,0.2281437722,0.1722369947,0.2679951319,0.0142452086,-0.0398513596,0.0423208794
0.71,0.1864641956,0.2363327728,0.172794172,0.2780551033,0.0136700236,-0.0417223306,0.0439046969
0.72,0.1864292332,0.2445432878,0.1733402934,0.2881172211,0.0130889398,-0.0435739334,0.0454973407
0.73,0.1863782686,0.2527805376,0.1738757916,0.2981814501,0.0125024769,-0.0454009125,0.0470909204
0.74,0.1863131482,0.2610508087,0.1744010747,0.3082477575,0.0119120735,-0.0471969489,0.0486769912
0.75,0.1862365073,0.2693615154,0.1749165275,0.3183161133,0.0113199798,-0.0489545979,0.0502463392
0.76,0.1861516292,0.2777212657,0.1754225135,0.3283864894,0.0107291157,-0.0506652237,0.0517887905
0.77,0.1860622735,0.2861399389,0.1759193765,0.3384588599,0.0101428969,-0.052318921,0.0532930376
0.78,0.185972477,0.2946287844,0.176407442,0.3485332007,0.0095650349,-0.0539044163,0.0547464701
0.79,0.1858863337,0.3032005536,0.1768870183,0.3586094893,0.0089993154,-0.0554089357,0.0561349965
0.8,0.1858077613,0.311869677,0.1773583978,0.3686877049,0.0084493635,-0.056818028,0.0574428415
0.81,0.1857402619,0.3206525015,0.177821858,0.378767828,0.0079184039,-0.0581153264,0.0586522999
0.82,0.1856866881,0.3295676049,0.1782776627,0.3888498402,0.0074090254,-0.0592822354,0.0597434271
0.83,0.1856490234,0.3386362034,0.1787260626,0.3989337247,0.0069229608,-0.0602975212,0.0606936443
0.84,0.1856281911,0.3478826752,0.1791672965,0.4090194654,0.0064608946,-0.0611367902,0.0614772337
0.85,0.1856239026,0.3573352177,0.1796015917,0.4191070475,0.0060223109,-0.0617718298,0.0620647016
0.86,0.1856345627,0.3670266641,0.1800291648,0.4291964568,0.0056053979,-0.0621697928,0.0624219802
0.87,0.1856572445,0.3769954833,0.1804502225,0.4392876804,0.005207022,-0.0622921971,0.0625094464
0.88,0.1856877537,0.387286989,0.1808649621,0.4493807057,0.0048227916,-0.0620937167,0.0622807272
0.89,0.1857207984,0.3979547863,0.1812735722,0.4594755212,0.0044472262,-0.0615207348,0.0616812665
0.9,0.1857502852,0.4090624865,0.181676233,0.4695721159,0.0040740522,-0.0605096294,0.0606466253
0.91,0.1857697613,0.4206857191,0.1820731167,0.4796704795,0.0036966446,-0.0589847604,0.0591004834
0.92,0.1857730259,0.4329144779,0.1824643884,0.4897706023,0.0033086375,-0.0568561244,0.0569523131
0.93,0.1857549319,0.4458558316,0.1828502061,0.4998724751,0.0029047258,-0.0540166434,0.0540946873
0.94,0.1857124046,0.4596370392,0.1832307213,0.5099760891,0.0024816833,-0.0503390499,0.0504001855
0.95,0.1856457008,0.4744091058,0.1836060791,0.5200814362,0.0020396217,-0.0456723304,0.0457178501
0.96,0.1855599372,0.49035082,0.1839764189,0.5301885086,0.0015835182,-0.0398376886,0.039869148
0.97,0.1854669136,0.5076733138,0.1843418746,0.540297299,0.001125039,-0.0326239851,0.0326433779
0.98,0.1853872631,0.5266251887,0.1847025745,0.5504078003,0.0006846886,-0.0237826117,0.0237924655
0.99,0.1853529567,0.5474982516,0.1850586423,0.560520006,0.0002943144,-0.0130217544,0.01302508
1,0.1854101966,0.5706339098,0.1854101966,0.5706339098,0,0,0
