xi,s1,s2
0,1.29194887227669e-25,1.02814158426544e-27
0.01,0.0215523657056679,-0.00281124707784092
0.02,0.0417007786385343,-0.00365313357209747
0.03,0.0604513825798382,-0.00278699974568291
0.04,0.0778215659751822,-0.000449119343478463
0.05,0.0938387014771322,0.00314769457274359
0.06,0.10853893878232,0.00781253625185632
0.07,0.121966050763046,0.0133749063433741
0.08,0.134170332893391,0.0196832634499082
0.09,0.145207555969821,0.0266036281420815
0.1,0.155137972126303,0.0340182394359031
0.11,0.16402537414392,0.0418242637326022
0.12,0.171936208054985,0.0499325562209219
0.13,0.178938739041668,0.0582664747418719
0.14,0.185102270629112,0.0667607461159409
0.15,0.190496417173062,0.075360384932769
0.16,0.195190429641991,0.084019664803279
0.17,0.199252574693733,0.0927011420742674
0.18,0.202749567046615,0.101374732005455
0.19,0.20574605514509,0.110016837408997
0.2,0.20830416011988,0.118609529751452
0.21,0.210483068042611,0.127139782718213
0.22,0.212338675474963,0.135598758240394
0.23,0.213923288312309,0.143981144984177
0.24,0.215285373921869,0.152284549302623
0.25,0.216469366575359,0.160508938649937
0.26,0.217515526176144,0.168656137458195
0.27,0.218459850280893,0.176729375476531
0.28,0.219334039415741,0.18473288857278
0.29,0.220165515686949,0.192671571997586
0.3,0.220977494686067,0.200550686110965
0.31,0.2217891106896,0.20837561457133
0.32,0.222615595153179,0.216151674986974
0.33,0.223468508500232,0.223883982030015
0.34,0.22435602519641,0.231577363006473
0.35,0.225283270035353,0.23923632438306
0.36,0.226252684571424,0.246865054044911
0.37,0.227264387829006,0.254467433356418
0.38,0.228316519124006,0.262047050232498
0.39,0.229405562438658,0.269607212816327
0.4,0.230526652349511,0.277150963763445
0.41,0.231673861508583,0.284681095132214
0.42,0.232840469677688,0.292200163880656
0.43,0.234019214315937,0.299710507969643
0.44,0.235202522720414,0.307214263072463
0.45,0.236382725720019,0.314713379890743
0.46,0.237552252922492,0.322209642076739
0.47,0.238703809514602,0.329704684761998
0.48,0.239830534615513,0.337200013692376
0.49,0.240926141183322,0.344697024969425
0.5,0.241985037474772,0.352197025398147
0.51,0.243002430058134,0.359701253441111
0.52,0.243974408379262,0.367210900778934
0.53,0.244898010880828,0.374727134477131
0.54,0.245771272674717,0.38225111975933
0.55,0.246593254767609,0.389784043386844
0.56,0.247364054839723,0.397327137644622
0.57,0.248084799576739,0.404881704933551
0.58,0.248757618554894,0.412449142969137
0.59,0.249385599679243,0.420030970586538
0.6,0.249972726175105,0.427628854151971
0.61,0.250523795132672,0.435244634580484
0.62,0.251044317604796,0.442880354960086
0.63,0.251540400257943,0.450538288782251
0.64,0.252018608576329,0.458220968778782
0.65,0.252485811619222,0.465931216365039
0.66,0.252949008331417,0.473672171689542
0.67,0.253415135406988,0.481447324289961
0.68,0.253890857117738,0.489260544520249
0.69,0.254382346061121,0.49711611933391
0.7,0.254895081233556,0.505018802995023
0.71,0.255433678935626,0.512973888925014
0.72,0.25600175803624,0.520987303296555
0.73,0.256601839602192,0.529065720377151
0.74,0.257235280893124,0.537216699622432
0.75,0.257902243721891,0.545448844519138
0.76,0.258601697180329,0.553771983177804
0.77,0.259331454730413,0.562197370675137
0.78,0.260088245660833,0.570737913146098
0.79,0.260867820908956,0.579408413625676
0.8,0.261665093248201,0.588225839640361
0.81,0.262474311840804,0.59720961254931
0.82,0.263289271155993,0.606381918635219
0.83,0.264103554253562,0.615768041944887
0.84,0.264910810432842,0.625396718879472
0.85,0.265705067247076,0.635300514534458
0.86,0.2664810768832,0.645516220789302
0.87,0.267234696907014,0.656085276146797
0.88,0.267963305373765,0.667054207322113
0.89,0.268666250304124,0.678475092581553
0.9,0.269345333525568,0.690406046830992
0.91,0.270005328879162,0.702911728454023
0.92,0.27065453479174,0.716063867899795
0.93,0.271305361213493,0.729941818020552
0.94,0.271974950920948,0.744633126158861
0.95,0.272685835185362,0.760234127984553
0.96,0.273466623806503,0.776850563081344
0.97,0.27435272951184,0.794598212283162
0.98,0.275387126721135,0.813603556760173
0.99,0.276621144676434,0.834004458854499
1,0.278115294937453,0.855950864665638
