xi,s1,s2
0,-1.09364804031431e-26,1.97939814706941e-26
0.01,-0.0119545662825555,-0.0275184436725955
0.02,-0.0225760455546908,-0.0513109750640504
0.03,-0.0321142935090931,-0.072098978347549
0.04,-0.040774886714848,-0.0904705355196654
0.05,-0.0487256577437425,-0.106900793079693
0.06,-0.0561025334604389,-0.121770097020714
0.07,-0.0630147165145143,-0.135380026778421
0.08,-0.0695492500723574,-0.147967458783714
0.09,-0.0757750058269189,-0.159716790265082
0.1,-0.0817461353233054,-0.170770453946792
0.11,-0.0875050246382127,-0.181237854288893
0.12,-0.0930847924511922,-0.191202855915063
0.13,-0.0985113715457411,-0.200729954874307
0.14,-0.103805213778213,-0.209869263382524
0.15,-0.108982658552541,-0.218660438689963
0.16,-0.114057004838766,-0.227135686720579
0.17,-0.119039326773365,-0.235321971129309
0.18,-0.12393907287937,-0.243242558423284
0.19,-0.128764488944281,-0.250918029792995
0.2,-0.133522904593746,-0.25836689029942
0.21,-0.138220923591294,-0.265605906037304
0.22,-0.142864556966862,-0.272650296793725
0.23,-0.147459328871248,-0.279513880943399
0.24,-0.152010366379659,-0.286209206888179
0.25,-0.156522475261888,-0.292747674570489
0.26,-0.16100020280914,-0.299139647489404
0.27,-0.165447888799835,-0.30539455562228
0.28,-0.16986970568665,-0.311520989654789
0.29,-0.174269689087131,-0.31752678692225
0.3,-0.17865175966016,-0.323419109465143
0.31,-0.183019737450577,-0.329204514601664
0.32,-0.187377349784264,-0.334889018420221
0.33,-0.191728233795978,-0.340478152594744
0.34,-0.196075934672246,-0.345977014925684
0.35,-0.200423900691618,-0.351390314009584
0.36,-0.204775476144565,-0.356722408440102
0.37,-0.209133893215349,-0.361977340943369
0.38,-0.213502263908129,-0.367158867850551
0.39,-0.217883573099636,-0.372270484310503
0.4,-0.222280673800698,-0.377315445645399
0.41,-0.22669628570859,-0.382296785252165
0.42,-0.231132998093423,-0.387217329448432
0.43,-0.23559327767686,-0.392079709620505
0.44,-0.24007948138074,-0.396886371947323
0.45,-0.244593873438258,-0.401639584933182
0.46,-0.249138646321603,-0.406341444977877
0.47,-0.25371594493962,-0.410993880212826
0.48,-0.258327893559063,-0.415598652831812
0.49,-0.262976624903001,-0.420157360144914
0.5,-0.267664310879961,-0.424671434584239
0.51,-0.272393194397346,-0.429142142890052
0.52,-0.277165621712732,-0.433570584705894
0.53,-0.281984074776579,-0.437957690811301
0.54,-0.286851203019946,-0.442304221220707
0.55,-0.291769854040761,-0.446610763377145
0.56,-0.296743102642229,-0.450877730669328
0.57,-0.301774277676934,-0.455105361500722
0.58,-0.306866986150203,-0.459293719139208
0.59,-0.312025134036308,-0.463442692575917
0.6,-0.317252943261063,-0.467551998621855
0.61,-0.322554964304858,-0.471621185470594
0.62,-0.327936083935599,-0.475649637917027
0.63,-0.333401528131501,-0.479636584042447
0.64,-0.338956861370211,-0.48358110240575
0.65,-0.344607984011193,-0.487482128400837
0.66,-0.350361129553779,-0.491338458401969
0.67,-0.35622286355372,-0.495148750318569
0.68,-0.362200085981098,-0.4989115191809
0.69,-0.368300038802445,-0.502625126378111
0.7,-0.374530320569924,-0.506287761170101
0.71,-0.380898909800423,-0.509897413094663
0.72,-0.387414198927405,-0.513451833891374
0.73,-0.394085040608382,-0.516948487563699
0.74,-0.400920808170845,-0.52038448720076
0.75,-0.407931471979514,-0.523756517180248
0.76,-0.415127693507756,-0.527060739373924
0.77,-0.422520938896019,-0.530292681977191
0.78,-0.430123613780135,-0.533447109584191
0.79,-0.437949221172348,-0.536517873129872
0.8,-0.446012544177909,-0.539497738320535
0.81,-0.45432985534844,-0.54237819116002
0.82,-0.462919156674262,-0.545149217468756
0.83,-0.471800476062974,-0.547799036320854
0.84,-0.480996290465278,-0.550313732895946
0.85,-0.490532167654134,-0.552676719270463
0.86,-0.500437720864339,-0.554867949963046
0.87,-0.510747970517955,-0.556862819034501
0.88,-0.521505207261015,-0.55863066554274
0.89,-0.532761450536948,-0.560132814153128
0.9,-0.54458159692215,-0.561320077704664
0.91,-0.55704735244912,-0.562129648532427
0.92,-0.570262043142622,-0.562481305346717
0.93,-0.584356397994269,-0.562272862469309
0.94,-0.599495398600987,-0.561374788227261
0.95,-0.615886289692783,-0.559623919304694
0.96,-0.633787844775233,-0.556816197852978
0.97,-0.653520981112152,-0.552698358159743
0.98,-0.675480818273848,-0.546958489677161
0.99,-0.700150274476411,-0.539215403209905
1,-0.728115294937453,-0.529006727063226
