xi,s1,s2
0,-9.10710856570779e-28,-6.16402946444662e-26
0.01,0.00992776613484975,-0.0294561533287222
0.02,0.0187881836037393,-0.0546199766229247
0.03,0.0267940834770326,-0.0763179355799909
0.04,0.0341249686530754,-0.0952439293918174
0.05,0.0409300387616931,-0.111971509936239
0.06,0.0473312150676881,-0.126966100968458
0.07,0.0534261653743378,-0.140597217312463
0.08,0.0592913289268915,-0.153150684052464
0.09,0.0649849413160685,-0.164840855724311
0.1,0.0705500593815555,-0.175822835506925
0.11,0.0760175861155041,-0.18620469441372
0.12,0.0814092955660284,-0.196059690484032
0.13,0.0867408569951515,-0.205438484860054
0.14,0.0920246823411609,-0.214380619730181
0.15,0.0972715196641505,-0.222920757703945
0.16,0.10249079257475,-0.231089682618558
0.17,0.107690762967261,-0.238914562211849
0.18,0.112878693007248,-0.246419207680721
0.19,0.11806100711912,-0.2536243332396
0.2,0.123243453973721,-0.260547815678893
0.21,0.128431268475915,-0.267204953923437
0.22,0.133629333752173,-0.273608728590955
0.23,0.138842343138162,-0.279770061550509
0.24,0.144074962166328,-0.285698075480952
0.25,0.149331990553484,-0.291400353429382
0.26,0.154618521589128,-0.296883196549391
0.27,0.159940033942667,-0.30215183451397
0.28,0.16530231191867,-0.307210515794857
0.29,0.170711298131031,-0.312062550616549
0.3,0.176172943577858,-0.3167103520901
0.31,0.181693057716368,-0.321155477346928
0.32,0.187277158537777,-0.325398668672611
0.33,0.19293032264219,-0.329439894640697
0.34,0.198657035313495,-0.3332783912465
0.35,0.204461040594254,-0.336912703040906
0.36,0.210345191360594,-0.340340724264175
0.37,0.216311299397099,-0.343559739979742
0.38,0.222359985540241,-0.346566467231124
0.39,0.228490546066032,-0.349357101674101
0.4,0.234700934363644,-0.351927403067199
0.41,0.240987857894991,-0.354272819620468
0.42,0.247346891398536,-0.356388617819549
0.43,0.253772590161637,-0.358270012272828
0.44,0.260258603292889,-0.3599122955586
0.45,0.266797786994471,-0.361310968072233
0.46,0.273382317834493,-0.362461867873328
0.47,0.280003806019338,-0.363361300532878
0.48,0.286653408666008,-0.364006168980434
0.49,0.29332194307447,-0.364394103351265
0.5,0.3,-0.364523590833519
0.51,0.30667805692553,-0.364394103351265
0.52,0.313346591333992,-0.364006168980434
0.53,0.319996193980662,-0.363361300532878
0.54,0.326617682165507,-0.362461867873328
0.55,0.333202213005529,-0.361310968072234
0.56,0.339741396707112,-0.3599122955586
0.57,0.346227409838363,-0.358270012272828
0.58,0.352653108601464,-0.356388617819549
0.59,0.359012142105009,-0.354272819620468
0.6,0.365299065636356,-0.351927403067199
0.61,0.371509453933968,-0.349357101674102
0.62,0.377640014459759,-0.346566467231124
0.63,0.383688700602901,-0.343559739979742
0.64,0.389654808639406,-0.340340724264175
0.65,0.395538959405746,-0.336912703040906
0.66,0.401342964686505,-0.3332783912465
0.67,0.40706967735781,-0.329439894640697
0.68,0.412722841462223,-0.325398668672611
0.69,0.418306942283631,-0.321155477346928
0.7,0.423827056422142,-0.3167103520901
0.71,0.429288701868969,-0.312062550616549
0.72,0.43469768808133,-0.307210515794857
0.73,0.440059966057333,-0.302151834513969
0.74,0.445381478410872,-0.296883196549391
0.75,0.450668009446516,-0.291400353429382
0.76,0.455925037833672,-0.285698075480952
0.77,0.461157656861838,-0.279770061550509
0.78,0.466370666247827,-0.273608728590955
0.79,0.471568731524085,-0.267204953923437
0.8,0.476756546026279,-0.260547815678893
0.81,0.48193899288088,-0.2536243332396
0.82,0.487121306992752,-0.246419207680721
0.83,0.492309237032739,-0.238914562211849
0.84,0.49750920742525,-0.231089682618558
0.85,0.502728480335849,-0.222920757703945
0.86,0.507975317658839,-0.214380619730181
0.87,0.513259143004848,-0.205438484860054
0.88,0.518590704433971,-0.196059690484032
0.89,0.523982413884496,-0.18620469441372
0.9,0.529449940618444,-0.175822835506925
0.91,0.535015058683932,-0.164840855724311
0.92,0.540708671073108,-0.153150684052464
0.93,0.546573834625662,-0.140597217312463
0.94,0.552668784932312,-0.126966100968458
0.95,0.559069961238307,-0.111971509936239
0.96,0.565875031346925,-0.0952439293918174
0.97,0.573205916522967,-0.076317935579991
0.98,0.581211816396261,-0.0546199766229248
0.99,0.59007223386515,-0.0294561533287222
1,0.6,4.85617190896035e-27
