xi,s1,s2
0,-8.10099331944102e-26,-7.95268222553463e-27
0.01,0.00975303990690106,-0.0290766211335704
0.02,0.0185842009088403,-0.0541759628846098
0.03,0.0266682351640016,-0.0760428070786956
0.04,0.0341514611634236,-0.0952947404471891
0.05,0.0411552961288099,-0.112438265896055
0.06,0.0477795442052151,-0.127883796327259
0.07,0.0541054404486064,-0.141959531012739
0.08,0.0601984506083022,-0.154924214520955
0.09,0.0661108267042856,-0.166978778196023
0.1,0.0718839183993955,-0.178276864189413
0.11,0.0775502401663916,-0.188934232044234
0.12,0.0831352942498981,-0.199037047832094
0.13,0.0886591494232209,-0.208649055842534
0.14,0.0941377755400425,-0.217817632825044
0.15,0.0995841338809927,-0.226578724783655
0.16,0.105009023295095,-0.234960666324102
0.17,0.110421682136549,-0.242986882555671
0.18,0.115830147882298,-0.250677482131106
0.19,0.121241415467485,-0.258049928243822
0.2,0.126661515349364,-0.265119338476542
0.21,0.132095582361401,-0.271898737006083
0.22,0.137547922355695,-0.27839929102296
0.23,0.143022076663247,-0.284630531500143
0.24,0.148520884372058,-0.29060055831097
0.25,0.154046542423063,-0.296316229696212
0.26,0.159600663523914,-0.301783336080298
0.27,0.165184331880583,-0.307006758236693
0.28,0.170798156746816,-0.311990609802429
0.29,0.176442323791419,-0.316738364141796
0.3,0.182116644283379,-0.321252965559184
0.31,0.187820602094825,-0.325536924861079
0.32,0.19355339852183,-0.329592399267222
0.33,0.199313994923038,-0.333421256670914
0.34,0.205101153176008,-0.337025124250244
0.35,0.210913473918773,-0.34040542184823
0.36,0.216749432246968,-0.343563384366335
0.37,0.222607410305081,-0.346500080399254
0.38,0.228485726581465,-0.349216429562075
0.39,0.234382661898345,-0.351713218622442
0.4,0.240296482096839,-0.353991116437741
0.41,0.246225457416963,-0.356050687697312
0.42,0.252167878572655,-0.357892405469687
0.43,0.25812206952179,-0.359516662554847
0.44,0.264086396931197,-0.360923781641513
0.45,0.270059276336686,-0.362114024269458
0.46,0.276039174998063,-0.363087598596842
0.47,0.282024611449161,-0.363844665972575
0.48,0.288014151742861,-0.364385346313704
0.49,0.294006402391119,-0.364709722287826
0.5,0.3,-0.364817842300522
0.51,0.305993597608881,-0.364709722287826
0.52,0.311985848257139,-0.364385346313704
0.53,0.317975388550839,-0.363844665972575
0.54,0.323960825001937,-0.363087598596842
0.55,0.329940723663314,-0.362114024269458
0.56,0.335913603068803,-0.360923781641513
0.57,0.34187793047821,-0.359516662554847
0.58,0.347832121427344,-0.357892405469687
0.59,0.353774542583036,-0.356050687697313
0.6,0.359703517903161,-0.353991116437741
0.61,0.365617338101654,-0.351713218622442
0.62,0.371514273418535,-0.349216429562075
0.63,0.377392589694919,-0.346500080399254
0.64,0.383250567753032,-0.343563384366336
0.65,0.389086526081227,-0.34040542184823
0.66,0.394898846823992,-0.337025124250245
0.67,0.400686005076962,-0.333421256670914
0.68,0.40644660147817,-0.329592399267222
0.69,0.412179397905175,-0.325536924861079
0.7,0.417883355716621,-0.321252965559184
0.71,0.423557676208581,-0.316738364141797
0.72,0.429201843253183,-0.311990609802429
0.73,0.434815668119417,-0.307006758236693
0.74,0.440399336476086,-0.301783336080298
0.75,0.445953457576936,-0.296316229696212
0.76,0.451479115627942,-0.29060055831097
0.77,0.456977923336753,-0.284630531500143
0.78,0.462452077644305,-0.27839929102296
0.79,0.467904417638599,-0.271898737006083
0.8,0.473338484650635,-0.265119338476542
0.81,0.478758584532515,-0.258049928243822
0.82,0.484169852117702,-0.250677482131106
0.83,0.489578317863451,-0.242986882555671
0.84,0.494990976704905,-0.234960666324102
0.85,0.500415866119007,-0.226578724783655
0.86,0.505862224459957,-0.217817632825045
0.87,0.511340850576779,-0.208649055842534
0.88,0.516864705750102,-0.199037047832094
0.89,0.522449759833608,-0.188934232044234
0.9,0.528116081600604,-0.178276864189413
0.91,0.533889173295714,-0.166978778196023
0.92,0.539801549391698,-0.154924214520955
0.93,0.545894559551394,-0.141959531012738
0.94,0.552220455794785,-0.127883796327259
0.95,0.55884470387119,-0.112438265896055
0.96,0.565848538836576,-0.0952947404471892
0.97,0.573331764835998,-0.0760428070786957
0.98,0.58141579909116,-0.0541759628846099
0.99,0.590246960093099,-0.0290766211335704
1,0.6,-1.75506312455336e-26
