xi,s1,s2
0,3.60860573478741e-26,1.45702293709828e-26
0.01,-0.0170993389032887,-0.0277367337248257
0.02,-0.0321015192020216,-0.0501847828801752
0.03,-0.0455545682690023,-0.0685333879953868
0.04,-0.0578900989812264,-0.0837306187106883
0.05,-0.0694374480046788,-0.0965125966633544
0.06,-0.0804378140791313,-0.107432718373862
0.07,-0.0910583963029398,-0.116890878132048
0.08,-0.101406532417842,-0.125162690883263
0.09,-0.111543837093755,-0.13242871511453
0.1,-0.121500340213572,-0.138803675740702
0.11,-0.131288511507645,-0.144365448429513
0.12,-0.140914330280087,-0.149177841338008
0.13,-0.150380854214307,-0.153297631816292
0.14,-0.15968883327036,-0.156775400522661
0.15,-0.168837209931986,-0.159656126977618
0.16,-0.177823619453649,-0.161979785117898
0.17,-0.186644890107574,-0.163781938850493
0.18,-0.195297543430785,-0.165094337606674
0.19,-0.203778294472143,-0.165945511896013
0.2,-0.212084552039385,-0.166361368860406
0.21,-0.220214912737719,-0.166365783577108
0.22,-0.228169493588996,-0.16598107983609
0.23,-0.235949854893847,-0.165228230352195
0.24,-0.243558761674402,-0.164126946451617
0.25,-0.250999938908557,-0.162695763507397
0.26,-0.258277826764251,-0.160952126374907
0.27,-0.265397335833737,-0.158912474827349
0.28,-0.272363602367851,-0.156592328991237
0.29,-0.279181743510292,-0.154006374781898
0.3,-0.285856612531885,-0.151168549338953
0.31,-0.292392556932913,-0.148092125912853
0.32,-0.29879325111468,-0.144789784478369
0.33,-0.305061718342285,-0.14127364611653
0.34,-0.311200427276628,-0.137555293123528
0.35,-0.317211391374482,-0.133645788570663
0.36,-0.323096268288555,-0.129555695864281
0.37,-0.328856459267554,-0.125295098305714
0.38,-0.334493208556249,-0.120873618651228
0.39,-0.340007702795542,-0.116300438671956
0.4,-0.345401170422527,-0.111584318713846
0.41,-0.350674980109483,-0.106733617159629
0.42,-0.355830714214927,-0.101756307343548
0.43,-0.360870178803748,-0.0966599880000102
0.44,-0.36579538867941,-0.0914518911649984
0.45,-0.370608551455075,-0.0861388899795115
0.46,-0.375312051624727,-0.080727506493004
0.47,-0.379908434634301,-0.0752239194668261
0.48,-0.384400390952801,-0.0696339721776636
0.49,-0.388790740143434,-0.0639631802209782
0.5,-0.393082414934725,-0.0582167393144476
0.51,-0.39727844517854,-0.0523995331253218
0.52,-0.401381938867145,-0.046516141719607
0.53,-0.405396055684825,-0.0405708515897366
0.54,-0.409323977618542,-0.0345676663040684
0.55,-0.413168879455494,-0.028510317180299
0.56,-0.416933899280666,-0.0224022739588788
0.57,-0.420622108974383,-0.0162467554764255
0.58,-0.424236484709867,-0.0100467403391389
0.59,-0.427779877450789,-0.00380497759621532
0.6,-0.43125498344882,0.00247600258673806
0.61,-0.434664315672825,0.00879387962813056
0.62,-0.438010199460625,0.0151465689506933
0.63,-0.441294829658815,0.021532339075322
0.64,-0.44452035198516,0.0279499644347986
0.65,-0.447688945322621,0.0343988795613537
0.66,-0.450802904013389,0.0408793332742292
0.67,-0.453864720152908,0.0473925428672416
0.68,-0.456877165883912,0.0539408482963442
0.69,-0.459843375690448,0.0605278663671899
0.7,-0.462766928691908,0.0671586449226944
0.71,-0.465651929338778,0.0738398147973745
0.72,-0.468503046553074,0.080579683707863
0.73,-0.471325447382222,0.0873881827506398
0.74,-0.474124689097626,0.0942767548359391
0.75,-0.476906609694955,0.101258240888432
0.76,-0.47967721839443,0.10834676604791
0.77,-0.482442586141114,0.115557625869969
0.78,-0.485208736105195,0.12290717252669
0.79,-0.487981534182275,0.130412701007324
0.8,-0.490766579493659,0.138092335318974
0.81,-0.493569098385032,0.145964922986173
0.82,-0.49639392938335,0.154050145321637
0.83,-0.499245739047643,0.162369175423881
0.84,-0.502129328778034,0.170945551946008
0.85,-0.505049945123142,0.179806061163401
0.86,-0.508013590087489,0.188981619041404
0.87,-0.511027331438911,0.19850815330301
0.88,-0.514099613015961,0.208427485496547
0.89,-0.517240565035319,0.218788213063364
0.9,-0.520462314399197,0.229646591405517
0.91,-0.523779339717249,0.241067678263246
0.92,-0.527209988905475,0.253133298147067
0.93,-0.530780947942136,0.265967319216175
0.94,-0.534532872200665,0.279767750211465
0.95,-0.538526062497074,0.294839099698334
0.96,-0.542846141137371,0.311624735309498
0.97,-0.547609727964972,0.330739242987795
0.98,-0.552970116408106,0.353000786228997
0.99,-0.559122949527236,0.37946346532462
1,-0.566311896062463,0.411449676604731
