xi,s1,s2
0,4.6991591321122e-29,6.25417977127111e-29
0.01,0.029548778214778,-0.00757849357455006
0.02,0.0557892857512731,-0.0100327104452794
0.03,0.0788219877695568,-0.00853135002386234
0.04,0.0988090132316042,-0.00403940312814593
0.05,0.115959510523409,0.00265633012218129
0.06,0.130516302019478,0.0109234668948397
0.07,0.142743837589717,0.0202620127191276
0.08,0.152917447048681,0.0302840770450089
0.09,0.161313891547228,0.0406953332871198
0.1,0.168203213906536,0.0512782233536943
0.11,0.173841887894516,0.061876906660408
0.12,0.178467266444597,0.0723839536291413
0.13,0.182293328816897,0.0827287836716609
0.14,0.18550772670178,0.0928678476582206
0.15,0.188270129265788,0.10277655487108
0.16,0.190711867139959,0.112442944442944
0.17,0.192936875347544,0.12186310127711
0.18,0.195023922978963,0.1310383033416
0.19,0.197029864248869,0.139973615044379
0.2,0.198993128424536,0.148677085415815
0.21,0.200936989107195,0.157159057072207
0.22,0.202872567613094,0.165431537308833
0.23,0.204801570263452,0.173507631117367
0.24,0.206718759583305,0.18140103612766
0.25,0.20861415940925,0.189125599473886
0.26,0.210474993906078,0.196694936585059
0.27,0.2122873604923,0.204122111899909
0.28,0.214037636674578,0.211419381506124
0.29,0.215713620791032,0.218597997703966
0.3,0.217305406663457,0.225668075494242
0.31,0.218805992158425,0.232638520990646
0.32,0.220211621657286,0.239517021756469
0.33,0.221521862435053,0.246310099065669
0.34,0.222739414987732,0.253023222078299
0.35,0.223869666683238,0.259660981556277
0.36,0.224920083934988,0.266227299012884
0.37,0.225899605012027,0.272725630244983
0.38,0.226818088461739,0.279159149326755
0.39,0.22768581967103,0.285530912425331
0.4,0.228513075566582,0.291844001438174
0.41,0.229309747454197,0.298101647452198
0.42,0.230085021997215,0.304307334024639
0.43,0.230847120334012,0.310464880285666
0.44,0.23160309533458,0.316578503862744
0.45,0.232358686996189,0.322652863626727
0.46,0.233118235978126,0.328693082259716
0.47,0.233884655275513,0.334704748644641
0.48,0.234659460032213,0.340693900076605
0.49,0.235442855492805,0.346666984295963
0.5,0.23623388309365,0.352630801343147
0.51,0.237030624571072,0.358592425280845
0.52,0.237830457135124,0.364559108383181
0.53,0.238630322877972,0.370538181565431
0.54,0.23942697558591,0.376536964827858
0.55,0.240217198003484,0.382562690313284
0.56,0.240997989427753,0.388622438024016
0.57,0.241766723632703,0.394723084198128
0.58,0.242521277123793,0.400871262345102
0.59,0.243260127722655,0.407073336940811
0.6,0.24398242348193,0.413335389781874
0.61,0.244688021930254,0.419663218999346
0.62,0.245377499647384,0.426062350731777
0.63,0.246052132169466,0.432538063457618
0.64,0.246713844224456,0.439095424986983
0.65,0.247365130297669,0.445739342112767
0.66,0.248008945527487,0.452474622921114
0.67,0.24864856693132,0.459306051761226
0.68,0.24928742543411,0.466238476810768
0.69,0.249928918978845,0.473276908849364
0.7,0.250576237031212,0.480426627148769
0.71,0.251232214278756,0.487693290077064
0.72,0.251899215277544,0.49508305018027
0.73,0.252579050053697,0.502602673740378
0.74,0.253272920659813,0.510259664809801
0.75,0.253981398686265,0.518062393722246
0.76,0.254704433727388,0.52602023008
0.77,0.255441392802543,0.53414368021764
0.78,0.256191130732064,0.542444529142157
0.79,0.256952091468089,0.550935986949507
0.8,0.257722440380268,0.559632839717574
0.81,0.25850022749636,0.568551604875551
0.82,0.259283581697706,0.577710691049748
0.83,0.260070935869589,0.587130562385812
0.84,0.260861282995005,0.596833907492022
0.85,0.261654460473858,0.606845847306899
0.86,0.262451435067819,0.617194530219259
0.87,0.2632545414715,0.627912707606337
0.88,0.264067658571471,0.639040490944364
0.89,0.264896322660858,0.65062929973363
0.9,0.265747777609326,0.662747000240261
0.91,0.266630961988456,0.675484235054734
0.92,0.267556433152511,0.688961943467119
0.93,0.268536228274597,0.703340072659052
0.94,0.269583662338205,0.718827479712435
0.95,0.27071306308416,0.735693024434875
0.96,0.271939442912943,0.754277853001833
0.97,0.273278107742417,0.775008872415529
0.98,0.274744202820941,0.798413415780551
0.99,0.276352195495871,0.825135098396214
1,0.278115294937453,0.855950864665638
