xi,s1,s2
0,-7.90374280898092e-28,-1.18009211038329e-26
0.01,-0.00184803689371179,-0.00981584013428246
0.02,-0.00391423687617886,-0.019682034596245
0.03,-0.00608200848606673,-0.0295577094757202
0.04,-0.00827041834385343,-0.0394212038651943
0.05,-0.0104291640934757,-0.049264201362776
0.06,-0.0125338702539846,-0.0590868721764923
0.07,-0.0145817123743421,-0.068893915033369
0.08,-0.0165873721673463,-0.0786913960133616
0.09,-0.018579323787396,-0.0884842890011186
0.1,-0.0205964491055866,-0.0982746296847724
0.11,-0.0226849777186522,-0.108060201937455
0.12,-0.0248957454997335,-0.117833682001023
0.13,-0.0272817637530274,-0.127582172159548
0.14,-0.0298960894652768,-0.137287061549458
0.15,-0.0327899857489484,-0.146924157410838
0.16,-0.0360113603390356,-0.156464035447248
0.17,-0.0396034689318864,-0.165872563036565
0.18,-0.0436038692344864,-0.175111553829691
0.19,-0.048043610820417,-0.184139516794631
0.2,-0.052946645258437,-0.192912467017265
0.21,-0.0583294404855058,-0.201384769564229
0.22,-0.064200783032254,-0.209509991454653
0.23,-0.0705617514696039,-0.217241740282996
0.24,-0.0774058443246486,-0.224534471292005
0.25,-0.0847192457061832,-0.231344247719743
0.26,-0.0924812119796506,-0.237629442044805
0.27,-0.100664563031899,-0.243351368336182
0.28,-0.109236261962237,-0.248474838285777
0.29,-0.118158067422006,-0.2529686356693
0.3,-0.12738724329446,-0.256805905952169
0.31,-0.136877310954331,-0.259964459538123
0.32,-0.146578829966247,-0.262426988756488
0.33,-0.156440193767398,-0.264181200106446
0.34,-0.166408427626609,-0.265219864530205
0.35,-0.176429976973538,-0.265540789578665
0.36,-0.186451475042295,-0.265146718270058
0.37,-0.196420479667404,-0.264045160230959
0.38,-0.206286170001113,-0.262248161357245
0.39,-0.215999994883588,-0.259772018746778
0.4,-0.225516265585831,-0.256636948042953
0.41,-0.234792686653349,-0.252866710595723
0.42,-0.243790819600896,-0.248488208001301
0.43,-0.252476475239206,-0.243531051630398
0.44,-0.260820031447673,-0.238027114704644
0.45,-0.26879667423668,-0.232010074338694
0.46,-0.27638656096385,-0.225514950738463
0.47,-0.283574905574115,-0.218577650440976
0.48,-0.290351986718365,-0.211234520105387
0.49,-0.296713080563693,-0.20352191692489
0.5,-0.302658321034174,-0.19547580123248
0.51,-0.308192491108766,-0.187131356326771
0.52,-0.313324749646618,-0.178522639954409
0.53,-0.318068299003912,-0.169682271259978
0.54,-0.322439999444572,-0.1606411563597
0.55,-0.326459937023961,-0.151428255018646
0.56,-0.330150952234183,-0.142070390219637
0.57,-0.333538137236048,-0.132592101712476
0.58,-0.336648309960338,-0.123015543931634
0.59,-0.339509473733869,-0.113360427976006
0.6,-0.342150271368232,-0.103644006662834
0.61,-0.344599442835122,-0.0938811010063677
0.62,-0.346885295736145,-0.0840841658373375
0.63,-0.349035197750953,-0.074263391678708
0.64,-0.35107510010982,-0.0644268394336712
0.65,-0.353029100879482,-0.0545806039301921
0.66,-0.354919056468364,-0.0447290019098061
0.67,-0.356764249243482,-0.0348747796536794
0.68,-0.358581118500461,-0.0250193351132246
0.69,-0.360383061234442,-0.0151629491627791
0.7,-0.362180308217422,-0.00530502042502159
0.71,-0.36397987979086,0.00455570195710476
0.72,-0.365785624525467,0.0144208932081663
0.73,-0.367598342477128,0.0242924409499652
0.74,-0.369415993173091,0.0341722516206069
0.75,-0.371233986690029,0.0440620801775214
0.76,-0.373045554229645,0.0539633875013668
0.77,-0.374842192452188,0.0638772293081639
0.78,-0.376614173487886,0.0738041796285347
0.79,-0.378351110005031,0.0837442910185546
0.8,-0.380042561965419,0.0936970926194867
0.81,-0.381678668737309,0.103661625976544
0.82,-0.383250787057176,0.113636517152837
0.83,-0.384752111928471,0.123620082126819
0.84,-0.38617825391258,0.133610460732814
0.85,-0.38752774239837,0.14360577248767
0.86,-0.388802420326316,0.15360428553516
0.87,-0.390007691485396,0.163604587626505
0.88,-0.391152576889934,0.173605745533318
0.89,-0.392249531873518,0.18360743655136
0.9,-0.393313970402267,0.193610032792744
0.91,-0.394363437704162,0.203614615773716
0.92,-0.395416366629199,0.213622895377741
0.93,-0.396490347190855,0.223637003602485
0.94,-0.397599832487021,0.233659129577317
0.95,-0.398753197652329,0.243690958158196
0.96,-0.399949061647863,0.253732869962273
0.97,-0.401171774542805,0.263782855988222
0.98,-0.40238596547978,0.273835094973198
0.99,-0.403530038735751,0.283878136356482
1,-0.404508497187474,0.293892626146237
