xi,sx,sy,cx,cy,ex,ey,ne
0,-1.6798646844379e-26,-6.55218202424984e-27,0,0,-1.6798646844379e-26,-6.55218202424984e-27,1.80312402535452e-26
0.01,-0.00782760864363666,-0.0182457688287789,-0.00342281261344179,-0.00945081609464611,-0.00440479603019486,-0.00879495273413274,0.0098363317178331
0.02,-0.0158355792133144,-0.0354982557878778,-0.00694379182188385,-0.0188639514633845,-0.00889178739143059,-0.0166343043244933,0.0188617062689
0.03,-0.0240102977377008,-0.0517813983455479,-0.0105683350810262,-0.0282361467540608,-0.0134419626566746,-0.0235452515914871,0.0271120864665533
0.04,-0.0323381502454631,-0.0671191339700404,-0.0143022530494735,-0.0375637549424132,-0.0180358971959896,-0.0295553790276272,0.0346238937315117
0.05,-0.0408055227652688,-0.0815354001296065,-0.0181518062591194,-0.0468426847941776,-0.0226537165061493,-0.0346927153354289,0.0414339880881154
0.06,-0.0493988013257853,-0.0950541342924971,-0.0221237445856411,-0.0560683347561763,-0.0272750567401442,-0.0389857995363208,0.0475796309954615
0.07,-0.05810437195568,-0.107699273926964,-0.0262253493803106,-0.0652355154942685,-0.0318790225753694,-0.0424637584326951,0.0530984261592676
0.08,-0.0669086206836204,-0.119494756501257,-0.0304644779269728,-0.0743383589579529,-0.0364441427566477,-0.0451563975433041,0.0580282326144424
0.09,-0.0757979335382739,-0.130464519483629,-0.0348496095970565,-0.0833702114591435,-0.0409483239412174,-0.0470943080244851,0.0624070435279541
0.1,-0.0847586965483079,-0.140632500342329,-0.0393898926533295,-0.0923235078060636,-0.0453688038949784,-0.0483089925362657,0.0662728234401552
0.11,-0.0937772957423898,-0.15002263654561,-0.0440951900484252,-0.101189623039223,-0.0496821056939645,-0.0488330135063877,0.0696632961774083
0.12,-0.102840117149187,-0.158658865561723,-0.0489761217077184,-0.10995869779476,-0.0538639954414687,-0.0487001677669631,0.0726156756179333
0.13,-0.111933546797367,-0.166565124858918,-0.054044099585894,-0.118619432812695,-0.057889447211473,-0.0479456920462235,0.0751663321191158
0.14,-0.121043970715597,-0.173765351905447,-0.0593113501231957,-0.127158847691753,-0.0617326205924014,-0.0466065042136945,0.077350389011475
0.15,-0.130157774932545,-0.180283484169561,-0.0647909164512916,-0.135561998804738,-0.0653668584812533,-0.0447214853648233,0.0792012464607995
0.16,-0.139261345476878,-0.186143459119512,-0.0704966296328046,-0.143811651556327,-0.0687647158440731,-0.0423318075631843,0.0807500345305349
0.17,-0.148341068377263,-0.191369214223549,-0.0764430341727797,-0.151887903253786,-0.0718980342044832,-0.0394813109697636,0.0820250037388613
0.18,-0.157383329662368,-0.195984686949925,-0.0826452478511387,-0.159767755335384,-0.0747380818112292,-0.0362169316145407,0.0830508700038375
0.19,-0.16637451536086,-0.20001381476689,-0.0891187295398717,-0.167424638399996,-0.0772557858209887,-0.0325891763668947,0.0838481416555611
0.2,-0.175301011501407,-0.203480535142696,-0.0958789213068777,-0.174827901585965,-0.0794220901945297,-0.0286526335567316,0.0844324689950753
0.21,-0.184149204112677,-0.206408785545594,-0.102940723541581,-0.181942290900664,-0.0812084805710956,-0.0244664946449304,0.0848140712197948
0.22,-0.192905479223335,-0.208822503443835,-0.11031775582803,-0.188727460878101,-0.0825877233953053,-0.0200950425657344,0.0849973104947335
0.23,-0.201556222862051,-0.21074562630567,-0.118021355190372,-0.195137591987212,-0.0835348676716789,-0.0156080343184575,0.0849804968931758
0.24,-0.210087821057491,-0.21220209159935,-0.126059272711668,-0.201121222783474,-0.0840285483458228,-0.0110808688158758,0.0847560180212646
0.25,-0.218486659838323,-0.213215836793127,-0.134434057403548,-0.206621447879106,-0.0840526024347751,-0.00659438891402117,0.0843108886277906
0.26,-0.226740787060649,-0.213808940849222,-0.143141171997382,-0.211576671163978,-0.0835996150632669,-0.00223226968524409,0.0836294126888027
0.27,-0.234844897890315,-0.21399604870574,-0.152166976050529,-0.215922119729669,-0.0826779218397857,0.001926071023929,0.082700353743711
0.28,-0.242795349320598,-0.213789946794758,-0.161486834193798,-0.219592288914048,-0.0813085151268002,0.00580234211928937,0.0815152857211111
0.29,-0.25058849834478,-0.213203421548352,-0.171063737041048,-0.222524370476874,-0.0795247613037321,0.00932094892852173,0.0800691435532046
0.3,-0.258220701956139,-0.212249259398597,-0.18084790569846,-0.22466249691487,-0.0773727962576785,0.0124132375162723,0.07836222346493
0.31,-0.265688317147955,-0.21094024677757,-0.190777813557928,-0.225962342161968,-0.0749105035900271,0.0150220953843975,0.076401877580655
0.32,-0.272987700913508,-0.209289170117347,-0.200782842326445,-0.226395344758661,-0.0722048585870627,0.0171061746413139,0.0742035229247025
0.33,-0.280115210246077,-0.207308815850003,-0.210787406454012,-0.225951704321954,-0.0693278037920654,0.0186428884719511,0.0717906795427424
0.34,-0.287067202138942,-0.205011970407615,-0.220715951715848,-0.224641460174949,-0.0663512504230945,0.019629489767334,0.069193968676714
0.35,-0.293840033585383,-0.202411420222258,-0.230497948126109,-0.222493386742897,-0.0633420854592733,0.0200819665206389,0.0664492676382964
0.36,-0.300430061578678,-0.19951995172601,-0.240071999278387,-0.219551977394238,-0.0603580623002906,0.020032025668228,0.0635954222960923
0.37,-0.306833643112108,-0.196350351350945,-0.24938847861062,-0.215873211569629,-0.0574451645014872,0.0195228602186848,0.0606719786699036
0.38,-0.313047135178952,-0.192915405529139,-0.258410532031724,-0.211519954463124,-0.0546366031472281,0.0186045489339852,0.0577173080150551
0.39,-0.319066894772489,-0.189227900692669,-0.267113667626199,-0.206557720494332,-0.0519532271462906,0.0173298198016628,0.054767330273368
0.4,-0.324889278886,-0.185300623273611,-0.275484367581824,-0.201051256624093,-0.0494049113041763,0.0157506333504816,0.0518548716314565
0.41,-0.330510644512764,-0.181146359704041,-0.283518192832439,-0.195062109283091,-0.0469924516803247,0.0139157495790501,0.0490095766281906
0.42,-0.33592734864606,-0.176777896416035,-0.291217766499954,-0.1886471208624,-0.0447095821461061,0.0118692244463648,0.0462582449368498
0.43,-0.341135748279168,-0.172208019841668,-0.298590892352064,-0.18185768448259,-0.0425448559271039,0.0096496646409214,0.0436254603819866
0.44,-0.346132200405368,-0.167449516413017,-0.305648942352601,-0.174739551543735,-0.0404832580527668,0.00729003513071758,0.0411343991663183
0.45,-0.350913062017939,-0.162515172562158,-0.312405557095063,-0.167333003004952,-0.0385075049228757,0.00481783044279352,0.0388077237874215
0.46,-0.35547469011016,-0.157417774721167,-0.318875647509203,-0.159673233834497,-0.0365990426009572,0.00225545911332967,0.0366684744040243
0.47,-0.359813441675312,-0.15217010932212,-0.325074658635046,-0.151790842126518,-0.0347387830402667,-0.000379267195601662,0.0347408533390356
0.48,-0.363925673706674,-0.146784962797092,-0.331018047053508,-0.143712350855754,-0.0329076266531663,-0.00307261194133832,0.033050761505391
0.49,-0.367807743197525,-0.14127512157816,-0.336720924751716,-0.135460718180472,-0.0310868184458095,-0.00581440339768891,0.0316259002710402
0.5,-0.371456007141145,-0.135653372097401,-0.34219782824568,-0.12705581188767,-0.0292581788954656,-0.00859756020973079,0.0304952303457281
0.51,-0.374869732796812,-0.129930347842578,-0.347462579355332,-0.118514836557239,-0.0274071534414797,-0.011415511285339,0.0296894923781212
0.52,-0.378059828487794,-0.124108070524216,-0.352528211380027,-0.109852710076414,-0.0255316171077672,-0.0142553604478022,0.0292417300041293
0.53,-0.38104011280336,-0.118186408908528,-0.357406940793907,-0.101082390801159,-0.0236331720094529,-0.0171040181073692,0.0291731769721023
0.54,-0.383824404332776,-0.112165231761726,-0.3621101697552,-0.0922151591141508,-0.0217142345775754,-0.0199500726475753,0.0294875123049318
0.55,-0.386426521665309,-0.106044407850023,-0.366648508756273,-0.0832608582047623,-0.0197780129090359,-0.022783549645261,0.0301705142327416
0.56,-0.388860283390227,-0.0998238059396325,-0.371031811796405,-0.0742280991569446,-0.0178284715938219,-0.025595706782688,0.0311928614441999
0.57,-0.391139508096796,-0.0935032947967666,-0.375269218726847,-0.0651244352393058,-0.0158702893699491,-0.0283788595574608,0.0325150081419027
0.58,-0.393278014374285,-0.0870827431876382,-0.379369201074609,-0.0559565098740208,-0.0139088132996761,-0.0311262333136174,0.0340924843286463
0.59,-0.395289620811961,-0.0805620198784603,-0.383339608846808,-0.0467301822529101,-0.0119500119651526,-0.0338318376255502,0.0358803013238306
0.6,-0.397188145999089,-0.0739409936354456,-0.387187716670325,-0.0374506340474969,-0.0100004293287647,-0.0364903595879487,0.0378358947246846
0.61,-0.398987408524939,-0.067219533224807,-0.390920268223573,-0.0281224601663607,-0.00806714030136646,-0.0390970730584463,0.0399206697636628
0.62,-0.400701226978777,-0.0603975074127573,-0.394543518337491,-0.0187497460671606,-0.00615770864128556,-0.0416477613455968,0.0421005154459033
0.63,-0.40234341994987,-0.0534747849655093,-0.398063272432507,-0.00933613373911529,-0.00428014751736233,-0.044138651226394,0.0443456896987254
0.64,-0.403927806027485,-0.0464512346492758,-0.401484923154617,0.000115121865739114,-0.00244288287286831,-0.046566356515015,0.0466303896167942
0.65,-0.40546820380089,-0.0393267252302697,-0.40481348420411,0.00960110446135146,-0.000654719596780096,-0.0489278296916212,0.0489322100061166
0.66,-0.406978431859352,-0.0321011254747038,-0.408053621434384,0.0191191948676438,0.00107518957503211,-0.0512203203423475,0.0512316040017776
0.67,-0.408472308792138,-0.0247743041487908,-0.411209681349815,0.0286670352160511,0.00273737255767648,-0.0534413393648419,0.0535114002958969
0.68,-0.409963653188516,-0.0173461300187437,-0.414285717160845,0.0382424980448416,0.00432206397232915,-0.0555886280635853,0.0557563970049404
0.69,-0.411466283637752,-0.00981647185077522,-0.417285512568398,0.0478436595500798,0.00581922893064601,-0.057660131400855,0.0579530342476659
0.7,-0.412994018729113,-0.00218519841109816,-0.420212603453487,0.0574687763760641,0.00721858472437342,-0.0596539747871622,0.0600891393958205
0.71,-0.414560677051868,0.00554782153407465,-0.423070297645033,0.0671162654272805,0.00850962059316523,-0.0615684438932059,0.0621537362197194
0.72,-0.416180077195283,0.0133827192185304,-0.425861692931859,0.0767846862657141,0.00968161573657617,-0.0634019670471837,0.0641369090986063
0.73,-0.417866037748626,0.0213196258760562,-0.428589693475347,0.0864727257255211,0.0107236557267213,-0.0651530998494649,0.0660297146150094
0.74,-0.419632377301163,0.0293586727404393,-0.43125702476849,0.0961791844339527,0.0116246474673276,-0.0668205116935135,0.0678241344340097
0.75,-0.421492914442162,0.0374999910454668,-0.433866247275822,0.10590296497494,0.0123733328336598,-0.0684029739294736,0.0695130650152097
0.76,-0.423458035457773,0.0457487050569687,-0.436419768877482,0.11564306147153,0.0129617334197083,-0.0698943564145614,0.0710860576473989
0.77,-0.425524397421681,0.0541299111689457,-0.438919856229862,0.125398550396702,0.0133954588081815,-0.0712686392277562,0.0725165998517426
0.78,-0.427685225104451,0.0626736988074413,-0.441368645144975,0.135168582450123,0.013683420040524,-0.0724948836426815,0.073774956037746
0.79,-0.429933743276651,0.0714101573984988,-0.443768150081101,0.144952375361962,0.0138344068044507,-0.0735422179634627,0.0748321363761352
0.8,-0.432263176708847,0.0803693763681618,-0.446120272828423,0.154749207504783,0.0138570961195764,-0.0743798311366212,0.0756596219444656
0.81,-0.434666750171607,0.0895814451424737,-0.448426810465196,0.16455841221135,0.0137600602935896,-0.0749769670688766,0.076229160103799
0.82,-0.437137688435496,0.0990764531474778,-0.450689462652631,0.174379372710405,0.0135517742171342,-0.0753029195629273,0.0765126151633368
0.83,-0.439669216271083,0.108884489809218,-0.452909838329925,0.184211517604583,0.0132406220588415,-0.0753270277953653,0.0764818618300366
0.84,-0.442254558448934,0.119035644553737,-0.455089461864818,0.19405431682491,0.0128349034158845,-0.0750186722711724,0.0761087112952562
0.85,-0.444886939739615,0.129560006807079,-0.457229778709558,0.203907278005087,0.0123428389699428,-0.0743472711980082,0.0753648618948388
0.86,-0.447559584913694,0.140487665995287,-0.459332160607238,0.213769943226283,0.0117725756935438,-0.0732822772309954,0.074221868035106
0.87,-0.450265718741737,0.151848711544405,-0.461397910389042,0.223641886089531,0.0111321916473047,-0.0717931745451254,0.0726511225112122
0.88,-0.452998565994312,0.163673232880476,-0.463428266398938,0.233522709078384,0.0104297004046262,-0.069849476197908,0.0706238484908064
0.89,-0.455751351441984,0.175991319429544,-0.465424406578795,0.24341204117917,0.00967305513681121,-0.0674207217496261,0.0681110983388191
0.9,-0.458517299855322,0.188833060617651,-0.467387452243701,0.253309535730285,0.00887015238837996,-0.0644764751126343,0.0650837571621617
0.91,-0.461289636004891,0.202228545870842,-0.469318471574364,0.263214868475502,0.00802883556947354,-0.0609863226046597,0.0615125494955401
0.92,-0.464061584661258,0.21620786461516,-0.471218482850921,0.273127735799272,0.00715689818966292,-0.0569198711841118,0.0573680479649873
0.93,-0.466826370594991,0.230801106276648,-0.473088457450148,0.283047853124694,0.00626208685515672,-0.0522467468480465,0.0526206830817064
0.94,-0.469577218576657,0.24603836028135,-0.474929322625988,0.292974953457074,0.0053521040493319,-0.0469365931757249,0.0472407535576897
0.95,-0.472307353376821,0.261949716055309,-0.476741964091458,0.302908786058007,0.00443461071463697,-0.0409590700026984,0.0411984367139861
0.96,-0.475009999766051,0.278565263024568,-0.478527228418296,0.312849115236667,0.00351722865224463,-0.0342838522120982,0.0344637986863485
0.97,-0.477678382514914,0.295915090615172,-0.480285925269231,0.322795719246486,0.00260754275431641,-0.0268806286313135,0.0270068042320853
0.98,-0.480305726393977,0.314029288253164,-0.48201882947637,0.332748389276751,0.00171310308239309,-0.0187191010235874,0.0187973260146803
0.99,-0.482885256173806,0.332937945364587,-0.483726682977998,0.342706928529794,0.00084142680419208,-0.00976898316520686,0.00980515329553332
1,-0.485410196624968,0.352671151375484,-0.485410196624968,0.352671151375484,5.55111512312578e-17,5.55111512312578e-17,7.85046229341888e-17
