xi,s1,s2
0,-2.83047053112562e-28,5.52234246360123e-27
0.01,0.00906534114768764,-0.0407239642869761
0.02,0.0179795932837048,-0.0695753246676204
0.03,0.0286457887770544,-0.0908264464731644
0.04,0.0412605300136561,-0.106344850540081
0.05,0.0552600010572539,-0.117011323289183
0.06,0.0698511520130825,-0.123406365006061
0.07,0.0842827193503154,-0.126082516561139
0.08,0.0979618824343683,-0.125628072078426
0.09,0.110485527100427,-0.122645164687168
0.1,0.121628517417865,-0.117707698908785
0.11,0.131313293004284,-0.111327590881361
0.12,0.139573737500603,-0.103936760944587
0.13,0.14651983054382,-0.0958827972562917
0.14,0.152306343589267,-0.0874337118752046
0.15,0.157107193277504,-0.0787877513095737
0.16,0.161096038668345,-0.0700853456012274
0.17,0.164432976525289,-0.0614212492977682
0.18,0.167256687506032,-0.0528556852261599
0.19,0.169681082743459,-0.0444238709959219
0.2,0.171795362860262,-0.0361437139625113
0.21,0.173666397924141,-0.0280217283078557
0.22,0.175342435194411,-0.0200573832820043
0.23,0.176857309709891,-0.0122461598341068
0.24,0.178234538800346,-0.00458159917675172
0.25,0.179490893694189,0.002943403560777
0.26,0.180639230949151,0.0103358515626418
0.27,0.181690516587148,0.0176022784248346
0.28,0.182655084481713,0.0247486313637577
0.29,0.183543242171541,0.0317803081551882
0.3,0.184365377217352,0.0387022764323647
0.31,0.185131730871445,0.045519225140394
0.32,0.185851998579998,0.0522357148021527
0.33,0.186534894077378,0.0588563063279814
0.34,0.187187780949572,0.0653856579273636
0.35,0.187816437929967,0.0718285867850421
0.36,0.188424987204692,0.0781900970746328
0.37,0.189015983547039,0.0844753791027396
0.38,0.189590639150736,0.0906897863044473
0.39,0.190149144852572,0.0968387976977079
0.4,0.190691041936457,0.102927973426911
0.41,0.191215598585876,0.108962910350299
0.42,0.191722149984102,0.114949203416953
0.43,0.192210369735497,0.120892417001801
0.44,0.192680451380962,0.12679806858663
0.45,0.193133190990047,0.132671625356342
0.46,0.193569973815714,0.138518512587839
0.47,0.193992678485099,0.144344131308071
0.48,0.194403519965287,0.150153881738128
0.49,0.19480485687891,0.155953188604099
0.5,0.195198989732223,0.161747524457962
0.51,0.195587974782604,0.167542427627817
0.52,0.19597347421917,0.173343512210234
0.53,0.196356657668977,0.179156468531692
0.54,0.196738163381902,0.18498705364432
0.55,0.197118120399454,0.190841072586797
0.56,0.197496226186168,0.196724352237601
0.57,0.197871868206629,0.202642710518221
0.58,0.198244273374053,0.208601924372034
0.59,0.198612666738399,0.214607700262066
0.6,0.198976420529476,0.220665650852134
0.61,0.19933517657531,0.226781281092094
0.62,0.199688928743981,0.23295998619835
0.63,0.20003805691415,0.239207063094903
0.64,0.200383309567978,0.245527735847927
0.65,0.200725737922563,0.251927194578265
0.66,0.201066590074865,0.258410646361277
0.67,0.201407178432813,0.264983375812111
0.68,0.201748737244306,0.271650812496796
0.69,0.20209228882019,0.278418602095248
0.7,0.202438536621051,0.285292678454749
0.71,0.202787800533061,0.292279334355618
0.72,0.203140004686899,0.299385289929264
0.73,0.203494721720044,0.306617759130997
0.74,0.203851270175352,0.313984516371078
0.75,0.204208854501919,0.321493967241664
0.76,0.204566730612073,0.329155229138743
0.77,0.204924374885285,0.336978229361145
0.78,0.205281631629994,0.34497382986733
0.79,0.205638814052178,0.35315398917926
0.8,0.205996737466543,0.361531972837283
0.81,0.206356671470899,0.370122624288245
0.82,0.206720210142074,0.378942708526095
0.83,0.207089074716321,0.388011342585332
0.84,0.207464879337415,0.397350532283929
0.85,0.207848904651349,0.406985845808127
0.86,0.208241933635272,0.416947274227643
0.87,0.208644206407382,0.427270359227293
0.88,0.209055543210999,0.437997711640958
0.89,0.209475664637407,0.449181103177164
0.9,0.209904702785503,0.460884390435454
0.91,0.210343843864109,0.473187628572513
0.92,0.210795971987033,0.486192902662821
0.93,0.211266119293264,0.500033087265158
0.94,0.211761552512247,0.514887368839869
0.95,0.212291577412614,0.531014244034413
0.96,0.212867773308535,0.548826423195865
0.97,0.213506534516976,0.569055231030654
0.98,0.214237648952566,0.593087313778564
0.99,0.215125340505461,0.623606343264914
1,0.216311896062463,0.665739561406607
