xi,s1,s2
0,0,0
0.01,-0.00127356202463347,-0.0100191975430526
0.02,-0.00256672373512666,-0.0200343437758957
0.03,-0.00388009872730381,-0.0300453188303339
0.04,-0.00521432960346893,-0.0400519951206518
0.05,-0.00657008981183891,-0.0500542367153332
0.06,-0.00794808563255532,-0.0600518986466971
0.07,-0.00934905832434825,-0.07004482615121
0.08,-0.0107737864475093,-0.0800328538322637
0.09,-0.0122230883806109,-0.0900158047360731
0.1,-0.0136978250504288,-0.0999934893300613
0.11,-0.0151989028968038,-0.109965704371581
0.12,-0.016727277096768,-0.119932231653081
0.13,-0.0182839550751996,-0.129892836607787
0.14,-0.0198700003326121,-0.139847266757591
0.15,-0.0214865366244954,-0.149795249982079
0.16,-0.0231347525309737,-0.15973649258434
0.17,-0.0248159064605178,-0.169670677125423
0.18,-0.0265313321371457,-0.179597459994737
0.19,-0.0282824446270797,-0.189516468678403
0.2,-0.0300707469683382,-0.199427298681219
0.21,-0.0318978374753901,-0.209329510050373
0.22,-0.0337654178009674,-0.219222623440093
0.23,-0.0356753018486525,-0.229106115645653
0.24,-0.0376294256431762,-0.238979414522295
0.25,-0.0396298582807997,-0.248841893189087
0.26,-0.0416788141000553,-0.25869286339896
0.27,-0.0437786662339129,-0.268531567933431
0.28,-0.045931961728606,-0.278357171852775
0.29,-0.0481414384424624,-0.288168752398535
0.3,-0.0504100439707905,-0.297965287303745
0.31,-0.0527409568809137,-0.307745641215
0.32,-0.055137610585663,-0.317508549867275
0.33,-0.0576037202349379,-0.327252601573783
0.34,-0.0601433130642996,-0.336976215495202
0.35,-0.0627607627079297,-0.34667761602991
0.36,-0.0654608280615205,-0.356354802512632
0.37,-0.0682486973693188,-0.366005513214132
0.38,-0.0711300383085547,-0.37562718238763
0.39,-0.0741110549526692,-0.38521688879326
0.4,-0.0771985526089028,-0.394771293730143
0.41,-0.0804000116393666,-0.404286566090492
0.42,-0.083723671475481,-0.413758291287546
0.43,-0.0871786261022547,-0.423181360054912
0.44,-0.0907749322849394,-0.43254983201221
0.45,-0.0945237316757545,-0.441856767468872
0.46,-0.0984373875737245,-0.451094019105543
0.47,-0.102529636356025,-0.460251972826359
0.48,-0.106815752197599,-0.469319224102064
0.49,-0.111312721238846,-0.478282172424074
0.5,-0.116039417207476,-0.487124512028011
0.51,-0.121016763658608,-0.495826591960605
0.52,-0.126267856970078,-0.50436461338859
0.53,-0.131818006843718,-0.512709628128821
0.54,-0.137694624363995,-0.520826302644715
0.55,-0.143926848132863,-0.528671422031317
0.56,-0.150544743675993,-0.536192139552799
0.57,-0.157577841093122,-0.543324047331052
0.58,-0.165052703162069,-0.54998928007098
0.59,-0.172989179097766,-0.556095098167846
0.6,-0.181395082676262,-0.56153374410881
0.61,-0.190259380049961,-0.566184768387535
0.62,-0.199544736757559,-0.569921251136891
0.63,-0.209181439567892,-0.572620942341315
0.64,-0.219065773632097,-0.574181791106478
0.65,-0.229065787916671,-0.574538709503167
0.66,-0.239035037771577,-0.57367613071971
0.67,-0.248831016757979,-0.57163123155718
0.68,-0.25833227593123,-0.568486377082872
0.69,-0.267449015960553,-0.564354090349738
0.7,-0.276125520260793,-0.559360237861957
0.71,-0.284336271283038,-0.553630108172419
0.72,-0.292078974397749,-0.547279372280688
0.73,-0.299367199791015,-0.540409650874678
0.74,-0.306224141541886,-0.533107383819312
0.75,-0.312677968575367,-0.525444625937931
0.76,-0.318758665756352,-0.51748073736746
0.77,-0.324496046539637,-0.509264331772899
0.78,-0.329918599294128,-0.500835147313022
0.79,-0.335052888441026,-0.492225695278304
0.8,-0.339923305995264,-0.483462646214873
0.81,-0.34455203372612,-0.474567964373149
0.82,-0.348959124683585,-0.465559821998196
0.83,-0.353162646597515,-0.4564533301233
0.84,-0.357178852075813,-0.447261120549578
0.85,-0.36102235495549,-0.437993809010428
0.86,-0.364706301225419,-0.428660364277965
0.87,-0.368242528514573,-0.419268403107816
0.88,-0.371641711490281,-0.409824426770431
0.89,-0.374913492466769,-0.400334011529034
0.9,-0.378066597617365,-0.390801962725478
0.91,-0.381108939751542,-0.381232440016312
0.92,-0.384047708871718,-0.371629059651121
0.93,-0.386889451795737,-0.361994978405187
0.94,-0.389640142099886,-0.352332962787012
0.95,-0.392305241553048,-0.34264544637282
0.96,-0.394889754104617,-0.332934577523614
0.97,-0.397398273373821,-0.323202259275979
0.98,-0.399835024475933,-0.313450182835241
0.99,-0.402203900916187,-0.303679855815347
1,-0.404508497187474,-0.293892626146236
