x,y,z
-0.145527,0.215876,-0.496883
0.143191,0.21396,-0.498886
0.148213,-0.216154,-0.505687
-0.151874,-0.21747,-0.505222
-0.220997,0.152942,0.498245
0.221707,0.146827,0.497764
0.221146,-0.153428,0.495028
-0.221017,-0.146847,0.496931
