xi,sx,sy,cx,cy,ex,ey,ne
0,2.83365242332013e-27,-1.30743628970261e-26,0,0,2.83365242332013e-27,-1.30743628970261e-26,1.33779128125175e-26
0.01,-0.027827018857925,-0.0258715087348011,-0.00699230073243948,-0.00721849583172623,-0.0208347181254856,-0.0186530129030749,0.027964627115889
0.02,-0.0503901202033025,-0.0443188410018463,-0.0141402597641322,-0.0142813053557207,-0.0362498604391703,-0.0300375356461256,0.047077658496909
0.03,-0.0696021865915548,-0.0579556299624317,-0.0214472678486451,-0.0211778506937221,-0.0481549187429098,-0.0367777792687096,0.0605929141655538
0.04,-0.086627727637211,-0.0683838614728454,-0.0289164305063412,-0.0278968473908022,-0.0577112971308698,-0.0404870140820432,0.0704967525905066
0.05,-0.102163672229405,-0.0765738146704124,-0.0365504891304795,-0.0344262874681688,-0.0656131830989254,-0.0421475272022437,0.077983997368928
0.06,-0.11662349842897,-0.0831130609602881,-0.0443517316322165,-0.0407534314516893,-0.0722717667967537,-0.0423596295085988,0.0837707973462716
0.07,-0.130253901668721,-0.0883640743944102,-0.0523218924988493,-0.0468648120565311,-0.0779320091698717,-0.0414992623378792,0.0882926204608351
0.08,-0.143205935893438,-0.0925601693586503,-0.0604620425836661,-0.0527462525675874,-0.0827438933097724,-0.039813916791063,0.0918242879106867
0.09,-0.155576627033009,-0.0958614452586309,-0.068772469539711,-0.0583829032590241,-0.0868041574932984,-0.0374785419996068,0.0945494731267057
0.1,-0.167432317944675,-0.0983859988525733,-0.0772525505673405,-0.0637592993933611,-0.0901797673773342,-0.0346266994592122,0.0965991654191107
0.11,-0.178821322932037,-0.100226679354576,-0.0859006200680917,-0.0688594443667233,-0.0929207028639451,-0.0313672349878523,0.0980722205903013
0.12,-0.189780712392973,-0.101459925757552,-0.0947138358673549,-0.0736669213468956,-0.0950668765256181,-0.0277930044106567,0.0990462624560256
0.13,-0.20034007830948,-0.102150556335379,-0.103688048840833,-0.0781650362035662,-0.096652029468647,-0.023985520131813,0.0995837334929847
0.14,-0.21052381341335,-0.102354593312226,-0.112817681975802,-0.0823369935788433,-0.0977061314375485,-0.0200175997333826,0.0997356125943859
0.15,-0.220352635186057,-0.102121117567313,-0.122095626000018,-0.0861661065329458,-0.0982570091860393,-0.0159550110343673,0.0995439713457937
0.16,-0.229844664631078,-0.10149357532012,-0.131513159563269,-0.0896360383052655,-0.0983315050678091,-0.0118575370148541,0.0990438593399874
0.17,-0.239016193964901,-0.10051071833436,-0.141059902375183,-0.0927310723946896,-0.0979562915897184,-0.0077796459396708,0.0982647340247587
0.18,-0.247882222184899,-0.0992072824094422,-0.15072380949634,-0.0954364045041843,-0.0971584126885593,-0.00377087790525785,0.0972315621407821
0.19,-0.256456818507812,-0.0976144816209681,-0.160491213980426,-0.0977384471225526,-0.0959656045273851,0.000123965501584541,0.0959656845948179
0.2,-0.264753360970889,-0.0957603773607573,-0.17034692317043,-0.0996251349268129,-0.0944064378004592,0.00386475756605557,0.0944855113190184
0.21,-0.2727846868431,-0.0936701659819107,-0.180274371166257,-0.101086217138691,-0.0925103156768424,0.0074160511567799,0.092807091977871
0.22,-0.280563182605919,-0.0913664163284666,-0.190255826449339,-0.102113521827503,-0.0903073561565806,0.0107471054990365,0.0909445922119557
0.23,-0.288100833972356,-0.0888692783647919,-0.200272649667548,-0.102701177233307,-0.0878281843048079,0.0138318988685147,0.0889106933084436
0.24,-0.29540925055949,-0.0861966762602986,-0.210305592576044,-0.102845776673729,-0.0851036579834459,0.0166491004134302,0.0867169253764213
0.25,-0.302499675254681,-0.0833644933736391,-0.220335125593461,-0.10254647649062,-0.0821645496612206,0.0191819831169806,0.0843739396812269
0.26,-0.309382984859204,-0.0803867523604687,-0.230341778851774,-0.101805020565069,-0.0790412060074297,0.0214182682045999,0.0818917240018375
0.27,-0.316069686096144,-0.0772757908434441,-0.24030648036784,-0.100625689757099,-0.0757632057283037,0.0233498989136545,0.0792797648931123
0.28,-0.322569909372406,-0.0740424314756043,-0.250210875233022,-0.0990151796495559,-0.072359034139384,0.0249727481739516,0.0765471617562934
0.29,-0.328893401628402,-0.0706961445419304,-0.260037611463949,-0.0969824145986308,-0.0688557901644526,0.0262862700567004,0.0737026989510216
0.3,-0.33504951903389,-0.0672452012219652,-0.269770581121611,-0.0945383097934189,-0.0652789379122786,0.0272931085714536,0.0707548832975384
0.31,-0.341047220035526,-0.0636968160226479,-0.279395109064175,-0.0916954954445114,-0.0616521109713508,0.0279986794218635,0.0677119549015684
0.32,-0.346895059178378,-0.0600572774396779,-0.288898085752103,-0.0884680182101138,-0.0579969734262746,0.0284107407704359,0.0645818791746796
0.33,-0.352601182093475,-0.05633206643286,-0.298268044391836,-0.0848710345943351,-0.0543331377016392,0.0285389681614751,0.0613723272837765
0.34,-0.358173322015821,-0.0525259627308686,-0.307495186001972,-0.0809205095542079,-0.0506781360138491,0.0283945468233393,0.0580906512198047
0.35,-0.363618798163227,-0.0486431393087792,-0.316571358469622,-0.0766329312713631,-0.0470474396936055,0.0279897919625839,0.0547438584302584
0.36,-0.3689445162663,-0.044687245617685,-0.325489997241377,-0.0720250503529471,-0.0434545190249223,0.0273378047352621,0.0513385896907059
0.37,-0.374156971494532,-0.0406614803006978,-0.334246036000366,-0.0671136489642636,-0.0399109354941664,0.0264521686635658,0.0478811027340144
0.38,-0.379262253973568,-0.03656865421463,-0.34283579564839,-0.0619153428301431,-0.0364264583251783,0.0253466886155131,0.0443772632086267
0.39,-0.384266057035063,-0.0324112446026278,-0.351256859320478,-0.0564464168505733,-0.033009197714585,0.0240351722479456,0.0408325438682062
0.4,-0.389173688283916,-0.0281914412409729,-0.359507940200202,-0.0507226933482632,-0.0296657480837147,0.0225312521072904,0.037252032573924
0.41,-0.393990083508803,-0.0239111853241606,-0.367588747753637,-0.0447594307182923,-0.0264013357551661,0.0208482453941317,0.0336404498434689
0.42,-0.398719823401582,-0.0195722017671829,-0.375499856800652,-0.038571249447469,-0.0232199666009307,0.0189990476802861,0.0300021776160685
0.43,-0.403367152990166,-0.0151760255036762,-0.383242582698387,-0.0321720820470666,-0.0201245702917791,0.0169960565433903,0.0263413034501879
0.44,-0.407936003628487,-0.0107240222542146,-0.390818864889647,-0.0255751433175249,-0.0171171387388395,0.0148511210633103,0.0226616909219453
0.45,-0.412430017327094,-0.00621740414151395,-0.398231160202938,-0.0187929174575648,-0.0141988571241562,0.0125755133160508,0.0189671051769734
0.46,-0.416852573149449,-0.00165724044932451,-0.405482346591306,-0.0118371587710353,-0.0113702265581424,0.0101799183217108,0.0152614805644862
0.47,-0.421206815343042,0.00295553623243609,-0.412575637457467,-0.00471890305298064,-0.00863117788557499,0.00767443928541672,0.0115496428532655
0.48,-0.42549568282225,0.00762012825998099,-0.419514506316361,0.00255151289449604,-0.0059811765058887,0.00506861536548495,0.0078399830432103
0.49,-0.429721939572826,0.0123358753701926,-0.42630262127193,0.00996442578963075,-0.00341931830089631,0.00237144958056181,0.00416119102613558
0.5,-0.433888205507664,0.0171022610627198,-0.432943788609681,0.0175108162538584,-0.000944416897982803,-0.000408555191138572,0.00102899981603581
0.51,-0.437996987271445,0.0219189226594149,-0.43944190470904,0.0251822765309526,0.00144491743759539,-0.00326335387153774,0.00356893049699033
0.52,-0.442050708469641,0.0267856647238924,-0.445800915440191,0.0329709767287141,0.00375020697055056,-0.0061853120048217,0.00723340424136226
0.53,-0.446051738786512,0.0317024754701283,-0.452024782212925,0.0408696305143671,0.00597304342641281,-0.00916715504423871,0.0109413883661501
0.54,-0.450002421458871,0.0366695457328619,-0.45811745387668,0.048871460978577,0.00811503241780875,-0.0122019152457151,0.0146540263001573
0.55,-0.453905098588957,0.0416872900187125,-0.46408284372116,0.0569701672030778,0.0101777451322029,-0.0152828771843653,0.0183617218966107
0.56,-0.457762133812338,0.0467563691099656,-0.469924810887734,0.0651598919196634,0.0121626770753969,-0.0184035228096978,0.0220594733719428
0.57,-0.461575931886909,0.0518777136574958,-0.475647145567619,0.0734351905296883,0.0140712136807102,-0.0215574768721925,0.0257434236950589
0.58,-0.465348954838267,0.0570525481798741,-0.481253557429353,0.0817910016590851,0.0159046025910859,-0.024738453479211,0.0294099891894483
0.59,-0.469083734386632,0.0622824148869379,-0.486747666782763,0.0902226193503733,0.0176639323961311,-0.0279402044634354,0.0330555522288415
0.6,-0.472782880492448,0.0675691967725137,-0.49213299804749,0.0987256669366146,0.0193501175550418,-0.0311564701641009,0.0366763231864979
0.61,-0.476449085992418,0.072915139476505,-0.497412975150379,0.107296072599657,0.020963889157961,-0.0343809331231524,0.0402682655579546
0.62,-0.480085127452246,0.0783228715030715,-0.502590918526999,0.115930046583607,0.0225057910747535,-0.0376071750805353,0.0438270492896623
0.63,-0.48369386253052,0.0837954224986265,-0.507670043448219,0.12462406001197,0.0239761809176989,-0.0408286375133432,0.0473480188877444
0.64,-0.487278224322019,0.0893362394394139,-0.51265345943321,0.133374825241467,0.0253752351111911,-0.0440385858020527,0.0508261703888162
0.65,-0.490841213320239,0.0949492007519098,-0.517544170545787,0.142179277675511,0.0267029572255479,-0.0472300769236014,0.05425613413061
0.66,-0.494385887800051,0.100638628588634,-0.522345076401945,0.151034558954564,0.0279591886018936,-0.0503959303659302,0.0576321613747389
0.67,-0.49791535356407,0.106409299705576,-0.527058973743348,0.159938001437948,0.0291436201792776,-0.0535287017323719,0.0609481132300847
0.68,-0.501432754112449,0.112266455633749,-0.531688558454658,0.168887113891455,0.0302558043422082,-0.0566206582577061,0.064197450400541
0.69,-0.504941262377349,0.118215813104789,-0.536236427922469,0.177879568296546,0.0312951655451198,-0.0596637551917571,0.0673732222034717
0.7,-0.508444075202254,0.124263575977447,-0.540705083650623,0.18691318769961,0.0322610084483689,-0.0626496117221634,0.0704680531520742
0.71,-0.511944411734493,0.130416450216667,-0.545096934061148,0.195985935023268,0.0331525223266548,-0.065569484806601,0.0734741252035193
0.72,-0.515445516828772,0.136681663798156,-0.549414297422398,0.20509590276573,0.0339687805936257,-0.0684142389675741,0.0763831535649728
0.73,-0.518950670422073,0.143066993747282,-0.553659404856328,0.214241303518543,0.0347087344342549,-0.0711743097712602,0.0791863537324642
0.74,-0.522463203628438,0.149580802870817,-0.557834403385713,0.223420461237524,0.0353711997572754,-0.0738396583667072,0.0818743972190398
0.75,-0.525986522014664,0.156232089111224,-0.561941358989458,0.232631803206142,0.0359548369747941,-0.0763997140949182,0.0844373532014668
0.76,-0.529524136185152,0.163030550895789,-0.56598225964042,0.241873852634971,0.0364581234552679,-0.0788433017391826,0.0868646130194301
0.77,-0.533079699504745,0.169986672481903,-0.569959018305367,0.251145221845071,0.0368793188006217,-0.0811585493631684,0.0891447939586588
0.78,-0.536657052627974,0.177111834266646,-0.573873475891026,0.260444605987197,0.0372164232630521,-0.0833327717205507,0.091265617858666
0.79,-0.540260274592237,0.184418454490965,-0.577727404123853,0.269770777252519,0.0374671295316166,-0.0853523227615539,0.0932137586203421
0.8,-0.543893740681581,0.191920170884431,-0.581522508354123,0.279122579534169,0.0376287676725415,-0.0872024086497381,0.0949746504645846
0.81,-0.547562188187772,0.199632073723606,-0.585260430277465,0.28849892350222,0.0376982420896929,-0.0888668497786149,0.0965322456292611
0.82,-0.551270792696694,0.20757100567361,-0.588942750569005,0.297898782057867,0.037671957872311,-0.090327776384257,0.0978687059097928
0.83,-0.55502525972172,0.215755948806467,-0.592570991426963,0.307321186135411,0.037545731705243,-0.0915652373289439,0.0989640068731451
0.84,-0.558831939501952,0.224208525499278,-0.596146619023952,0.316765220823352,0.0373146795220005,-0.0925566953240743,0.0997954265342011
0.85,-0.562697976692971,0.232953647668215,-0.599671045865291,0.326230021778286,0.0369730691723194,-0.0932763741100707,0.10033688160962
0.86,-0.566631511611643,0.242020358148802,-0.603145633054606,0.335714771907608,0.0365141214429627,-0.0936944137588057,0.100558063994678
0.87,-0.57064195576525,0.251442919147623,-0.606571692467659,0.345218698299029,0.0359297367024087,-0.093775779151406,0.100423317685474
0.88,-0.574740371767661,0.261262215965498,-0.609950488835919,0.354741069376838,0.0352101170682576,-0.0934788534113404,0.0998901815948858
0.89,-0.578939998196563,0.271527566732341,-0.613283241741851,0.36428119226654,0.0343432435452881,-0.0927536255341997,0.0989074993463565
0.9,-0.583256985847781,0.282299112024588,-0.616571127528206,0.373838410351093,0.0333141416804257,-0.0915392983265055,0.0974129107152253
0.91,-0.587711487956309,0.293651246716373,-0.619815281123843,0.383412101003389,0.0321037931675338,-0.0897608542870167,0.0953292426177762
0.92,-0.592329424679507,0.305678264444314,-0.623016797788812,0.393001673480954,0.0306873731093048,-0.0873234090366397,0.0925585902773479
0.93,-0.597145577074068,0.318504744359165,-0.626176734781516,0.402606566970018,0.0290311577074486,-0.0841018226108527,0.0889714824216281
0.94,-0.602209213839985,0.332305453350067,-0.629296112950866,0.41222624876722,0.0270868991108808,-0.0799207954171531,0.0843862171420989
0.95,-0.607594271149818,0.347342897627063,-0.63237591825634,0.421860212588187,0.0247816471065215,-0.0745173149611238,0.0785299959399432
0.96,-0.61341724782859,0.364035368403258,-0.6354171032189,0.431507976993141,0.0219998553903108,-0.0674726085898829,0.0709686307259632
0.97,-0.61986750089674,0.383074620397918,-0.638420588305659,0.441169083920524,0.0185530874089194,-0.0580944635226057,0.060985110841765
0.98,-0.627256585934055,0.405620431954268,-0.641387263251155,0.45084309732037,0.0141306773171002,-0.0452226653661018,0.0473789563440821
0.99,-0.63609573876463,0.433609454699097,-0.644317988318047,0.460529601879839,0.00822224955341677,-0.0269201471807413,0.028147818955497
1,-0.647213595499958,0.470228201833979,-0.647213595499947,0.470228201833974,-1.0769163338864e-14,4.94049245958195e-15,1.18483477650818e-14
