xi,s1,s2
0,0,0
0.01,-0.00984741288924258,0.00246921842343925
0.02,-0.0196705659197588,0.00503476076698469
0.03,-0.0294686633080839,0.0076959050880957
0.04,-0.0392409296223771,0.0104519102957397
0.05,-0.0489866101100075,0.0133020170948342
0.06,-0.0587049709843576,0.0162454489354113
0.07,-0.0683952996713302,0.0192814129641087
0.08,-0.078056905016183,0.0224091009756691
0.09,-0.0876891174514194,0.0256276903622048
0.1,-0.0972912891265851,0.0289363450580919
0.11,-0.106862794000911,0.0323342164784393
0.12,-0.116403027899838,0.0358204444491904
0.13,-0.125911408536546,0.0393941581270176
0.14,-0.135387375499669,0.0430544769072804
0.15,-0.144830390208461,0.04680051131843
0.16,-0.154239935836717,0.0506313639013582
0.17,-0.163615517206803,0.054546130072303
0.18,-0.172956660655205,0.0585438989680361
0.19,-0.182262913870998,0.0626237542721806
0.2,-0.191533845708704,0.0667847750216061
0.21,-0.200769045976987,0.0710260363919787
0.22,-0.209968125204656,0.0753466104616389
0.23,-0.219130714385447,0.0797455669530944
0.24,-0.228256464703047,0.0842219739515186
0.25,-0.237345047237803,0.0887748985997431
0.26,-0.246396152656561,0.0934034077693372
0.27,-0.255409490887041,0.0981065687074487
0.28,-0.264384790778126,0.102883449659181
0.29,-0.273321799747437,0.107733120465356
0.3,-0.282220283417486,0.112654653135603
0.31,-0.291080025241721,0.117647122396771
0.32,-0.29990082612167,0.122709606216758
0.33,-0.308682504016414,0.127841186303885
0.34,-0.317424893545515,0.133040948582039
0.35,-0.326127845586526,0.138307983641823
0.36,-0.33479122686813,0.143641387168052
0.37,-0.343414919559926,0.149040260343927
0.38,-0.351998820859813,0.154503710232315
0.39,-0.360542842579903,0.160030850134554
0.4,-0.369046910731795,0.16562079992727
0.41,-0.377510965112059,0.1712726863777
0.42,-0.385934958888661,0.17698564343806
0.43,-0.394318858189061,0.182758812519505
0.44,-0.402662641690655,0.188591342746254
0.45,-0.410966300214164,0.194482391190459
0.46,-0.419229836320569,0.200431123088433
0.47,-0.427453263912099,0.206436712038829
0.48,-0.435636607837777,0.212498340183397
0.49,-0.443779903503966,0.218615198370934
0.5,-0.451883196490312,0.224786486305042
0.51,-0.459946542171462,0.231011412676335
0.52,-0.467970005344886,0.237289195279693
0.53,-0.47595365986509,0.243619061117188
0.54,-0.483897588284486,0.250000246487291
0.55,-0.491801881501149,0.256431997060966
0.56,-0.499666638413652,0.262913567945227
0.57,-0.507491965583159,0.269444223734772
0.58,-0.515277976902899,0.276023238552234
0.59,-0.523024793275163,0.282649896077638
0.6,-0.530732542295883,0.289323489567588
0.61,-0.538401357946893,0.296043321864744
0.62,-0.546031380295897,0.30280870539809
0.63,-0.553622755204177,0.309618962174509
0.64,-0.561175634042061,0.31647342376216
0.65,-0.568690173412123,0.323371431266126
0.66,-0.576166534880108,0.330312335296805
0.67,-0.583604884713539,0.33729549593148
0.68,-0.591005393627947,0.344320282669511
0.69,-0.598368236540667,0.351386074381551
0.7,-0.60569359233213,0.358492259253203
0.71,-0.612981643614547,0.365638234723484
0.72,-0.620232576507916,0.372823407418481
0.73,-0.627446580423225,0.380047193080553
0.74,-0.634623847852765,0.387309016493401
0.75,-0.641764574167413,0.394608311403356
0.76,-0.648868957420781,0.401944520437181
0.77,-0.655937198160103,0.409317095016684
0.78,-0.662969499243713,0.416725495270433
0.79,-0.669966065665001,0.424169189942838
0.8,-0.676927104382694,0.431647656300856
0.81,-0.683852824157334,0.439160380038562
0.82,-0.690743435393797,0.446706855179828
0.83,-0.697599149989722,0.454286583979319
0.84,-0.704420181189704,0.461899076822015
0.85,-0.711206743445101,0.469543852121465
0.86,-0.71795905227931,0.477220436216955
0.87,-0.724677324158381,0.484928363269759
0.88,-0.731361776366802,0.492667175158653
0.89,-0.738012626888331,0.500436421374841
0.9,-0.744630094291725,0.508235658916435
0.91,-0.751214397621223,0.516064452182643
0.92,-0.757765756291649,0.523922372867778
0.93,-0.764284389987991,0.531808999855223
0.94,-0.770770518569321,0.539723919111457
0.95,-0.777224361976933,0.547666723580255
0.96,-0.783646140146544,0.555637013077161
0.97,-0.790036072924456,0.563634394184316
0.98,-0.796394379987525,0.571658480145749
0.99,-0.802721280766837,0.579708890763187
1,-0.809016994374947,0.587785252292473
