xi,s1,s2
0,0,0
0.01,-0.00398527645065169,-0.00932420767982078
0.02,-0.00801062471855411,-0.0186296442114537
0.03,-0.0120767916678916,-0.027915774883104
0.04,-0.0161845425066783,-0.0371820437286331
0.05,-0.0203346612564669,-0.0464278725228547
0.06,-0.0245279512276781,-0.0556526597235463
0.07,-0.0287652354996098,-0.064855779357191
0.08,-0.0330473574040319,-0.0740365798453178
0.09,-0.0373751810110897,-0.0831943827681378
0.1,-0.0417495916160402,-0.09232848156201
0.11,-0.0461714962251244,-0.101438140147097
0.12,-0.0506418240386218,-0.110522591481391
0.13,-0.0551615269288627,-0.119581036037126
0.14,-0.0597315799106529,-0.128612640195378
0.15,-0.064352981601226,-0.13761653455453
0.16,-0.069026754666445,-0.146591812148046
0.17,-0.0737539462495493,-0.15553752656685
0.18,-0.0785356283782637,-0.164452689981462
0.19,-0.0833728983455551,-0.173336271058826
0.2,-0.0882668790587356,-0.182187192768707
0.21,-0.0932187193509621,-0.191004330074336
0.22,-0.0982295942484608,-0.199786507501938
0.23,-0.103300705186014,-0.208532496583703
0.24,-0.108433280162369,-0.217241013168713
0.25,-0.113628573826278,-0.225910714596409
0.26,-0.118887867482801,-0.234540196727231
0.27,-0.124212469008366,-0.243127990825237
0.28,-0.129603712661815,-0.251672560287758
0.29,-0.135062958777258,-0.260172297217503
0.3,-0.140591593323095,-0.268625518832971
0.31,-0.146191027309896,-0.277030463713692
0.32,-0.151862696028106,-0.285385287877573
0.33,-0.157608058094614,-0.293688060688622
0.34,-0.163428594285214,-0.301936760594567
0.35,-0.169325806127808,-0.310129270695317
0.36,-0.175301214228907,-0.318263374145076
0.37,-0.181356356303566,-0.326336749392997
0.38,-0.187492784876349,-0.334346965269846
0.39,-0.193712064618325,-0.342291475931147
0.4,-0.200015769282399,-0.35016761567074
0.41,-0.206405478196592,-0.357972593622833
0.42,-0.212882772272232,-0.365703488375284
0.43,-0.21944922948141,-0.373357242522309
0.44,-0.22610641975569,-0.380930657191003
0.45,-0.2328558992559,-0.38842038658307
0.46,-0.239699203961107,-0.395822932581123
0.47,-0.246637842523673,-0.403134639477767
0.48,-0.253673288336776,-0.410351688895579
0.49,-0.260806970761213,-0.417470094976978
0.5,-0.268040265459796,-0.424485699934897
0.51,-0.275374483790669,-0.431394170068008
0.52,-0.282810861215418,-0.438190992358077
0.53,-0.290350544684585,-0.444871471781473
0.54,-0.297994578972152,-0.451430729481977
0.55,-0.305743891942359,-0.457863701967286
0.56,-0.313599278747037,-0.46416514150683
0.57,-0.321561384970008,-0.470329617923021
0.58,-0.329630688757197,-0.476351521981333
0.59,-0.337807481997316,-0.482225070595854
0.6,-0.346091850648441,-0.487944314075296
0.61,-0.354483654340555,-0.493503145638789
0.62,-0.36298250542307,-0.498895313430035
0.63,-0.37158774766907,-0.504114435251253
0.64,-0.380298434893951,-0.509154016223452
0.65,-0.389113309794236,-0.514007469555649
0.66,-0.39803078336128,-0.518668140571396
0.67,-0.407048915272672,-0.523129334095351
0.68,-0.416165395709051,-0.527384345244791
0.69,-0.425377529083425,-0.531426493600643
0.7,-0.434682220200838,-0.535249160649968
0.71,-0.444075963385369,-0.53884583029784
0.72,-0.4535548351157,-0.54221013214305
0.73,-0.463114490696847,-0.545335887101748
0.74,-0.472750165461379,-0.548217154849662
0.75,-0.482456680936591,-0.550848282441696
0.76,-0.492228456333574,-0.553223953362731
0.77,-0.502059525610122,-0.555339236171501
0.78,-0.511943560233589,-0.557189631826605
0.79,-0.521873897625424,-0.558771118736079
0.8,-0.531843575110962,-0.560080194554783
0.81,-0.541845369032517,-0.561113913771274
0.82,-0.55187183851842,-0.561869920180287
0.83,-0.561915373243558,-0.56234647342872
0.84,-0.571968244376642,-0.562542468950263
0.85,-0.582022657793869,-0.562457450762195
0.86,-0.59207080855449,-0.562091616780949
0.87,-0.60210493558635,-0.561445816512564
0.88,-0.612117375521492,-0.56052154118063
0.89,-0.622100614654026,-0.559320906557774
0.9,-0.632047338062575,-0.557846628957378
0.91,-0.641950475043538,-0.556101995011246
0.92,-0.651803240132826,-0.554090825999095
0.93,-0.661599169145208,-0.551817437601931
0.94,-0.671332149823508,-0.549286596020606
0.95,-0.680996446856355,-0.546503471432743
0.96,-0.690586721185054,-0.543473589757279
0.97,-0.70009804367065,-0.540202783659707
0.98,-0.709525903325897,-0.536697143667543
0.99,-0.718866210429732,-0.532962970180395
1,-0.728115294931767,-0.529006727058463
