xi,sx,sy,cx,cy,ex,ey,ne
0,9.76156956080605e-27,-2.13360189783867e-26,0,0,9.76156956080605e-27,-2.13360189783867e-26,2.34630336089887e-26
0.01,-0.0173215442867082,-0.0146742666162014,-0.00699230073243948,-0.00721849583172623,-0.0103292435542688,-0.00745577078447521,0.0127389870238586
0.02,-0.0338045227686169,-0.0278793620812142,-0.0141402597641322,-0.0142813053557207,-0.0196642630044846,-0.0135980567254935,0.0239079565462898
0.03,-0.0494935141877732,-0.0396942647786116,-0.0214472678486451,-0.0211778506937221,-0.0280462463391281,-0.0185164140848896,0.0336072837979828
0.04,-0.0644330972862246,-0.0501979530919673,-0.0289164305063412,-0.0278968473908022,-0.0355166667798834,-0.0223011057011652,0.0419377268655302
0.05,-0.0786678508060184,-0.0594694054048546,-0.0365504891304795,-0.0344262874681688,-0.0421173616755389,-0.0250431179366859,0.0490003052082221
0.06,-0.0922423534892019,-0.067587600100847,-0.0443517316322165,-0.0407534314516893,-0.0478906218569854,-0.0268341686491577,0.0548961225310149
0.07,-0.105201184077822,-0.0746315155635178,-0.0523218924988493,-0.0468648120565311,-0.0528792915789731,-0.0277667035069868,0.0597261190898837
0.08,-0.117588921313927,-0.0806801301764407,-0.0604620425836661,-0.0527462525675874,-0.0571268787302614,-0.0279338776088533,0.0635907366817557
0.09,-0.129450143939564,-0.0858124223231889,-0.068772469539711,-0.0583829032590241,-0.0606776743998532,-0.0274295190641648,0.0665894787985758
0.1,-0.14082943069678,-0.090107370387336,-0.0772525505673405,-0.0637592993933611,-0.0635768801294394,-0.0263480709939749,0.0688203496946698
0.11,-0.151771360327622,-0.0936439527524554,-0.0859006200680917,-0.0688594443667233,-0.0658707402595303,-0.0247845083857321,0.0703791608237902
0.12,-0.162320511574138,-0.0965011478021205,-0.0947138358673549,-0.0736669213468956,-0.067606675706783,-0.0228342264552249,0.0713587030286468
0.13,-0.172521463178375,-0.0987579339199048,-0.103688048840833,-0.0781650362035662,-0.0688334143375417,-0.0205928977163386,0.071847800006119
0.14,-0.18241879388238,-0.100493289489382,-0.112817681975802,-0.0823369935788433,-0.0696011119065783,-0.0181562959105384,0.0719302847194634
0.15,-0.192054977497475,-0.101782300948297,-0.122095626000018,-0.0861661065329458,-0.0699593514974571,-0.0156161944153514,0.071681074140688
0.16,-0.201451808995525,-0.102661820258587,-0.131513159563269,-0.0896360383052655,-0.0699386494322558,-0.013025781953322,0.0711413078309885
0.17,-0.210619346254666,-0.103146997892255,-0.141059902375183,-0.0927310723946896,-0.0695594438794825,-0.0104159254975649,0.070334968094069
0.18,-0.219567512437466,-0.103252735236767,-0.15072380949634,-0.0954364045041843,-0.0688437029411263,-0.00781633073258307,0.0692860047972689
0.19,-0.228306230706497,-0.102993933679595,-0.160491213980426,-0.0977384471225526,-0.0678150167260702,-0.0052554865570426,0.0680183551146927
0.2,-0.236845424224326,-0.102385494608207,-0.17034692317043,-0.0996251349268129,-0.0664985010538954,-0.00276035968139396,0.0665557678040423
0.21,-0.245195016153523,-0.101442319410071,-0.180274371166257,-0.101086217138691,-0.0649206449872654,-0.000356102271380832,0.0649216216247733
0.22,-0.253364929656657,-0.100179309472658,-0.190255826449339,-0.102113521827503,-0.0631091032073184,0.00193421235484513,0.0631387368028978
0.23,-0.261365087896298,-0.0986113661834355,-0.200272649667548,-0.102701177233307,-0.06109243822875,0.00408981104987106,0.06122918065071
0.24,-0.269205414035014,-0.096753390929873,-0.210305592576044,-0.102845776673729,-0.0588998214589699,0.0060923857438558,0.0592140703882993
0.25,-0.276895831235376,-0.0946202850994395,-0.220335125593461,-0.10254647649062,-0.0565607056419154,0.00792619139118016,0.0571133778784009
0.26,-0.284446262659952,-0.0922269500796041,-0.230341778851774,-0.101805020565069,-0.0541044838081779,0.00957807048546455,0.0549457423498301
0.27,-0.291866631471312,-0.0895882872578357,-0.24030648036784,-0.100625689757099,-0.0515601511034718,0.0110374024992629,0.0527282982443354
0.28,-0.299166860832025,-0.0867191980216035,-0.250210875233022,-0.0990151796495559,-0.0489559855990028,0.0122959816279524,0.0504765261301202
0.29,-0.306356752412271,-0.0836344870127061,-0.260037611463949,-0.0969824145986308,-0.0463191409483221,0.0133479275859246,0.0482040453595921
0.3,-0.313442094133715,-0.0803457626826511,-0.269770581121611,-0.0945383097934189,-0.0436715130121041,0.0141925471107677,0.0459198153552226
0.31,-0.320423836721091,-0.0768607815720008,-0.279395109064175,-0.0916954954445114,-0.0410287276569161,0.0148347138725106,0.0436282618130112
0.32,-0.327302642917181,-0.0731870708982472,-0.288898085752103,-0.0884680182101138,-0.0384045571650777,0.0152809473118665,0.0413330057193251
0.33,-0.334079175464762,-0.0693321578788825,-0.298268044391836,-0.0848710345943351,-0.0358111310729268,0.0155388767154527,0.0390370823487153
0.34,-0.340754097106616,-0.0653035697313986,-0.307495186001972,-0.0809205095542079,-0.0332589111046446,0.0156169398228093,0.0367429445920697
0.35,-0.347328070585522,-0.0611088336732877,-0.316571358469622,-0.0766329312713631,-0.0307567121159009,0.0155240975980755,0.0344524737343341
0.36,-0.353801758644261,-0.0567554769220418,-0.325489997241377,-0.0720250503529471,-0.0283117614028831,0.0152695734309054,0.0321669971631731
0.37,-0.36017582402561,-0.0522510266951529,-0.334246036000366,-0.0671136489642636,-0.0259297880252444,0.0148626222691106,0.0298873124878831
0.38,-0.366450929472351,-0.0476030102101133,-0.34283579564839,-0.0619153428301431,-0.0236151338239615,0.0143123326200299,0.0276137177965949
0.39,-0.372627737727264,-0.0428189546844148,-0.351256859320478,-0.0564464168505733,-0.0213708784067864,0.0136274621661585,0.0253460483895958
0.4,-0.378706911533127,-0.0379063873355497,-0.359507940200202,-0.0507226933482632,-0.0191989713329259,0.0128163060127136,0.0230837215382189
0.41,-0.384689113632722,-0.0328728353810099,-0.367588747753637,-0.0447594307182923,-0.0171003658790848,0.0118865953372825,0.0208257931880366
0.42,-0.390575006768827,-0.0277258260382875,-0.375499856800652,-0.038571249447469,-0.0150751499681755,0.0108454234091815,0.0185710353908285
0.43,-0.396365253983066,-0.0224728844349367,-0.383242582698387,-0.0321720820470666,-0.0131226712846787,0.00969919761212986,0.0163180555203393
0.44,-0.402060670129243,-0.0171204740100237,-0.390818864889647,-0.0255751433175249,-0.0112418052395952,0.00845466930750127,0.0140662581429531
0.45,-0.407662468418721,-0.0116722723153031,-0.398231160202938,-0.0187929174575648,-0.00943130821578342,0.0071206451422617,0.0118174938926626
0.46,-0.413171926612926,-0.0061315054759285,-0.405482346591306,-0.0118371587710353,-0.0076895800216199,0.00570565329510677,0.00957518252739125
0.47,-0.418590322473282,-0.000501399617053511,-0.412575637457467,-0.00471890305298064,-0.00601468501581537,0.00421750343592713,0.00734600374840165
0.48,-0.423918933761215,0.00521481913616843,-0.419514506316361,0.00255151289449604,-0.00440442744485342,0.00266330624167239,0.00514705559071486
0.49,-0.429159038238148,0.0110139246585837,-0.42630262127193,0.00996442578963075,-0.00285641696621836,0.00104949886895299,0.00304311776979362
0.5,-0.434311913665507,0.0168926908250389,-0.432943788609681,0.0175108162538584,-0.00136812505582662,-0.000618125428819526,0.0015012811908946
0.51,-0.439378837804717,0.0228478915103803,-0.43944190470904,0.0251822765309526,6.30669043226728e-05,-0.00233438502057233,0.00233523678857055
0.52,-0.444361088417203,0.0288763005894545,-0.445800915440191,0.0329709767287141,0.00143982702298856,-0.00409467613925957,0.00434044635280172
0.53,-0.449259943264389,0.0349746919371079,-0.452024782212925,0.0408696305143671,0.00276483894853624,-0.00589493857725917,0.00651111628225156
0.54,-0.4540766801077,0.0411398394281869,-0.45811745387668,0.048871460978577,0.0040407737689806,-0.00773162155039007,0.00872386522423048
0.55,-0.458812576708561,0.0473685169375381,-0.46408284372116,0.0569701672030778,0.00527026701259892,-0.00960165026553967,0.0109529631701118
0.56,-0.463468910828397,0.0536574983400078,-0.469924810887734,0.0651598919196634,0.00645590005933766,-0.0115023935796556,0.0131902882317809
0.57,-0.468046960228633,0.0600035575104426,-0.475647145567619,0.0734351905296883,0.00760018533898638,-0.0134316330192457,0.0154328086475092
0.58,-0.472548074329631,0.0664036021313899,-0.481253557429353,0.0817910016590851,0.00870548309972197,-0.0153873995276952,0.0176792958068035
0.59,-0.476974044780294,0.0728553656523669,-0.486747666782763,0.0902226193503733,0.00977362200246917,-0.0173672536980063,0.0199285019020012
0.6,-0.481326831760727,0.0793568962187804,-0.49213299804749,0.0987256669366146,0.0108061662867626,-0.0193687707178342,0.0221793261605757
0.61,-0.485608395782794,0.085906242595517,-0.497412975150379,0.107296072599657,0.0118045793675857,-0.0213898300041404,0.0244309828220572
0.62,-0.489820697358354,0.0925014535474634,-0.502590918526999,0.115930046583607,0.0127702211686452,-0.0234285930361434,0.0266829068946646
0.63,-0.493965696999271,0.0991405778395066,-0.507670043448219,0.12462406001197,0.0137043464489479,-0.0254834821724631,0.0289347019204801
0.64,-0.498045355217405,0.105821664236533,-0.51265345943321,0.133374825241467,0.0146081042158054,-0.0275531610049334,0.031186108929195
0.65,-0.502061632524618,0.11254276150343,-0.517544170545787,0.142179277675511,0.0154825380211694,-0.0296365161720813,0.0334369866225262
0.66,-0.506016489432772,0.119301918405083,-0.522345076401945,0.151034558954564,0.0163285869691728,-0.0317326405494807,0.0356872978614575
0.67,-0.509911886453728,0.126097183706381,-0.527058973743348,0.159938001437948,0.0171470872896197,-0.0338408177315671,0.0379370998793923
0.68,-0.513749784099348,0.132926606172208,-0.531688558454658,0.168887113891455,0.0179387743553101,-0.0359605077192467,0.0401865368101898
0.69,-0.517532142881493,0.139788234567453,-0.536236427922469,0.177879568296546,0.0187042850409762,-0.0380913337290932,0.042435833727585
0.7,-0.521260923312025,0.146680117657002,-0.540705083650623,0.18691318769961,0.0194441603385973,-0.0402330700426083,0.0446852917225177
0.71,-0.524938085902806,0.153600304205741,-0.545096934061148,0.195985935023268,0.020158848158342,-0.0423856308175268,0.0469352837305877
0.72,-0.528565772137066,0.160547442313366,-0.549414297422398,0.20509590276573,0.0208485252853319,-0.0445484604523637,0.0491856313901624
0.73,-0.532149163251494,0.167530247031427,-0.553659404856328,0.214241303518543,0.0215102416048343,-0.0467110564871151,0.0514258037568768
0.74,-0.535695962771232,0.174565786640364,-0.557834403385713,0.223420461237524,0.0221384406144813,-0.0488546745971602,0.0536366458947176
0.75,-0.539213950568718,0.181671382264986,-0.561941358989458,0.232631803206142,0.0227274084207399,-0.0509604209411563,0.0557987418856641
0.76,-0.542710906516388,0.188864355030106,-0.56598225964042,0.241873852634971,0.0232713531240317,-0.0530094976048655,0.0578926827202162
0.77,-0.546194610486682,0.196162026060534,-0.569959018305367,0.251145221845071,0.0237644078186853,-0.0549831957845373,0.0598990725942694
0.78,-0.549672842352035,0.203581716481082,-0.573873475891026,0.260444605987197,0.024200633538991,-0.0568628895061143,0.0617985345026329
0.79,-0.553153381984887,0.211140747416561,-0.577727404123853,0.269770777252519,0.0245740221389663,-0.0586300298359575,0.0635717151149131
0.8,-0.556644009257674,0.218856439991783,-0.581522508354123,0.279122579534169,0.0248784990964492,-0.0602661395423861,0.0651992890500685
0.81,-0.560152504042833,0.226746115331558,-0.585260430277465,0.28849892350222,0.0251079262346317,-0.0617528081706629,0.0666619627431296
0.82,-0.563686646212804,0.234827094560697,-0.588942750569005,0.297898782057867,0.0252561043562006,-0.0630716874971699,0.0679404781480964
0.83,-0.567254215640022,0.243116698804012,-0.592570991426963,0.307321186135411,0.025316775786941,-0.0642044873313995,0.0690156165641812
0.84,-0.570862992196927,0.251632249186314,-0.596146619023952,0.316765220823352,0.0252836268270252,-0.0651329716370382,0.0698682029237871
0.85,-0.574520755755955,0.260391066832414,-0.599671045865291,0.326230021778286,0.0251502901093361,-0.0658389549458723,0.0704791109545826
0.86,-0.578235339450606,0.269410772742594,-0.603145633054606,0.335714771907608,0.0249102936040005,-0.0663039991650145,0.0708289702926123
0.87,-0.582019216784475,0.278735114567481,-0.606571692467659,0.345218698299029,0.024552475683184,-0.0664835837315484,0.0708723568675626
0.88,-0.585893036834292,0.288453870842389,-0.609950488835919,0.354741069376838,0.0240574520016272,-0.0662871985344494,0.0705177544052284
0.89,-0.58987828088089,0.298661505656853,-0.613283241741851,0.36428119226654,0.0234049608609611,-0.0656196866096872,0.0696687552899912
0.9,-0.593996430205107,0.30945248310041,-0.616571127528206,0.373838410351093,0.0225746973230997,-0.0643859272506831,0.0682287665663085
0.91,-0.598268966087776,0.320921267262596,-0.619815281123843,0.383412101003389,0.0215463150360676,-0.0624908337407937,0.0661010438136418
0.92,-0.602717369809732,0.333162322232946,-0.623016797788812,0.393001673480954,0.0202994279790796,-0.0598393512480083,0.0631887231558001
0.93,-0.607363122651811,0.346270112100996,-0.626176734781516,0.402606566970018,0.0188136121297048,-0.056336454869022,0.0593948495121953
0.94,-0.612227705894849,0.360339100956283,-0.629296112950866,0.41222624876722,0.0170684070560169,-0.0518871478109375,0.0546224004176305
0.95,-0.61733260081968,0.375463752888342,-0.63237591825634,0.421860212588187,0.0150433174366601,-0.0463964596998452,0.0487743054505083
0.96,-0.622699288707138,0.391738531986709,-0.6354171032189,0.431507976993141,0.0127178145117621,-0.0397694450064318,0.0417534616777483
0.97,-0.62834925083806,0.40925790234092,-0.638420588305659,0.441169083920524,0.0100713374675986,-0.031911181579604,0.0334627456762399
0.98,-0.634303968493281,0.428116328040512,-0.641387263251155,0.45084309732037,0.00708329475787395,-0.0227267692798586,0.0238050227163691
0.99,-0.640584922953635,0.448408273175019,-0.644317988318047,0.460529601879839,0.00373306536441143,-0.0121213287048195,0.0126831536529859
1,-0.647213595499958,0.470228201833979,-0.647213595499947,0.470228201833974,-1.0769163338864e-14,4.94049245958195e-15,1.18483477650818e-14
