xi,s1,s2
0,-5.82156836194942e-26,5.26751703056203e-26
0.01,-0.00709882547366324,-0.0207622749463942
0.02,-0.0142872842714659,-0.0401241338311318
0.03,-0.0215617043652155,-0.0581398415432342
0.04,-0.0289184137267194,-0.0748636629717226
0.05,-0.0363537403277852,-0.0903498630056186
0.06,-0.0438640121402204,-0.104652706533943
0.07,-0.0514455571358324,-0.117826458445718
0.08,-0.0590947032864287,-0.129925383629965
0.09,-0.0668077785638168,-0.141003746975705
0.1,-0.0745811109398042,-0.151115813371959
0.11,-0.0824110283861984,-0.160315847707748
0.12,-0.0902938588748068,-0.168658114872095
0.13,-0.098225930377437,-0.17619687975402
0.14,-0.106203570865896,-0.182986407242545
0.15,-0.114223108311992,-0.189080962226691
0.16,-0.122280870687533,-0.19453480959548
0.17,-0.130373136736947,-0.199401956244012
0.18,-0.138493231562036,-0.203720929432191
0.19,-0.146629902118518,-0.207506262985359
0.2,-0.154771501543097,-0.210770426777502
0.21,-0.162906382972476,-0.213525890682602
0.22,-0.171022899543357,-0.215785124574643
0.23,-0.179109404392444,-0.21756059832761
0.24,-0.18715425065644,-0.218864781815485
0.25,-0.195145791472047,-0.219710144912253
0.26,-0.203072379975969,-0.220109157491898
0.27,-0.210922369304907,-0.220074289428404
0.28,-0.218684112595567,-0.219618010595753
0.29,-0.226345962984649,-0.218752790867931
0.3,-0.233896273608858,-0.217491100118921
0.31,-0.241323397604896,-0.215845408222707
0.32,-0.248615688109466,-0.213828185053272
0.33,-0.255761498259271,-0.2114519004846
0.34,-0.262749674162694,-0.20872913400433
0.35,-0.269574792723901,-0.205673739358839
0.36,-0.27623512813466,-0.202300392396913
0.37,-0.282729016208199,-0.198623782669047
0.38,-0.289054792757746,-0.194658599725736
0.39,-0.295210793596528,-0.190419533117472
0.4,-0.301195354537774,-0.185921272394751
0.41,-0.30700681139471,-0.181178507108068
0.42,-0.312643499980566,-0.176205926807915
0.43,-0.318103756108569,-0.171018221044788
0.44,-0.323385915591946,-0.16563007936918
0.45,-0.328488314243925,-0.160056191331587
0.46,-0.333409287877736,-0.154311246482501
0.47,-0.338147172306604,-0.148409934372419
0.48,-0.342700303343758,-0.142366944551833
0.49,-0.347067016802426,-0.136196966571238
0.5,-0.351245648495836,-0.129914689981128
0.51,-0.35523655145507,-0.123533304996582
0.52,-0.35904814758263,-0.117060004491015
0.53,-0.362690875998872,-0.110500482002425
0.54,-0.366175175824151,-0.103860431068812
0.55,-0.369511486178824,-0.0971455452281752
0.56,-0.372710246183247,-0.090361518018513
0.57,-0.375781894957775,-0.0835140429778249
0.58,-0.378736871622766,-0.0766088136441096
0.59,-0.381585615298574,-0.0696515235553664
0.6,-0.384338565105557,-0.0626478662495943
0.61,-0.387006160164069,-0.0556035352647924
0.62,-0.389598839594468,-0.0485242241389597
0.63,-0.392127042517109,-0.0414156264100952
0.64,-0.394601208052348,-0.0342834356161981
0.65,-0.397031775320542,-0.0271333452952674
0.66,-0.399429183442045,-0.0199710489853022
0.67,-0.401803815310219,-0.01280211888359
0.68,-0.404162680198601,-0.0056248467447311
0.69,-0.406507558270014,0.00157376036283969
0.7,-0.408839779871302,0.0088076660963794
0.71,-0.41116067534931,0.0160908341131448
0.72,-0.413471575050882,0.0234372280703929
0.73,-0.415773809322864,0.0308608116253804
0.74,-0.418068708512101,0.0383755484353643
0.75,-0.420357602965437,0.0459954021576015
0.76,-0.422641823029717,0.0537343364493488
0.77,-0.424922699051787,0.0616063149678632
0.78,-0.42720156137849,0.0696253013704014
0.79,-0.429479740356672,0.0778052593142204
0.8,-0.431758566333177,0.0861601524565771
0.81,-0.434039369654851,0.0947039444547284
0.82,-0.436323480668538,0.103450598965931
0.83,-0.438612229721084,0.112414079647442
0.84,-0.440907324151779,0.121610985210099
0.85,-0.443214853837101,0.13108854686262
0.86,-0.445543736096878,0.140913758715578
0.87,-0.447902935374989,0.151153944261247
0.88,-0.450301416115317,0.161876426991899
0.89,-0.452748142761743,0.173148530399805
0.9,-0.455252079758148,0.185037577977239
0.91,-0.457822191548414,0.197610893216473
0.92,-0.460467442576422,0.210935799609778
0.93,-0.463196797286053,0.225079620649427
0.94,-0.466019220121189,0.240109679827693
0.95,-0.468943675525712,0.256093300636848
0.96,-0.471979127943502,0.273097806569163
0.97,-0.475134541818442,0.291190521116913
0.98,-0.478418881594411,0.310438767772368
0.99,-0.481841111715293,0.330909870027801
1,-0.485410196624968,0.352671151375484
