x,b0,b1,b2,b3,b4,b5,b6,b7,b8,s
0,1,-0,-0,-0,-0,-0,-0,-0,-0,1
0.0040161,1,-0,-0.0063084,-0.012617,-0.018924,-0.025231,-0.031537,-0.037841,-0.044145,0.8234
0.0080321,1,-0,-0.012617,-0.025231,-0.037841,-0.050446,-0.063042,-0.075629,-0.088203,0.64699
0.012048,1,-0,-0.018924,-0.037841,-0.056745,-0.075629,-0.094485,-0.11331,-0.13209,0.47098
0.016064,1,-0,-0.025231,-0.050446,-0.075629,-0.10076,-0.12583,-0.15082,-0.17572,0.29555
0.02008,1,-0,-0.031537,-0.063042,-0.094485,-0.12583,-0.15706,-0.18812,-0.21901,0.12091
0.024096,1,-0,-0.037841,-0.075629,-0.11331,-0.15082,-0.18812,-0.22516,-0.26186,-0.052747
0.028112,1,-0,-0.044145,-0.088203,-0.13209,-0.17572,-0.21901,-0.26186,-0.30421,-0.22524
0.032129,1,-0,-0.050446,-0.10076,-0.15082,-0.2005,-0.24967,-0.2982,-0.34597,-0.39637
0.036145,1,-0,-0.056745,-0.11331,-0.1695,-0.22516,-0.28008,-0.3341,-0.38705,-0.56595
0.040161,1,-0,-0.063042,-0.12583,-0.18812,-0.24967,-0.31022,-0.36953,-0.42738,-0.73379
0.044177,1,-0,-0.069337,-0.13834,-0.20668,-0.27402,-0.34004,-0.40443,-0.46687,-0.89972
0.048193,1,-0,-0.075629,-0.15082,-0.22516,-0.2982,-0.36953,-0.43875,-0.50545,-1.0635
0.052209,1,-0,-0.081918,-0.16328,-0.24355,-0.32219,-0.39865,-0.47244,-0.54305,-1.2251
0.056225,1,-0,-0.088203,-0.17572,-0.26186,-0.34597,-0.42738,-0.50545,-0.57959,-1.3842
0.060241,1,-0,-0.094485,-0.18812,-0.28008,-0.36953,-0.45568,-0.53774,-0.615,-1.5406
0.064257,1,-0,-0.10076,-0.2005,-0.2982,-0.39286,-0.48352,-0.56926,-0.64921,-1.6943
0.068273,1,-0,-0.10704,-0.21285,-0.31621,-0.41594,-0.51089,-0.59997,-0.68215,-1.845
0.072289,1,-0,-0.11331,-0.22516,-0.3341,-0.43875,-0.53774,-0.62981,-0.71377,-1.9926
0.076305,1,-0,-0.11957,-0.23743,-0.35188,-0.46128,-0.56406,-0.65875,-0.74399,-2.137
0.080321,1,-0,-0.12583,-0.24967,-0.36953,-0.48352,-0.58982,-0.68675,-0.77276,-2.2779
0.084337,1,-0,-0.13209,-0.26186,-0.38705,-0.50545,-0.615,-0.71377,-0.80003,-2.4152
0.088353,1,-0,-0.13834,-0.27402,-0.40443,-0.52706,-0.63956,-0.73976,-0.82573,-2.5489
0.092369,1,-0,-0.14459,-0.28613,-0.42167,-0.54834,-0.66349,-0.76469,-0.84983,-2.6787
0.096386,1,-0,-0.15082,-0.2982,-0.43875,-0.56926,-0.68675,-0.78853,-0.87226,-2.8046
0.1004,1,-0,-0.15706,-0.31022,-0.45568,-0.58982,-0.70933,-0.81124,-0.893,-2.9263
0.10442,1,-0,-0.16328,-0.32219,-0.47244,-0.61001,-0.73121,-0.83278,-0.912,-3.0439
0.10843,1,-0,-0.1695,-0.3341,-0.48903,-0.62981,-0.75236,-0.85313,-0.92922,-3.1572
0.11245,1,-0,-0.17572,-0.34597,-0.50545,-0.64921,-0.77276,-0.87226,-0.94463,-3.266
0.11647,1,-0,-0.18193,-0.35778,-0.52169,-0.66819,-0.79239,-0.89015,-0.95819,-3.3703
0.12048,1,-0,-0.18812,-0.36953,-0.53774,-0.68675,-0.81124,-0.90675,-0.96989,-3.47
0.1245,1,-0,-0.19432,-0.38123,-0.5536,-0.70487,-0.82927,-0.92206,-0.97969,-3.565
0.12851,1,-0,-0.2005,-0.39286,-0.56926,-0.72255,-0.84648,-0.93604,-0.98759,-3.6553
0.13253,1,-0,-0.20668,-0.40443,-0.58472,-0.73976,-0.86285,-0.94869,-0.99356,-3.7407
0.13655,1,-0,-0.21285,-0.41594,-0.59997,-0.7565,-0.87837,-0.95998,-0.99759,-3.8212
0.14056,1,-0,-0.21901,-0.42738,-0.615,-0.77276,-0.893,-0.96989,-0.99968,-3.8967
0.14458,1,-0,-0.22516,-0.43875,-0.62981,-0.78853,-0.90675,-0.97841,-0.99982,-3.9672
0.14859,1,-0,-0.2313,-0.45005,-0.6444,-0.80379,-0.9196,-0.98553,-0.99801,-4.0327
0.15261,1,-0,-0.23743,-0.46128,-0.65875,-0.81855,-0.93153,-0.99124,-0.99425,-4.093
0.15663,1,-0,-0.24355,-0.47244,-0.67287,-0.83278,-0.94254,-0.99553,-0.98856,-4.1483
0.16064,1,-0,-0.24967,-0.48352,-0.68675,-0.84648,-0.9526,-0.99839,-0.98094,-4.1984
0.16466,1,-0,-0.25577,-0.49453,-0.70038,-0.85965,-0.96172,-0.99982,-0.9714,-4.2433
0.16867,1,-0,-0.26186,-0.50545,-0.71377,-0.87226,-0.96989,-0.99982,-0.95998,-4.283
0.17269,1,-0,-0.26795,-0.5163,-0.72689,-0.88433,-0.97709,-0.99839,-0.94668,-4.3176
0.17671,1,-0,-0.27402,-0.52706,-0.73976,-0.89582,-0.98331,-0.99553,-0.93153,-4.347
0.18072,1,-0,-0.28008,-0.53774,-0.75236,-0.90675,-0.98856,-0.99124,-0.91457,-4.3713
0.18474,1,-0,-0.28613,-0.54834,-0.76469,-0.9171,-0.99283,-0.98553,-0.89582,-4.3904
0.18876,1,-0,-0.29217,-0.55884,-0.77675,-0.92687,-0.9961,-0.97841,-0.87533,-4.4045
0.19277,1,-0,-0.2982,-0.56926,-0.78853,-0.93604,-0.99839,-0.96989,-0.85313,-4.4134
0.19679,1,-0,-0.30421,-0.57959,-0.80003,-0.94463,-0.99968,-0.95998,-0.82927,-4.4174
0.2008,1,-0,-0.31022,-0.58982,-0.81124,-0.9526,-0.99998,-0.94869,-0.80379,-4.4163
0.20482,1,-0,-0.31621,-0.59997,-0.82216,-0.95998,-0.99928,-0.93604,-0.77675,-4.4104
0.20884,1,-0,-0.32219,-0.61001,-0.83278,-0.96674,-0.99759,-0.92206,-0.74819,-4.3996
0.21285,1,-0,-0.32815,-0.61996,-0.84311,-0.97288,-0.99491,-0.90675,-0.71817,-4.3839
0.21687,1,-0,-0.3341,-0.62981,-0.85313,-0.97841,-0.99124,-0.89015,-0.68675,-4.3636
0.22088,1,-0,-0.34004,-0.63956,-0.86285,-0.98331,-0.98658,-0.87226,-0.65399,-4.3386
0.2249,1,-0,-0.34597,-0.64921,-0.87226,-0.98759,-0.98094,-0.85313,-0.61996,-4.3091
0.22892,1,-0,-0.35188,-0.65875,-0.88136,-0.99124,-0.97432,-0.83278,-0.58472,-4.2751
0.23293,1,-0,-0.35778,-0.66819,-0.89015,-0.99425,-0.96674,-0.81124,-0.54834,-4.2367
0.23695,1,-0,-0.36366,-0.67753,-0.89861,-0.99664,-0.95819,-0.78853,-0.51089,-4.194
0.24096,1,-0,-0.36953,-0.68675,-0.90675,-0.99839,-0.94869,-0.76469,-0.47244,-4.1472
0.24498,1,-0,-0.37539,-0.69587,-0.91457,-0.9995,-0.93825,-0.73976,-0.43307,-4.0964
0.249,1,-0,-0.38123,-0.70487,-0.92206,-0.99998,-0.92687,-0.71377,-0.39286,-4.0416
0.25301,1,-0,-0.38705,-0.71377,-0.92922,-0.99982,-0.91457,-0.68675,-0.35188,-3.9831
0.25703,1,-0,-0.39286,-0.72255,-0.93604,-0.99903,-0.90136,-0.65875,-0.31022,-3.9208
0.26104,1,-0,-0.39865,-0.73121,-0.94254,-0.99759,-0.88725,-0.62981,-0.26795,-3.855
0.26506,1,-0,-0.40443,-0.73976,-0.94869,-0.99553,-0.87226,-0.59997,-0.22516,-3.7858
0.26908,1,-0,-0.41019,-0.74819,-0.9545,-0.99283,-0.85641,-0.56926,-0.18193,-3.7133
0.27309,1,-0,-0.41594,-0.7565,-0.95998,-0.98949,-0.8397,-0.53774,-0.13834,-3.6377
0.27711,1,-0,-0.42167,-0.76469,-0.9651,-0.98553,-0.82216,-0.50545,-0.094485,-3.5591
0.28112,1,-0,-0.42738,-0.77276,-0.96989,-0.98094,-0.80379,-0.47244,-0.050446,-3.4776
0.28514,1,-0,-0.43307,-0.78071,-0.97432,-0.97572,-0.78463,-0.43875,-0.0063084,-3.3935
0.28916,1,-0,-0.43875,-0.78853,-0.97841,-0.96989,-0.76469,-0.40443,0.037841,-3.3069
0.29317,1,-0,-0.44441,-0.79622,-0.98215,-0.96343,-0.74399,-0.36953,0.081918,-3.2178
0.29719,1,-0,-0.45005,-0.80379,-0.98553,-0.95637,-0.72255,-0.3341,0.12583,-3.1266
0.3012,1,-0,-0.45568,-0.81124,-0.98856,-0.94869,-0.70038,-0.2982,0.1695,-3.0332
0.30522,1,-0,-0.46128,-0.81855,-0.99124,-0.94041,-0.67753,-0.26186,0.21285,-2.938
0.30924,1,-0,-0.46687,-0.82573,-0.99356,-0.93153,-0.65399,-0.22516,0.25577,-2.8411
0.31325,1,-0,-0.47244,-0.83278,-0.99553,-0.92206,-0.62981,-0.18812,0.2982,-2.7425
0.31727,1,-0,-0.47799,-0.8397,-0.99714,-0.912,-0.605,-0.15082,0.34004,-2.6426
0.32129,1,-0,-0.48352,-0.84648,-0.99839,-0.90136,-0.57959,-0.11331,0.38123,-2.5414
0.3253,1,-0,-0.48903,-0.85313,-0.99928,-0.89015,-0.5536,-0.075629,0.42167,-2.4392
0.32932,1,-0,-0.49453,-0.85965,-0.99982,-0.87837,-0.52706,-0.037841,0.46128,-2.336
0.33333,1,-0,-0.5,-0.86603,-1,-0.86603,-0.5,-1.2246e-16,0.5,-2.2321
0.33735,1,-0,-0.50545,-0.87226,-0.99982,-0.85313,-0.47244,0.037841,0.53774,-2.1275
0.34137,1,-0,-0.51089,-0.87837,-0.99928,-0.8397,-0.44441,0.075629,0.57444,-2.0226
0.34538,1,-0,-0.5163,-0.88433,-0.99839,-0.82573,-0.41594,0.11331,0.61001,-1.9174
0.3494,1,-0,-0.52169,-0.89015,-0.99714,-0.81124,-0.38705,0.15082,0.6444,-1.812
0.35341,1,-0,-0.52706,-0.89582,-0.99553,-0.79622,-0.35778,0.18812,0.67753,-1.7068
0.35743,1,-0,-0.53241,-0.90136,-0.99356,-0.78071,-0.32815,0.22516,0.70933,-1.6017
0.36145,1,-0,-0.53774,-0.90675,-0.99124,-0.76469,-0.2982,0.26186,0.73976,-1.497
0.36546,1,-0,-0.54305,-0.912,-0.98856,-0.74819,-0.26795,0.2982,0.76874,-1.3928
0.36948,1,-0,-0.54834,-0.9171,-0.98553,-0.73121,-0.23743,0.3341,0.79622,-1.2893
0.37349,1,-0,-0.5536,-0.92206,-0.98215,-0.71377,-0.20668,0.36953,0.82216,-1.1866
0.37751,1,-0,-0.55884,-0.92687,-0.97841,-0.69587,-0.17572,0.40443,0.84648,-1.0848
0.38153,1,-0,-0.56406,-0.93153,-0.97432,-0.67753,-0.14459,0.43875,0.86916,-0.98412
0.38554,1,-0,-0.56926,-0.93604,-0.96989,-0.65875,-0.11331,0.47244,0.89015,-0.88467
0.38956,1,-0,-0.57444,-0.94041,-0.9651,-0.63956,-0.081918,0.50545,0.90939,-0.78658
0.39357,1,-0,-0.57959,-0.94463,-0.95998,-0.61996,-0.050446,0.53774,0.92687,-0.68999
0.39759,1,-0,-0.58472,-0.94869,-0.9545,-0.59997,-0.018924,0.56926,0.94254,-0.595
0.40161,1,-0,-0.58982,-0.9526,-0.94869,-0.57959,0.012617,0.59997,0.95637,-0.50176
0.40562,1,-0,-0.59491,-0.95637,-0.94254,-0.55884,0.044145,0.62981,0.96833,-0.41037
0.40964,1,-0,-0.59997,-0.95998,-0.93604,-0.53774,0.075629,0.65875,0.97841,-0.32094
0.41365,1,-0,-0.605,-0.96343,-0.92922,-0.5163,0.10704,0.68675,0.98658,-0.23358
0.41767,1,-0,-0.61001,-0.96674,-0.92206,-0.49453,0.13834,0.71377,0.99283,-0.1484
0.42169,1,-0,-0.615,-0.96989,-0.91457,-0.47244,0.1695,0.73976,0.99714,-0.065495
0.4257,1,-0,-0.61996,-0.97288,-0.90675,-0.45005,0.2005,0.76469,0.9995,0.015048
0.42972,1,-0,-0.6249,-0.97572,-0.89861,-0.42738,0.2313,0.78853,0.99992,0.093138
0.43373,1,-0,-0.62981,-0.97841,-0.89015,-0.40443,0.26186,0.81124,0.99839,0.16869
0.43775,1,-0,-0.6347,-0.98094,-0.88136,-0.38123,0.29217,0.83278,0.99491,0.24164
0.44177,1,-0,-0.63956,-0.98331,-0.87226,-0.35778,0.32219,0.85313,0.98949,0.3119
0.44578,1,-0,-0.6444,-0.98553,-0.86285,-0.3341,0.35188,0.87226,0.98215,0.37941
0.4498,1,-0,-0.64921,-0.98759,-0.85313,-0.31022,0.38123,0.89015,0.97288,0.44411
0.45382,1,-0,-0.65399,-0.98949,-0.84311,-0.28613,0.41019,0.90675,0.96172,0.50594
0.45783,1,-0,-0.65875,-0.99124,-0.83278,-0.26186,0.43875,0.92206,0.94869,0.56486
0.46185,1,-0,-0.66349,-0.99283,-0.82216,-0.23743,0.46687,0.93604,0.93381,0.62082
0.46586,1,-0,-0.66819,-0.99425,-0.81124,-0.21285,0.49453,0.94869,0.9171,0.67379
0.46988,1,-0,-0.67287,-0.99553,-0.80003,-0.18812,0.52169,0.95998,0.89861,0.72373
0.4739,1,-0,-0.67753,-0.99664,-0.78853,-0.16328,0.54834,0.96989,0.87837,0.77061
0.47791,1,-0,-0.68215,-0.99759,-0.77675,-0.13834,0.57444,0.97841,0.85641,0.81442
0.48193,1,-0,-0.68675,-0.99839,-0.76469,-0.11331,0.59997,0.98553,0.83278,0.85514
0.48594,1,-0,-0.69132,-0.99903,-0.75236,-0.088203,0.6249,0.99124,0.80753,0.89276
0.48996,1,-0,-0.69587,-0.9995,-0.73976,-0.063042,0.64921,0.99553,0.78071,0.92727
0.49398,1,-0,-0.70038,-0.99982,-0.72689,-0.037841,0.67287,0.99839,0.75236,0.95868
0.49799,1,-0,-0.70487,-0.99998,-0.71377,-0.012617,0.69587,0.99982,0.72255,0.987
0.50201,1,-0,-0.70933,-0.99998,-0.70038,0.012617,0.71817,0.99982,0.69132,1.0122
0.50602,1,-0,-0.71377,-0.99982,-0.68675,0.037841,0.73976,0.99839,0.65875,1.0344
0.51004,1,-0,-0.71817,-0.9995,-0.67287,0.063042,0.76061,0.99553,0.6249,1.0535
0.51406,1,-0,-0.72255,-0.99903,-0.65875,0.088203,0.78071,0.99124,0.58982,1.0696
0.51807,1,-0,-0.72689,-0.99839,-0.6444,0.11331,0.80003,0.98553,0.5536,1.0828
0.52209,1,-0,-0.73121,-0.99759,-0.62981,0.13834,0.81855,0.97841,0.5163,1.093
0.5261,1,-0,-0.7355,-0.99664,-0.615,0.16328,0.83626,0.96989,0.47799,1.1003
0.53012,1,-0,-0.73976,-0.99553,-0.59997,0.18812,0.85313,0.95998,0.43875,1.1047
0.53414,1,-0,-0.74399,-0.99425,-0.58472,0.21285,0.86916,0.94869,0.39865,1.1064
0.53815,1,-0,-0.74819,-0.99283,-0.56926,0.23743,0.88433,0.93604,0.35778,1.1053
0.54217,1,-0,-0.75236,-0.99124,-0.5536,0.26186,0.89861,0.92206,0.31621,1.1015
0.54618,1,-0,-0.7565,-0.98949,-0.53774,0.28613,0.912,0.90675,0.27402,1.0952
0.5502,1,-0,-0.76061,-0.98759,-0.52169,0.31022,0.92448,0.89015,0.2313,1.0863
0.55422,1,-0,-0.76469,-0.98553,-0.50545,0.3341,0.93604,0.87226,0.18812,1.0749
0.55823,1,-0,-0.76874,-0.98331,-0.48903,0.35778,0.94668,0.85313,0.14459,1.0611
0.56225,1,-0,-0.77276,-0.98094,-0.47244,0.38123,0.95637,0.83278,0.10076,1.045
0.56627,1,-0,-0.77675,-0.97841,-0.45568,0.40443,0.9651,0.81124,0.056745,1.0267
0.57028,1,-0,-0.78071,-0.97572,-0.43875,0.42738,0.97288,0.78853,0.012617,1.0062
0.5743,1,-0,-0.78463,-0.97288,-0.42167,0.45005,0.97969,0.76469,-0.031537,0.98372
0.57831,1,-0,-0.78853,-0.96989,-0.40443,0.47244,0.98553,0.73976,-0.075629,0.95925
0.58233,1,-0,-0.79239,-0.96674,-0.38705,0.49453,0.99038,0.71377,-0.11957,0.93292
0.58635,1,-0,-0.79622,-0.96343,-0.36953,0.5163,0.99425,0.68675,-0.16328,0.90483
0.59036,1,-0,-0.80003,-0.95998,-0.35188,0.53774,0.99714,0.65875,-0.20668,0.87507
0.59438,1,-0,-0.80379,-0.95637,-0.3341,0.55884,0.99903,0.62981,-0.24967,0.84375
0.59839,1,-0,-0.80753,-0.9526,-0.31621,0.57959,0.99992,0.59997,-0.29217,0.81096
0.60241,1,-0,-0.81124,-0.94869,-0.2982,0.59997,0.99982,0.56926,-0.3341,0.77682
0.60643,1,-0,-0.81491,-0.94463,-0.28008,0.61996,0.99873,0.53774,-0.37539,0.74143
0.61044,1,-0,-0.81855,-0.94041,-0.26186,0.63956,0.99664,0.50545,-0.41594,0.70489
0.61446,1,-0,-0.82216,-0.93604,-0.24355,0.65875,0.99356,0.47244,-0.45568,0.66732
0.61847,1,-0,-0.82573,-0.93153,-0.22516,0.67753,0.98949,0.43875,-0.49453,0.62882
0.62249,1,-0,-0.82927,-0.92687,-0.20668,0.69587,0.98444,0.40443,-0.53241,0.58951
0.62651,1,-0,-0.83278,-0.92206,-0.18812,0.71377,0.97841,0.36953,-0.56926,0.54948
0.63052,1,-0,-0.83626,-0.9171,-0.1695,0.73121,0.9714,0.3341,-0.605,0.50885
0.63454,1,-0,-0.8397,-0.912,-0.15082,0.74819,0.96343,0.2982,-0.63956,0.46774
0.63855,1,-0,-0.84311,-0.90675,-0.13209,0.76469,0.9545,0.26186,-0.67287,0.42624
0.64257,1,-0,-0.84648,-0.90136,-0.11331,0.78071,0.94463,0.22516,-0.70487,0.38446
0.64659,1,-0,-0.84983,-0.89582,-0.094485,0.79622,0.93381,0.18812,-0.7355,0.34252
0.6506,1,-0,-0.85313,-0.89015,-0.075629,0.81124,0.92206,0.15082,-0.76469,0.30052
0.65462,1,-0,-0.85641,-0.88433,-0.056745,0.82573,0.90939,0.11331,-0.79239,0.25856
0.65863,1,-0,-0.85965,-0.87837,-0.037841,0.8397,0.89582,0.075629,-0.81855,0.21675
0.66265,1,-0,-0.86285,-0.87226,-0.018924,0.85313,0.88136,0.037841,-0.84311,0.17519
0.66667,1,-0,-0.86603,-0.86603,-1.2246e-16,0.86603,0.86603,2.4493e-16,-0.86603,0.13397
0.67068,1,-0,-0.86916,-0.85965,0.018924,0.87837,0.84983,-0.037841,-0.88725,0.09321
0.6747,1,-0,-0.87226,-0.85313,0.037841,0.89015,0.83278,-0.075629,-0.90675,0.052989
0.67871,1,-0,-0.87533,-0.84648,0.056745,0.90136,0.81491,-0.11331,-0.92448,0.013407
0.68273,1,-0,-0.87837,-0.8397,0.075629,0.912,0.79622,-0.15082,-0.94041,-0.025446
0.68675,1,-0,-0.88136,-0.83278,0.094485,0.92206,0.77675,-0.18812,-0.9545,-0.063481
0.69076,1,-0,-0.88433,-0.82573,0.11331,0.93153,0.7565,-0.22516,-0.96674,-0.10061
0.69478,1,-0,-0.88725,-0.81855,0.13209,0.94041,0.7355,-0.26186,-0.97709,-0.13675
0.6988,1,-0,-0.89015,-0.81124,0.15082,0.94869,0.71377,-0.2982,-0.98553,-0.17183
0.70281,1,-0,-0.893,-0.80379,0.1695,0.95637,0.69132,-0.3341,-0.99205,-0.20576
0.70683,1,-0,-0.89582,-0.79622,0.18812,0.96343,0.66819,-0.36953,-0.99664,-0.23847
0.71084,1,-0,-0.89861,-0.78853,0.20668,0.96989,0.6444,-0.40443,-0.99928,-0.26989
0.71486,1,-0,-0.90136,-0.78071,0.22516,0.97572,0.61996,-0.43875,-0.99998,-0.29995
0.71888,1,-0,-0.90407,-0.77276,0.24355,0.98094,0.59491,-0.47244,-0.99873,-0.3286
0.72289,1,-0,-0.90675,-0.76469,0.26186,0.98553,0.56926,-0.50545,-0.99553,-0.35577
0.72691,1,-0,-0.90939,-0.7565,0.28008,0.98949,0.54305,-0.53774,-0.99038,-0.3814
0.73092,1,-0,-0.912,-0.74819,0.2982,0.99283,0.5163,-0.56926,-0.98331,-0.40544
0.73494,1,-0,-0.91457,-0.73976,0.31621,0.99553,0.48903,-0.59997,-0.97432,-0.42785
0.73896,1,-0,-0.9171,-0.73121,0.3341,0.99759,0.46128,-0.62981,-0.96343,-0.44858
0.74297,1,-0,-0.9196,-0.72255,0.35188,0.99903,0.43307,-0.65875,-0.95067,-0.46759
0.74699,1,-0,-0.92206,-0.71377,0.36953,0.99982,0.40443,-0.68675,-0.93604,-0.48484
0.751,1,-0,-0.92448,-0.70487,0.38705,0.99998,0.37539,-0.71377,-0.9196,-0.5003
0.75502,1,-0,-0.92687,-0.69587,0.40443,0.9995,0.34597,-0.73976,-0.90136,-0.51395
0.75904,1,-0,-0.92922,-0.68675,0.42167,0.99839,0.31621,-0.76469,-0.88136,-0.52576
0.76305,1,-0,-0.93153,-0.67753,0.43875,0.99664,0.28613,-0.78853,-0.85965,-0.53571
0.76707,1,-0,-0.93381,-0.66819,0.45568,0.99425,0.25577,-0.81124,-0.83626,-0.54379
0.77108,1,-0,-0.93604,-0.65875,0.47244,0.99124,0.22516,-0.83278,-0.81124,-0.54998
0.7751,1,-0,-0.93825,-0.64921,0.48903,0.98759,0.19432,-0.85313,-0.78463,-0.55428
0.77912,1,-0,-0.94041,-0.63956,0.50545,0.98331,0.16328,-0.87226,-0.7565,-0.55668
0.78313,1,-0,-0.94254,-0.62981,0.52169,0.97841,0.13209,-0.89015,-0.72689,-0.55719
0.78715,1,-0,-0.94463,-0.61996,0.53774,0.97288,0.10076,-0.90675,-0.69587,-0.55582
0.79116,1,-0,-0.94668,-0.61001,0.5536,0.96674,0.069337,-0.92206,-0.66349,-0.55256
0.79518,1,-0,-0.94869,-0.59997,0.56926,0.95998,0.037841,-0.93604,-0.62981,-0.54743
0.7992,1,-0,-0.95067,-0.58982,0.58472,0.9526,0.0063084,-0.94869,-0.59491,-0.54046
0.80321,1,-0,-0.9526,-0.57959,0.59997,0.94463,-0.025231,-0.95998,-0.55884,-0.53165
0.80723,1,-0,-0.9545,-0.56926,0.615,0.93604,-0.056745,-0.96989,-0.52169,-0.52105
0.81124,1,-0,-0.95637,-0.55884,0.62981,0.92687,-0.088203,-0.97841,-0.48352,-0.50867
0.81526,1,-0,-0.95819,-0.54834,0.6444,0.9171,-0.11957,-0.98553,-0.44441,-0.49454
0.81928,1,-0,-0.95998,-0.53774,0.65875,0.90675,-0.15082,-0.99124,-0.40443,-0.47871
0.82329,1,-0,-0.96172,-0.52706,0.67287,0.89582,-0.18193,-0.99553,-0.36366,-0.4612
0.82731,1,-0,-0.96343,-0.5163,0.68675,0.88433,-0.21285,-0.99839,-0.32219,-0.44208
0.83133,1,-0,-0.9651,-0.50545,0.70038,0.87226,-0.24355,-0.99982,-0.28008,-0.42137
0.83534,1,-0,-0.96674,-0.49453,0.71377,0.85965,-0.27402,-0.99982,-0.23743,-0.39912
0.83936,1,-0,-0.96833,-0.48352,0.72689,0.84648,-0.30421,-0.99839,-0.19432,-0.3754
0.84337,1,-0,-0.96989,-0.47244,0.73976,0.83278,-0.3341,-0.99553,-0.15082,-0.35024
0.84739,1,-0,-0.9714,-0.46128,0.75236,0.81855,-0.36366,-0.99124,-0.10704,-0.32372
0.85141,1,-0,-0.97288,-0.45005,0.76469,0.80379,-0.39286,-0.98553,-0.063042,-0.29588
0.85542,1,-0,-0.97432,-0.43875,0.77675,0.78853,-0.42167,-0.97841,-0.018924,-0.26679
0.85944,1,-0,-0.97572,-0.42738,0.78853,0.77276,-0.45005,-0.96989,0.025231,-0.23652
0.86345,1,-0,-0.97709,-0.41594,0.80003,0.7565,-0.47799,-0.95998,0.069337,-0.20513
0.86747,1,-0,-0.97841,-0.40443,0.81124,0.73976,-0.50545,-0.94869,0.11331,-0.17268
0.87149,1,-0,-0.97969,-0.39286,0.82216,0.72255,-0.53241,-0.93604,0.15706,-0.13925
0.8755,1,-0,-0.98094,-0.38123,0.83278,0.70487,-0.55884,-0.92206,0.2005,-0.10491
0.87952,1,-0,-0.98215,-0.36953,0.84311,0.68675,-0.58472,-0.90675,0.24355,-0.069733
0.88353,1,-0,-0.98331,-0.35778,0.85313,0.66819,-0.61001,-0.89015,0.28613,-0.033791
0.88755,1,-0,-0.98444,-0.34597,0.86285,0.64921,-0.6347,-0.87226,0.32815,0.0028415
0.89157,1,-0,-0.98553,-0.3341,0.87226,0.62981,-0.65875,-0.85313,0.36953,0.040087
0.89558,1,-0,-0.98658,-0.32219,0.88136,0.61001,-0.68215,-0.83278,0.41019,0.077868
0.8996,1,-0,-0.98759,-0.31022,0.89015,0.58982,-0.70487,-0.81124,0.45005,0.11611
0.90361,1,-0,-0.98856,-0.2982,0.89861,0.56926,-0.72689,-0.78853,0.48903,0.15473
0.90763,1,-0,-0.98949,-0.28613,0.90675,0.54834,-0.74819,-0.76469,0.52706,0.19365
0.91165,1,-0,-0.99038,-0.27402,0.91457,0.52706,-0.76874,-0.73976,0.56406,0.23279
0.91566,1,-0,-0.99124,-0.26186,0.92206,0.50545,-0.78853,-0.71377,0.59997,0.27208
0.91968,1,-0,-0.99205,-0.24967,0.92922,0.48352,-0.80753,-0.68675,0.6347,0.31144
0.92369,1,-0,-0.99283,-0.23743,0.93604,0.46128,-0.82573,-0.65875,0.66819,0.35078
0.92771,1,-0,-0.99356,-0.22516,0.94254,0.43875,-0.84311,-0.62981,0.70038,0.39003
0.93173,1,-0,-0.99425,-0.21285,0.94869,0.41594,-0.85965,-0.59997,0.73121,0.42912
0.93574,1,-0,-0.99491,-0.2005,0.9545,0.39286,-0.87533,-0.56926,0.76061,0.46797
0.93976,1,-0,-0.99553,-0.18812,0.95998,0.36953,-0.89015,-0.53774,0.78853,0.5065
0.94378,1,-0,-0.9961,-0.17572,0.9651,0.34597,-0.90407,-0.50545,0.81491,0.54463
0.94779,1,-0,-0.99664,-0.16328,0.96989,0.32219,-0.9171,-0.47244,0.8397,0.58231
0.95181,1,-0,-0.99714,-0.15082,0.97432,0.2982,-0.92922,-0.43875,0.86285,0.61945
0.95582,1,-0,-0.99759,-0.13834,0.97841,0.27402,-0.94041,-0.40443,0.88433,0.65598
0.95984,1,-0,-0.99801,-0.12583,0.98215,0.24967,-0.95067,-0.36953,0.90407,0.69184
0.96386,1,-0,-0.99839,-0.11331,0.98553,0.22516,-0.95998,-0.3341,0.92206,0.72697
0.96787,1,-0,-0.99873,-0.10076,0.98856,0.2005,-0.96833,-0.2982,0.93825,0.76129
0.97189,1,-0,-0.99903,-0.088203,0.99124,0.17572,-0.97572,-0.26186,0.9526,0.79474
0.9759,1,-0,-0.99928,-0.075629,0.99356,0.15082,-0.98215,-0.22516,0.9651,0.82728
0.97992,1,-0,-0.9995,-0.063042,0.99553,0.12583,-0.98759,-0.18812,0.97572,0.85882
0.98394,1,-0,-0.99968,-0.050446,0.99714,0.10076,-0.99205,-0.15082,0.98444,0.88934
0.98795,1,-0,-0.99982,-0.037841,0.99839,0.075629,-0.99553,-0.11331,0.99124,0.91876
0.99197,1,-0,-0.99992,-0.025231,0.99928,0.050446,-0.99801,-0.075629,0.9961,0.94704
0.99598,1,-0,-0.99998,-0.012617,0.99982,0.025231,-0.9995,-0.037841,0.99903,0.97414
1,1,-0,-1,-1.2246e-16,1,2.4493e-16,-1,-3.6739e-16,1,1
