xi,s1,s2
0,4.54694625955279e-25,-3.94061771679598e-25
0.01,0.0194924867834859,0.0240937761504997
0.02,0.0356180980102439,0.0452482989024763
0.03,0.049040424907912,0.0640091258062078
0.04,0.0603174750241047,0.0808361140727517
0.05,0.0699113272589524,0.0961112519836986
0.06,0.0781977868976405,0.110146490300925
0.07,0.0854760406429496,0.123191573676347
0.08,0.0919783116477949,0.135441872061673
0.09,0.0978795145477657,0.147046212118156
0.1,0.103306910493665,0.15811470862635
0.11,0.108349762184049,0.16872659589586
0.12,0.113068988897768,0.178938059175095
0.13,0.11750681909991,0.18879006409171
0.14,0.121695867945161,0.198315719365576
0.15,0.125664133251398,0.207544327135271
0.16,0.129435909943519,0.216502120898081
0.17,0.133032129394683,0.225212536722536
0.18,0.13647069634096,0.233696482491634
0.19,0.139766825795979,0.241972607146065
0.2,0.142933379965573,0.250057569927431
0.21,0.145981205162431,0.257966309621471
0.22,0.148919468720743,0.265712313801282
0.23,0.151755995910852,0.273307888070543
0.24,0.154497606853897,0.280764425306737
0.25,0.157150453436463,0.288092674904376
0.26,0.15972035306672,0.295303009335929
0.27,0.162213040309278,0.302405620973181
0.28,0.164634210058321,0.309410541877365
0.29,0.166989478589468,0.316327593849716
0.3,0.169284341453116,0.323166335799739
0.31,0.171524131367789,0.329936011113474
0.32,0.173713976113476,0.336645495021758
0.33,0.175858756424984,0.343303241968497
0.34,0.177963063885281,0.349917232978924
0.35,0.180031158818838,0.356494923027871
0.36,0.18206692818498,0.36304318840803
0.37,0.184073843471227,0.369568274098219
0.38,0.186054918611145,0.376075741160808
0.39,0.188012673709755,0.382570421049762
0.4,0.189949139985437,0.389056418963686
0.41,0.19186590592834,0.395537166243852
0.42,0.193764169266342,0.402015479682869
0.43,0.195644788955526,0.408493620862489
0.44,0.197508337170642,0.41497335549143
0.45,0.199355151295579,0.421456012743187
0.46,0.201185385913833,0.427942544593853
0.47,0.202999064798976,0.43443358515993
0.48,0.204796132905126,0.44092951003615
0.49,0.206576508357413,0.44743049563329
0.5,0.20834013444245,0.453936578515984
0.51,0.210087031138441,0.460447714835389
0.52,0.211817334675946,0.466963842227746
0.53,0.213531306714922,0.473484947972559
0.54,0.215229331552415,0.480011139616682
0.55,0.216911912869898,0.486542715693248
0.56,0.218579670480608,0.493080236440594
0.57,0.220233337076876,0.499624594521193
0.58,0.221873754977468,0.50617708574058
0.59,0.223501872874921,0.51273947976628
0.6,0.225118742582871,0.51931409084674
0.61,0.226725515783397,0.525903848530253
0.62,0.228323440774352,0.532512368383886
0.63,0.229913859215572,0.539144022680421
0.64,0.231498202607168,0.545804003502787
0.65,0.233077986866499,0.552498332035186
0.66,0.234654805003792,0.559233814040893
0.67,0.236230319529867,0.566017987757566
0.68,0.237806254862727,0.572859071760559
0.69,0.23938438973415,0.579765912826234
0.7,0.240966549596278,0.586747933795278
0.71,0.242554599028212,0.593815081436016
0.72,0.2441504341426,0.600977774307725
0.73,0.245755974992229,0.608246850623948
0.74,0.247373157976617,0.615633516115806
0.75,0.249003928248604,0.623149291895316
0.76,0.250650232700926,0.630805965711674
0.77,0.25231402803234,0.638615631424798
0.78,0.253997327092624,0.646590952414989
0.79,0.255702260307115,0.654745513209844
0.8,0.25743113768125,0.663094174504148
0.81,0.259186510805084,0.671653428179764
0.82,0.260971234857829,0.680441752325515
0.83,0.262788530612382,0.689479966257078
0.84,0.264642046439852,0.698791585536868
0.85,0.266535920314092,0.708403176993931
0.86,0.268474841816228,0.718344713743829
0.87,0.270464114139192,0.728649930208529
0.88,0.272509716522021,0.739356680305809
0.89,0.274618468540439,0.750508046814211
0.9,0.276798917276154,0.762158781865734
0.91,0.279062947364874,0.774387078566258
0.92,0.281427492900599,0.787307093791519
0.93,0.283916249769687,0.801081474152603
0.94,0.286561387984919,0.815933881961436
0.95,0.289405264019566,0.83216152119628
0.96,0.292502133141453,0.85014766346722
0.97,0.295919861747023,0.870374173981662
0.98,0.299741639695405,0.89343403750982
0.99,0.304067692642482,0.920043884350213
1,0.309016994374947,0.951056516295154
