xi,s1,s2
0,6.06899643193699e-27,-1.03980289150285e-26
0.01,0.0069868369392849,-0.0298559815147022
0.02,0.0133031304774796,-0.0556978932841394
0.03,0.019086348421144,-0.0782777771046325
0.04,0.0244499990541363,-0.0982196180154388
0.05,0.0294868101227663,-0.116035561183341
0.06,0.034271679149083,-0.132141001424632
0.07,0.0388643950722945,-0.146868545364496
0.08,0.0433121312183212,-0.160480846233786
0.09,0.0476517095974819,-0.173182311303198
0.1,0.0519116365303131,-0.185129681954842
0.11,0.056113909601521,-0.196441486391206
0.12,0.0602755959420667,-0.207206364981521
0.13,0.0644101818393849,-0.217490268245523
0.14,0.0685286936757343,-0.227342527474602
0.15,0.0726405901946827,-0.23680079799036
0.16,0.0767544260957237,-0.245894875040557
0.17,0.0808782869574712,-0.254649382334585
0.18,0.0850199973044006,-0.26308534192459
0.19,0.08918714132037,-0.271220814922917
0.2,0.0933870126963649,-0.279071171827498
0.21,0.0976265620180675,-0.286649320585874
0.22,0.101912348429813,-0.293965924712084
0.23,0.10625049560334,-0.301029611592673
0.24,0.110646652011336,-0.307847170981825
0.25,0.115105955505781,-0.314423743685615
0.26,0.119633002201076,-0.320763000435392
0.27,0.124231819661976,-0.326867310950273
0.28,0.128905844396312,-0.332737903188775
0.29,0.133657903652513,-0.338375012789557
0.3,0.138490201521912,-0.34377802270129
0.31,0.143404309345859,-0.348945593001658
0.32,0.148401160427621,-0.353875780905463
0.33,0.153481049049078,-0.358566150961876
0.34,0.158643633792075,-0.363013875441384
0.35,0.163887945131222,-0.367215825053197
0.36,0.169212396960981,-0.371168651422084
0.37,0.17461480148288,-0.374868863758077
0.38,0.180092387258147,-0.37831290054427
0.39,0.185641820416815,-0.38149719628062
0.4,0.191259229023301,-0.384418243283764
0.41,0.196940230598455,-0.387072648542848
0.42,0.202679962798079,-0.389457185631373
0.43,0.208473117247923,-0.391568841675059
0.44,0.214313976535143,-0.393404859375716
0.45,0.220196454356239,-0.394962774091136
0.46,0.226114138821458,-0.396240445970997
0.47,0.232060338915673,-0.39723608714878
0.48,0.238028134115728,-0.397948283989708
0.49,0.244010427164264,-0.398376014394691
0.5,0.25,-0.398518660160289
0.51,0.255989572835736,-0.398376014394691
0.52,0.261971865884272,-0.397948283989708
0.53,0.267939661084327,-0.39723608714878
0.54,0.273885861178542,-0.396240445970996
0.55,0.279803545643761,-0.394962774091136
0.56,0.285686023464857,-0.393404859375716
0.57,0.291526882752077,-0.391568841675059
0.58,0.297320037201921,-0.389457185631373
0.59,0.303059769401545,-0.387072648542848
0.6,0.308740770976699,-0.384418243283764
0.61,0.314358179583185,-0.38149719628062
0.62,0.319907612741853,-0.37831290054427
0.63,0.32538519851712,-0.374868863758077
0.64,0.330787603039019,-0.371168651422084
0.65,0.336112054868778,-0.367215825053197
0.66,0.341356366207925,-0.363013875441384
0.67,0.346518950950922,-0.358566150961875
0.68,0.351598839572379,-0.353875780905463
0.69,0.356595690654141,-0.348945593001658
0.7,0.361509798478088,-0.34377802270129
0.71,0.366342096347487,-0.338375012789557
0.72,0.371094155603687,-0.332737903188775
0.73,0.375768180338024,-0.326867310950273
0.74,0.380366997798924,-0.320763000435392
0.75,0.384894044494219,-0.314423743685615
0.76,0.389353347988664,-0.307847170981825
0.77,0.393749504396661,-0.301029611592673
0.78,0.398087651570187,-0.293965924712084
0.79,0.402373437981933,-0.286649320585874
0.8,0.406612987303635,-0.279071171827498
0.81,0.41081285867963,-0.271220814922917
0.82,0.414980002695599,-0.26308534192459
0.83,0.419121713042529,-0.254649382334585
0.84,0.423245573904276,-0.245894875040557
0.85,0.427359409805317,-0.23680079799036
0.86,0.431471306324266,-0.227342527474602
0.87,0.435589818160615,-0.217490268245523
0.88,0.439724404057933,-0.207206364981521
0.89,0.443886090398479,-0.196441486391205
0.9,0.448088363469687,-0.185129681954842
0.91,0.452348290402518,-0.173182311303198
0.92,0.456687868781679,-0.160480846233786
0.93,0.461135604927706,-0.146868545364496
0.94,0.465728320850917,-0.132141001424632
0.95,0.470513189877234,-0.116035561183341
0.96,0.475550000945864,-0.0982196180154389
0.97,0.480913651578856,-0.0782777771046326
0.98,0.48669686952252,-0.0556978932841395
0.99,0.493013163060715,-0.0298559815147022
1,0.5,-5.34414300123525e-26
