xi,s1,s2
0,-2.86018044993977e-27,6.21832458739077e-27
0.01,-0.00327159090434843,-0.0163240172296065
0.02,-0.00648390218426162,-0.0322265002175183
0.03,-0.00963693383973958,-0.0477074489637351
0.04,-0.0127306858707823,-0.0627668634682571
0.05,-0.0157651582773898,-0.0774047437310842
0.06,-0.0187403510595621,-0.0916210897522165
0.07,-0.0216562642172991,-0.105415901531654
0.08,-0.0245128977506009,-0.118789179069397
0.09,-0.0273102516594674,-0.131740922365444
0.1,-0.0300483259438987,-0.144271131419797
0.11,-0.0327271206038948,-0.156379806232455
0.12,-0.0353466356394557,-0.168066946803418
0.13,-0.0379068710505813,-0.179332553132687
0.14,-0.0404078268372717,-0.19017662522026
0.15,-0.0428495029995268,-0.200599163066139
0.16,-0.0452318995373467,-0.210600166670323
0.17,-0.0475550164507314,-0.220179636032812
0.18,-0.0498188537396808,-0.229337571153606
0.19,-0.052023411404195,-0.238073972032705
0.2,-0.054168689444274,-0.246388838670109
0.21,-0.0563127719625278,-0.254486188332285
0.22,-0.0585137430615666,-0.262570038285699
0.23,-0.0607716027413903,-0.270640388530351
0.24,-0.0630863510019989,-0.278697239066241
0.25,-0.0654579878433924,-0.286740589893369
0.26,-0.0678865132655709,-0.294770441011736
0.27,-0.0703719272685344,-0.30278679242134
0.28,-0.0729142298522827,-0.310789644122182
0.29,-0.075513421016816,-0.318778996114262
0.3,-0.0781695007621342,-0.32675484839758
0.31,-0.0808824690882374,-0.334717200972137
0.32,-0.0836523259951255,-0.342666053837931
0.33,-0.0864790714827985,-0.350601406994963
0.34,-0.0893627055512564,-0.358523260443234
0.35,-0.0923032282004993,-0.366431614182742
0.36,-0.0953006394305271,-0.374326468213488
0.37,-0.0983549392413399,-0.382207822535473
0.38,-0.101466127632938,-0.390075677148695
0.39,-0.10463420460532,-0.397930032053156
0.4,-0.107859170158488,-0.405770887248854
0.41,-0.110985669710509,-0.413623672871649
0.42,-0.113858348679455,-0.4215138190574
0.43,-0.116477207065324,-0.429441325806106
0.44,-0.118842244868116,-0.437406193117768
0.45,-0.120953462087832,-0.445408420992385
0.46,-0.122810858724471,-0.453448009429957
0.47,-0.124414434778034,-0.461524958430485
0.48,-0.12576419024852,-0.469639267993968
0.49,-0.12686012513593,-0.477790938120407
0.5,-0.127702239440264,-0.485979968809801
0.51,-0.128290533161521,-0.494206360062151
0.52,-0.128625006299701,-0.502470111877456
0.53,-0.128705658854805,-0.510771224255716
0.54,-0.128532490826832,-0.519109697196932
0.55,-0.128105502215783,-0.527485530701103
0.56,-0.127424693021658,-0.53589872476823
0.57,-0.126490063244456,-0.544349279398312
0.58,-0.125301612884178,-0.55283719459135
0.59,-0.123859341940823,-0.561362470347343
0.6,-0.122163250414391,-0.569925106666292
0.61,-0.120184792465895,-0.578392775947206
0.62,-0.117895422256345,-0.586633150589096
0.63,-0.115295139785743,-0.594646230591963
0.64,-0.112383945054087,-0.602432015955806
0.65,-0.109161838061377,-0.609990506680625
0.66,-0.105628818807615,-0.617321702766421
0.67,-0.101784887292799,-0.624425604213192
0.68,-0.0976300435169304,-0.63130221102094
0.69,-0.0931642874800084,-0.637951523189664
0.7,-0.088387619182033,-0.644373540719364
0.71,-0.0833000386230045,-0.650568263610041
0.72,-0.0779015458029227,-0.656535691861694
0.73,-0.0721921407217877,-0.662275825474323
0.74,-0.0661718233795994,-0.667788664447928
0.75,-0.0598405937763579,-0.673074208782509
0.76,-0.0531984519120632,-0.678132458478067
0.77,-0.0462453977867153,-0.6829634135346
0.78,-0.0389814314003141,-0.68756707395211
0.79,-0.0314065527528597,-0.691943439730597
0.8,-0.0235207618443521,-0.696092510870059
0.81,-0.0152819955125026,-0.699850281125353
0.82,-0.00664819059502243,-0.703052744251335
0.83,0.00238065290808844,-0.705699900248005
0.84,0.01180453499683,-0.707791749115363
0.85,0.0216234556712021,-0.709328290853408
0.86,0.031837414931205,-0.710309525462141
0.87,0.0424464127768384,-0.710735452941561
0.88,0.0534504492081026,-0.710606073291669
0.89,0.0648495242249974,-0.709921386512465
0.9,0.0766436378275228,-0.708681392603949
0.91,0.0888327900156789,-0.70688609156612
0.92,0.101416980789466,-0.704535483398979
0.93,0.114396210148883,-0.701629568102526
0.94,0.127770478093931,-0.69816834567676
0.95,0.14153978462461,-0.694151816121682
0.96,0.155704129740919,-0.689579979437292
0.97,0.170263513442859,-0.684452835623589
0.98,0.18521793573043,-0.678770384680574
0.99,0.200567396603631,-0.672532626608247
1,0.216311896062463,-0.665739561406608
