xi,s1,s2
0,0,0
0.01,0.00561116943468212,-0.00838790376996583
0.02,0.0113007859311712,-0.016721247613979
0.03,0.0170705597976449,-0.0249977467058308
0.04,0.0229222287038444,-0.033214999694449
0.05,0.0288575556294113,-0.0413704825804323
0.06,0.0348783264014997,-0.0494615423505345
0.07,0.0409863467723348,-0.0574853903797273
0.08,0.0471834389829699,-0.0654390956152283
0.09,0.0534714377549337,-0.0733195775625315
0.1,0.059852185646837,-0.0811235991001459
0.11,0.0663275277084138,-0.0888477591575696
0.12,0.0728993053600095,-0.0964884853001218
0.13,0.079569349421387,-0.104042026274769
0.14,0.086339472210055,-0.11150444458314
0.15,0.0932114586264038,-0.118871609161664
0.16,0.100187056141031,-0.126139188264253
0.17,0.107267963599123,-0.133302642660327
0.18,0.11445581875803,-0.14035721928022
0.19,0.121752184477715,-0.147297945461069
0.2,0.129158533490131,-0.154119623969185
0.21,0.136676231683398,-0.160816828999211
0.22,0.14430651985059,-0.167383903375967
0.23,0.152050493871705,-0.173814957211027
0.24,0.159909083321791,-0.180103868292249
0.25,0.167883028528859,-0.186244284509539
0.26,0.175972856142905,-0.192229628643032
0.27,0.184178853322603,-0.198053105858962
0.28,0.192501040699326,-0.203707714272042
0.29,0.200939144339237,-0.20918625893908
0.3,0.20949256699286,-0.214481369644352
0.31,0.218160358996943,-0.219585522820495
0.32,0.226941189274034,-0.224491067916559
0.33,0.23583331695877,-0.229190258474883
0.34,0.244834564263231,-0.233675288108168
0.35,0.25394229127293,-0.23793833147575
0.36,0.263153373435134,-0.24197159024263
0.37,0.272464182556597,-0.24576734386643
0.38,0.281870572162356,-0.249318004897798
0.39,0.291367868074431,-0.252616178302349
0.4,0.300950865043171,-0.255654724122467
0.41,0.310613830199194,-0.258426822602769
0.42,0.320350513986717,-0.260926040713306
0.43,0.330154169088043,-0.263146398830764
0.44,0.340017577655289,-0.265082436192267
0.45,0.349933086933715,-0.266729273631152
0.46,0.359892653099249,-0.26808267205074
0.47,0.369887892852399,-0.269139085100039
0.48,0.379910142025981,-0.269895704590548
0.49,0.389950520190929,-0.270350497337946
0.5,0.4,-0.27050223232332
0.51,0.410049479809071,-0.270350497337946
0.52,0.42008985797402,-0.269895704590548
0.53,0.430112107147601,-0.269139085100039
0.54,0.440107346900751,-0.26808267205074
0.55,0.450066913066285,-0.266729273631152
0.56,0.459982422344711,-0.265082436192267
0.57,0.469845830911957,-0.263146398830764
0.58,0.479649486013283,-0.260926040713306
0.59,0.489386169800806,-0.258426822602769
0.6,0.499049134956829,-0.255654724122467
0.61,0.50863213192557,-0.252616178302349
0.62,0.518129427837644,-0.249318004897798
0.63,0.527535817443403,-0.24576734386643
0.64,0.536846626564866,-0.24197159024263
0.65,0.54605770872707,-0.23793833147575
0.66,0.555165435736769,-0.233675288108168
0.67,0.56416668304123,-0.229190258474883
0.68,0.573058810725966,-0.224491067916559
0.69,0.581839641003057,-0.219585522820495
0.7,0.59050743300714,-0.214481369644352
0.71,0.599060855660763,-0.20918625893908
0.72,0.607498959300674,-0.203707714272042
0.73,0.615821146677398,-0.198053105858962
0.74,0.624027143857096,-0.192229628643032
0.75,0.632116971471141,-0.186244284509538
0.76,0.640090916678209,-0.180103868292249
0.77,0.647949506128295,-0.173814957211027
0.78,0.65569348014941,-0.167383903375967
0.79,0.663323768316602,-0.160816828999211
0.8,0.670841466509869,-0.154119623969185
0.81,0.678247815522285,-0.147297945461069
0.82,0.68554418124197,-0.14035721928022
0.83,0.692732036400877,-0.133302642660327
0.84,0.699812943858969,-0.126139188264253
0.85,0.706788541373596,-0.118871609161664
0.86,0.713660527789945,-0.11150444458314
0.87,0.720430650578613,-0.104042026274769
0.88,0.727100694639991,-0.0964884853001218
0.89,0.733672472291586,-0.0888477591575696
0.9,0.740147814353163,-0.0811235991001459
0.91,0.746528562245067,-0.0733195775625315
0.92,0.75281656101703,-0.0654390956152283
0.93,0.759013653227665,-0.0574853903797271
0.94,0.765121673598501,-0.0494615423505344
0.95,0.771142444370589,-0.0413704825804323
0.96,0.777077771296156,-0.0332149996944489
0.97,0.782929440202355,-0.0249977467058309
0.98,0.788699214068829,-0.016721247613979
0.99,0.794388830565318,-0.00838790376996593
1,0.8,0
