x,b0,b1,b2,b3,b4,b5,b6,b7,b8,b9,b10,b11,b12,b13,b14,b15,b16,b17,b18,b19,s
0,1,-0,-0,-0,-0,-0,-0,-0,-0,-0,-0,-0,-0,-0,-0,-0,-0,-0,-0,-0,1
0.0040161,1,-0,-0.0063084,-0.012617,-0.018924,-0.025231,-0.031537,-0.037841,-0.044145,-0.050446,-0.056745,-0.063042,-0.069337,-0.075629,-0.081918,-0.088203,-0.094485,-0.10076,-0.10704,-0.11331,-0.077517
0.0080321,1,-0,-0.012617,-0.025231,-0.037841,-0.050446,-0.063042,-0.075629,-0.088203,-0.10076,-0.11331,-0.12583,-0.13834,-0.15082,-0.16328,-0.17572,-0.18812,-0.2005,-0.21285,-0.22516,-1.1477
0.012048,1,-0,-0.018924,-0.037841,-0.056745,-0.075629,-0.094485,-0.11331,-0.13209,-0.15082,-0.1695,-0.18812,-0.20668,-0.22516,-0.24355,-0.26186,-0.28008,-0.2982,-0.31621,-0.3341,-2.2033
0.016064,1,-0,-0.025231,-0.050446,-0.075629,-0.10076,-0.12583,-0.15082,-0.17572,-0.2005,-0.22516,-0.24967,-0.27402,-0.2982,-0.32219,-0.34597,-0.36953,-0.39286,-0.41594,-0.43875,-3.2372
0.02008,1,-0,-0.031537,-0.063042,-0.094485,-0.12583,-0.15706,-0.18812,-0.21901,-0.24967,-0.28008,-0.31022,-0.34004,-0.36953,-0.39865,-0.42738,-0.45568,-0.48352,-0.51089,-0.53774,-4.2425
0.024096,1,-0,-0.037841,-0.075629,-0.11331,-0.15082,-0.18812,-0.22516,-0.26186,-0.2982,-0.3341,-0.36953,-0.40443,-0.43875,-0.47244,-0.50545,-0.53774,-0.56926,-0.59997,-0.62981,-5.2124
0.028112,1,-0,-0.044145,-0.088203,-0.13209,-0.17572,-0.21901,-0.26186,-0.30421,-0.34597,-0.38705,-0.42738,-0.46687,-0.50545,-0.54305,-0.57959,-0.615,-0.64921,-0.68215,-0.71377,-6.1407
0.032129,1,-0,-0.050446,-0.10076,-0.15082,-0.2005,-0.24967,-0.2982,-0.34597,-0.39286,-0.43875,-0.48352,-0.52706,-0.56926,-0.61001,-0.64921,-0.68675,-0.72255,-0.7565,-0.78853,-7.0214
0.036145,1,-0,-0.056745,-0.11331,-0.1695,-0.22516,-0.28008,-0.3341,-0.38705,-0.43875,-0.48903,-0.53774,-0.58472,-0.62981,-0.67287,-0.71377,-0.75236,-0.78853,-0.82216,-0.85313,-7.8488
0.040161,1,-0,-0.063042,-0.12583,-0.18812,-0.24967,-0.31022,-0.36953,-0.42738,-0.48352,-0.53774,-0.58982,-0.63956,-0.68675,-0.73121,-0.77276,-0.81124,-0.84648,-0.87837,-0.90675,-8.618
0.044177,1,-0,-0.069337,-0.13834,-0.20668,-0.27402,-0.34004,-0.40443,-0.46687,-0.52706,-0.58472,-0.63956,-0.69132,-0.73976,-0.78463,-0.82573,-0.86285,-0.89582,-0.92448,-0.94869,-9.3244
0.048193,1,-0,-0.075629,-0.15082,-0.22516,-0.2982,-0.36953,-0.43875,-0.50545,-0.56926,-0.62981,-0.68675,-0.73976,-0.78853,-0.83278,-0.87226,-0.90675,-0.93604,-0.95998,-0.97841,-9.9639
0.052209,1,-0,-0.081918,-0.16328,-0.24355,-0.32219,-0.39865,-0.47244,-0.54305,-0.61001,-0.67287,-0.73121,-0.78463,-0.83278,-0.87533,-0.912,-0.94254,-0.96674,-0.98444,-0.99553,-10.533
0.056225,1,-0,-0.088203,-0.17572,-0.26186,-0.34597,-0.42738,-0.50545,-0.57959,-0.64921,-0.71377,-0.77276,-0.82573,-0.87226,-0.912,-0.94463,-0.96989,-0.98759,-0.99759,-0.99982,-11.029
0.060241,1,-0,-0.094485,-0.18812,-0.28008,-0.36953,-0.45568,-0.53774,-0.615,-0.68675,-0.75236,-0.81124,-0.86285,-0.90675,-0.94254,-0.96989,-0.98856,-0.99839,-0.99928,-0.99124,-11.45
0.064257,1,-0,-0.10076,-0.2005,-0.2982,-0.39286,-0.48352,-0.56926,-0.64921,-0.72255,-0.78853,-0.84648,-0.89582,-0.93604,-0.96674,-0.98759,-0.99839,-0.99903,-0.98949,-0.96989,-11.795
0.068273,1,-0,-0.10704,-0.21285,-0.31621,-0.41594,-0.51089,-0.59997,-0.68215,-0.7565,-0.82216,-0.87837,-0.92448,-0.95998,-0.98444,-0.99759,-0.99928,-0.98949,-0.96833,-0.93604,-12.062
0.072289,1,-0,-0.11331,-0.22516,-0.3341,-0.43875,-0.53774,-0.62981,-0.71377,-0.78853,-0.85313,-0.90675,-0.94869,-0.97841,-0.99553,-0.99982,-0.99124,-0.96989,-0.93604,-0.89015,-12.251
0.076305,1,-0,-0.11957,-0.23743,-0.35188,-0.46128,-0.56406,-0.65875,-0.74399,-0.81855,-0.88136,-0.93153,-0.96833,-0.99124,-0.99992,-0.99425,-0.97432,-0.94041,-0.893,-0.83278,-12.363
0.080321,1,-0,-0.12583,-0.24967,-0.36953,-0.48352,-0.58982,-0.68675,-0.77276,-0.84648,-0.90675,-0.9526,-0.98331,-0.99839,-0.99759,-0.98094,-0.94869,-0.90136,-0.8397,-0.76469,-12.398
0.084337,1,-0,-0.13209,-0.26186,-0.38705,-0.50545,-0.615,-0.71377,-0.80003,-0.87226,-0.92922,-0.96989,-0.99356,-0.99982,-0.98856,-0.95998,-0.91457,-0.85313,-0.77675,-0.68675,-12.36
0.088353,1,-0,-0.13834,-0.27402,-0.40443,-0.52706,-0.63956,-0.73976,-0.82573,-0.89582,-0.94869,-0.98331,-0.99903,-0.99553,-0.97288,-0.93153,-0.87226,-0.79622,-0.70487,-0.59997,-12.249
0.092369,1,-0,-0.14459,-0.28613,-0.42167,-0.54834,-0.66349,-0.76469,-0.84983,-0.9171,-0.9651,-0.99283,-0.99968,-0.98553,-0.95067,-0.89582,-0.82216,-0.73121,-0.6249,-0.50545,-12.069
0.096386,1,-0,-0.15082,-0.2982,-0.43875,-0.56926,-0.68675,-0.78853,-0.87226,-0.93604,-0.97841,-0.99839,-0.99553,-0.96989,-0.92206,-0.85313,-0.76469,-0.65875,-0.53774,-0.40443,-11.824
0.1004,1,-0,-0.15706,-0.31022,-0.45568,-0.58982,-0.70933,-0.81124,-0.893,-0.9526,-0.98856,-0.99998,-0.98658,-0.94869,-0.88725,-0.80379,-0.70038,-0.57959,-0.44441,-0.2982,-11.516
0.10442,1,-0,-0.16328,-0.32219,-0.47244,-0.61001,-0.73121,-0.83278,-0.912,-0.96674,-0.99553,-0.99759,-0.97288,-0.92206,-0.84648,-0.74819,-0.62981,-0.49453,-0.34597,-0.18812,-11.152
0.10843,1,-0,-0.1695,-0.3341,-0.48903,-0.62981,-0.75236,-0.85313,-0.92922,-0.97841,-0.99928,-0.99124,-0.9545,-0.89015,-0.80003,-0.68675,-0.5536,-0.40443,-0.24355,-0.075629,-10.735
0.11245,1,-0,-0.17572,-0.34597,-0.50545,-0.64921,-0.77276,-0.87226,-0.94463,-0.98759,-0.99982,-0.98094,-0.93153,-0.85313,-0.74819,-0.61996,-0.47244,-0.31022,-0.13834,0.037841,-10.27
0.11647,1,-0,-0.18193,-0.35778,-0.52169,-0.66819,-0.79239,-0.89015,-0.95819,-0.99425,-0.99714,-0.96674,-0.90407,-0.81124,-0.69132,-0.54834,-0.38705,-0.21285,-0.031537,0.15082,-9.764
0.12048,1,-0,-0.18812,-0.36953,-0.53774,-0.68675,-0.81124,-0.90675,-0.96989,-0.99839,-0.99124,-0.94869,-0.87226,-0.76469,-0.62981,-0.47244,-0.2982,-0.11331,0.075629,0.26186,-9.2216
0.1245,1,-0,-0.19432,-0.38123,-0.5536,-0.70487,-0.82927,-0.92206,-0.97969,-0.99998,-0.98215,-0.92687,-0.83626,-0.71377,-0.56406,-0.39286,-0.20668,-0.012617,0.18193,0.36953,-8.6488
0.12851,1,-0,-0.2005,-0.39286,-0.56926,-0.72255,-0.84648,-0.93604,-0.98759,-0.99903,-0.96989,-0.90136,-0.79622,-0.65875,-0.49453,-0.31022,-0.11331,0.088203,0.28613,0.47244,-8.0518
0.13253,1,-0,-0.20668,-0.40443,-0.58472,-0.73976,-0.86285,-0.94869,-0.99356,-0.99553,-0.9545,-0.87226,-0.75236,-0.59997,-0.42167,-0.22516,-0.018924,0.18812,0.38705,0.56926,-7.4366
0.13655,1,-0,-0.21285,-0.41594,-0.59997,-0.7565,-0.87837,-0.95998,-0.99759,-0.98949,-0.93604,-0.8397,-0.70487,-0.53774,-0.34597,-0.13834,0.075629,0.28613,0.48352,0.65875,-6.8093
0.14056,1,-0,-0.21901,-0.42738,-0.615,-0.77276,-0.893,-0.96989,-0.99968,-0.98094,-0.91457,-0.80379,-0.65399,-0.47244,-0.26795,-0.050446,0.1695,0.38123,0.57444,0.73976,-6.1759
0.14458,1,-0,-0.22516,-0.43875,-0.62981,-0.78853,-0.90675,-0.97841,-0.99982,-0.96989,-0.89015,-0.76469,-0.59997,-0.40443,-0.18812,0.037841,0.26186,0.47244,0.65875,0.81124,-5.5423
0.14859,1,-0,-0.2313,-0.45005,-0.6444,-0.80379,-0.9196,-0.98553,-0.99801,-0.95637,-0.86285,-0.72255,-0.54305,-0.3341,-0.10704,0.12583,0.35188,0.55884,0.7355,0.87226,-4.9143
0.15261,1,-0,-0.23743,-0.46128,-0.65875,-0.81855,-0.93153,-0.99124,-0.99425,-0.94041,-0.83278,-0.67753,-0.48352,-0.26186,-0.025231,0.21285,0.43875,0.63956,0.80379,0.92206,-4.2974
0.15663,1,-0,-0.24355,-0.47244,-0.67287,-0.83278,-0.94254,-0.99553,-0.98856,-0.92206,-0.80003,-0.62981,-0.42167,-0.18812,0.056745,0.2982,0.52169,0.71377,0.86285,0.95998,-3.6967
0.16064,1,-0,-0.24967,-0.48352,-0.68675,-0.84648,-0.9526,-0.99839,-0.98094,-0.90136,-0.76469,-0.57959,-0.35778,-0.11331,0.13834,0.38123,0.59997,0.78071,0.912,0.98553,-3.1173
0.16466,1,-0,-0.25577,-0.49453,-0.70038,-0.85965,-0.96172,-0.99982,-0.9714,-0.87837,-0.72689,-0.52706,-0.29217,-0.037841,0.21901,0.46128,0.67287,0.8397,0.95067,0.99839,-2.5637
0.16867,1,-0,-0.26186,-0.50545,-0.71377,-0.87226,-0.96989,-0.99982,-0.95998,-0.85313,-0.68675,-0.47244,-0.22516,0.037841,0.2982,0.53774,0.73976,0.89015,0.97841,0.99839,-2.04
0.17269,1,-0,-0.26795,-0.5163,-0.72689,-0.88433,-0.97709,-0.99839,-0.94668,-0.82573,-0.6444,-0.41594,-0.15706,0.11331,0.37539,0.61001,0.80003,0.93153,0.99491,0.98553,-1.55
0.17671,1,-0,-0.27402,-0.52706,-0.73976,-0.89582,-0.98331,-0.99553,-0.93153,-0.79622,-0.59997,-0.35778,-0.088203,0.18812,0.45005,0.67753,0.85313,0.96343,0.99998,0.95998,-1.097
0.18072,1,-0,-0.28008,-0.53774,-0.75236,-0.90675,-0.98856,-0.99124,-0.91457,-0.76469,-0.5536,-0.2982,-0.018924,0.26186,0.52169,0.73976,0.89861,0.98553,0.99356,0.92206,-0.68365
0.18474,1,-0,-0.28613,-0.54834,-0.76469,-0.9171,-0.99283,-0.98553,-0.89582,-0.73121,-0.50545,-0.23743,0.050446,0.3341,0.58982,0.79622,0.93604,0.99759,0.97572,0.87226,-0.31231
0.18876,1,-0,-0.29217,-0.55884,-0.77675,-0.92687,-0.9961,-0.97841,-0.87533,-0.69587,-0.45568,-0.17572,0.11957,0.40443,0.65399,0.84648,0.9651,0.9995,0.94668,0.81124,0.015263
0.19277,1,-0,-0.2982,-0.56926,-0.78853,-0.93604,-0.99839,-0.96989,-0.85313,-0.65875,-0.40443,-0.11331,0.18812,0.47244,0.71377,0.89015,0.98553,0.99124,0.90675,0.73976,0.29782
0.19679,1,-0,-0.30421,-0.57959,-0.80003,-0.94463,-0.99968,-0.95998,-0.82927,-0.61996,-0.35188,-0.050446,0.25577,0.53774,0.76874,0.92687,0.99714,0.97288,0.85641,0.65875,0.53463
0.2008,1,-0,-0.31022,-0.58982,-0.81124,-0.9526,-0.99998,-0.94869,-0.80379,-0.57959,-0.2982,0.012617,0.32219,0.59997,0.81855,0.95637,0.99982,0.94463,0.79622,0.56926,0.72548
0.20482,1,-0,-0.31621,-0.59997,-0.82216,-0.95998,-0.99928,-0.93604,-0.77675,-0.53774,-0.24355,0.075629,0.38705,0.65875,0.86285,0.97841,0.99356,0.90675,0.72689,0.47244,0.87066
0.20884,1,-0,-0.32219,-0.61001,-0.83278,-0.96674,-0.99759,-0.92206,-0.74819,-0.49453,-0.18812,0.13834,0.45005,0.71377,0.90136,0.99283,0.97841,0.85965,0.64921,0.36953,0.97093
0.21285,1,-0,-0.32815,-0.61996,-0.84311,-0.97288,-0.99491,-0.90675,-0.71817,-0.45005,-0.13209,0.2005,0.51089,0.76469,0.93381,0.9995,0.9545,0.80379,0.56406,0.26186,1.0275
0.21687,1,-0,-0.3341,-0.62981,-0.85313,-0.97841,-0.99124,-0.89015,-0.68675,-0.40443,-0.075629,0.26186,0.56926,0.81124,0.95998,0.99839,0.92206,0.73976,0.47244,0.15082,1.0422
0.22088,1,-0,-0.34004,-0.63956,-0.86285,-0.98331,-0.98658,-0.87226,-0.65399,-0.35778,-0.018924,0.32219,0.6249,0.85313,0.97969,0.98949,0.88136,0.66819,0.37539,0.037841,1.0169
0.2249,1,-0,-0.34597,-0.64921,-0.87226,-0.98759,-0.98094,-0.85313,-0.61996,-0.31022,0.037841,0.38123,0.67753,0.89015,0.99283,0.97288,0.83278,0.58982,0.27402,-0.075629,0.95416
0.22892,1,-0,-0.35188,-0.65875,-0.88136,-0.99124,-0.97432,-0.83278,-0.58472,-0.26186,0.094485,0.43875,0.72689,0.92206,0.99928,0.94869,0.77675,0.50545,0.1695,-0.18812,0.85682
0.23293,1,-0,-0.35778,-0.66819,-0.89015,-0.99425,-0.96674,-0.81124,-0.54834,-0.21285,0.15082,0.49453,0.77276,0.94869,0.99903,0.9171,0.71377,0.41594,0.063042,-0.2982,0.72795
0.23695,1,-0,-0.36366,-0.67753,-0.89861,-0.99664,-0.95819,-0.78853,-0.51089,-0.16328,0.20668,0.54834,0.81491,0.96989,0.99205,0.87837,0.6444,0.32219,-0.044145,-0.40443,0.57091
0.24096,1,-0,-0.36953,-0.68675,-0.90675,-0.99839,-0.94869,-0.76469,-0.47244,-0.11331,0.26186,0.59997,0.85313,0.98553,0.97841,0.83278,0.56926,0.22516,-0.15082,-0.50545,0.38927
0.24498,1,-0,-0.37539,-0.69587,-0.91457,-0.9995,-0.93825,-0.73976,-0.43307,-0.063042,0.31621,0.64921,0.88725,0.99553,0.95819,0.78071,0.48903,0.12583,-0.25577,-0.59997,0.18678
0.249,1,-0,-0.38123,-0.70487,-0.92206,-0.99998,-0.92687,-0.71377,-0.39286,-0.012617,0.36953,0.69587,0.9171,0.99982,0.93153,0.72255,0.40443,0.025231,-0.35778,-0.68675,-0.032718
0.25301,1,-0,-0.38705,-0.71377,-0.92922,-0.99982,-0.91457,-0.68675,-0.35188,0.037841,0.42167,0.73976,0.94254,0.99839,0.89861,0.65875,0.31621,-0.075629,-0.45568,-0.76469,-0.26529
0.25703,1,-0,-0.39286,-0.72255,-0.93604,-0.99903,-0.90136,-0.65875,-0.31022,0.088203,0.47244,0.78071,0.96343,0.99124,0.85965,0.58982,0.22516,-0.17572,-0.54834,-0.83278,-0.50699
0.26104,1,-0,-0.39865,-0.73121,-0.94254,-0.99759,-0.88725,-0.62981,-0.26795,0.13834,0.52169,0.81855,0.97969,0.97841,0.81491,0.5163,0.13209,-0.27402,-0.6347,-0.89015,-0.75389
0.26506,1,-0,-0.40443,-0.73976,-0.94869,-0.99553,-0.87226,-0.59997,-0.22516,0.18812,0.56926,0.85313,0.99124,0.95998,0.76469,0.43875,0.037841,-0.36953,-0.71377,-0.93604,-1.0021
0.26908,1,-0,-0.41019,-0.74819,-0.9545,-0.99283,-0.85641,-0.56926,-0.18193,0.23743,0.615,0.88433,0.99801,0.93604,0.70933,0.35778,-0.056745,-0.46128,-0.78463,-0.96989,-1.2479
0.27309,1,-0,-0.41594,-0.7565,-0.95998,-0.98949,-0.8397,-0.53774,-0.13834,0.28613,0.65875,0.912,0.99998,0.90675,0.64921,0.27402,-0.15082,-0.54834,-0.84648,-0.99124,-1.4877
0.27711,1,-0,-0.42167,-0.76469,-0.9651,-0.98553,-0.82216,-0.50545,-0.094485,0.3341,0.70038,0.93604,0.99714,0.87226,0.58472,0.18812,-0.24355,-0.62981,-0.89861,-0.99982,-1.7181
0.28112,1,-0,-0.42738,-0.77276,-0.96989,-0.98094,-0.80379,-0.47244,-0.050446,0.38123,0.73976,0.95637,0.98949,0.83278,0.5163,0.10076,-0.3341,-0.70487,-0.94041,-0.99553,-1.9359
0.28514,1,-0,-0.43307,-0.78071,-0.97432,-0.97572,-0.78463,-0.43875,-0.0063084,0.42738,0.77675,0.97288,0.97709,0.78853,0.44441,0.012617,-0.42167,-0.77276,-0.9714,-0.97841,-2.1381
0.28916,1,-0,-0.43875,-0.78853,-0.97841,-0.96989,-0.76469,-0.40443,0.037841,0.47244,0.81124,0.98553,0.95998,0.73976,0.36953,-0.075629,-0.50545,-0.83278,-0.99124,-0.94869,-2.3222
0.29317,1,-0,-0.44441,-0.79622,-0.98215,-0.96343,-0.74399,-0.36953,0.081918,0.5163,0.84311,0.99425,0.93825,0.68675,0.29217,-0.16328,-0.58472,-0.88433,-0.99968,-0.90675,-2.4857
0.29719,1,-0,-0.45005,-0.80379,-0.98553,-0.95637,-0.72255,-0.3341,0.12583,0.55884,0.87226,0.99903,0.912,0.62981,0.21285,-0.24967,-0.65875,-0.92687,-0.99664,-0.85313,-2.6268
0.3012,1,-0,-0.45568,-0.81124,-0.98856,-0.94869,-0.70038,-0.2982,0.1695,0.59997,0.89861,0.99982,0.88136,0.56926,0.13209,-0.3341,-0.72689,-0.95998,-0.98215,-0.78853,-2.7438
0.30522,1,-0,-0.46128,-0.81855,-0.99124,-0.94041,-0.67753,-0.26186,0.21285,0.63956,0.92206,0.99664,0.84648,0.50545,0.050446,-0.41594,-0.78853,-0.98331,-0.95637,-0.71377,-2.8353
0.30924,1,-0,-0.46687,-0.82573,-0.99356,-0.93153,-0.65399,-0.22516,0.25577,0.67753,0.94254,0.98949,0.80753,0.43875,-0.031537,-0.49453,-0.84311,-0.99664,-0.9196,-0.62981,-2.9005
0.31325,1,-0,-0.47244,-0.83278,-0.99553,-0.92206,-0.62981,-0.18812,0.2982,0.71377,0.95998,0.97841,0.76469,0.36953,-0.11331,-0.56926,-0.89015,-0.99982,-0.87226,-0.53774,-2.9387
0.31727,1,-0,-0.47799,-0.8397,-0.99714,-0.912,-0.605,-0.15082,0.34004,0.74819,0.97432,0.96343,0.71817,0.2982,-0.19432,-0.63956,-0.92922,-0.99283,-0.81491,-0.43875,-2.9499
0.32129,1,-0,-0.48352,-0.84648,-0.99839,-0.90136,-0.57959,-0.11331,0.38123,0.78071,0.98553,0.94463,0.66819,0.22516,-0.27402,-0.70487,-0.95998,-0.97572,-0.74819,-0.3341,-2.9341
0.3253,1,-0,-0.48903,-0.85313,-0.99928,-0.89015,-0.5536,-0.075629,0.42167,0.81124,0.99356,0.92206,0.615,0.15082,-0.35188,-0.76469,-0.98215,-0.94869,-0.67287,-0.22516,-2.8919
0.32932,1,-0,-0.49453,-0.85965,-0.99982,-0.87837,-0.52706,-0.037841,0.46128,0.8397,0.99839,0.89582,0.55884,0.075629,-0.42738,-0.81855,-0.99553,-0.912,-0.58982,-0.11331,-2.8242
0.33333,1,-0,-0.5,-0.86603,-1,-0.86603,-0.5,-1.2246e-16,0.5,0.86603,1,0.86603,0.5,2.4493e-16,-0.5,-0.86603,-1,-0.86603,-0.5,-3.6739e-16,-2.7321
0.33735,1,-0,-0.50545,-0.87226,-0.99982,-0.85313,-0.47244,0.037841,0.53774,0.89015,0.99839,0.83278,0.43875,-0.075629,-0.56926,-0.90675,-0.99553,-0.81124,-0.40443,0.11331,-2.617
0.34137,1,-0,-0.51089,-0.87837,-0.99928,-0.8397,-0.44441,0.075629,0.57444,0.912,0.99356,0.79622,0.37539,-0.15082,-0.6347,-0.94041,-0.98215,-0.74819,-0.30421,0.22516,-2.4807
0.34538,1,-0,-0.5163,-0.88433,-0.99839,-0.82573,-0.41594,0.11331,0.61001,0.93153,0.98553,0.7565,0.31022,-0.22516,-0.69587,-0.96674,-0.95998,-0.67753,-0.2005,0.3341,-2.3252
0.3494,1,-0,-0.52169,-0.89015,-0.99714,-0.81124,-0.38705,0.15082,0.6444,0.94869,0.97432,0.71377,0.24355,-0.2982,-0.75236,-0.98553,-0.92922,-0.59997,-0.094485,0.43875,-2.1527
0.35341,1,-0,-0.52706,-0.89582,-0.99553,-0.79622,-0.35778,0.18812,0.67753,0.96343,0.95998,0.66819,0.17572,-0.36953,-0.80379,-0.99664,-0.89015,-0.5163,0.012617,0.53774,-1.9655
0.35743,1,-0,-0.53241,-0.90136,-0.99356,-0.78071,-0.32815,0.22516,0.70933,0.97572,0.94254,0.61996,0.10704,-0.43875,-0.84983,-0.99998,-0.84311,-0.42738,0.11957,0.62981,-1.7661
0.36145,1,-0,-0.53774,-0.90675,-0.99124,-0.76469,-0.2982,0.26186,0.73976,0.98553,0.92206,0.56926,0.037841,-0.50545,-0.89015,-0.99553,-0.78853,-0.3341,0.22516,0.71377,-1.5571
0.36546,1,-0,-0.54305,-0.912,-0.98856,-0.74819,-0.26795,0.2982,0.76874,0.99283,0.89861,0.5163,-0.031537,-0.56926,-0.92448,-0.98331,-0.72689,-0.23743,0.32815,0.78853,-1.3413
0.36948,1,-0,-0.54834,-0.9171,-0.98553,-0.73121,-0.23743,0.3341,0.79622,0.99759,0.87226,0.46128,-0.10076,-0.62981,-0.9526,-0.96343,-0.65875,-0.13834,0.42738,0.85313,-1.1213
0.37349,1,-0,-0.5536,-0.92206,-0.98215,-0.71377,-0.20668,0.36953,0.82216,0.99982,0.84311,0.40443,-0.1695,-0.68675,-0.97432,-0.93604,-0.58472,-0.037841,0.52169,0.90675,-0.89994
0.37751,1,-0,-0.55884,-0.92687,-0.97841,-0.69587,-0.17572,0.40443,0.84648,0.9995,0.81124,0.34597,-0.23743,-0.73976,-0.98949,-0.90136,-0.50545,0.063042,0.61001,0.94869,-0.67984
0.38153,1,-0,-0.56406,-0.93153,-0.97432,-0.67753,-0.14459,0.43875,0.86916,0.99664,0.77675,0.28613,-0.30421,-0.78853,-0.99801,-0.85965,-0.42167,0.16328,0.69132,0.97841,-0.46365
0.38554,1,-0,-0.56926,-0.93604,-0.96989,-0.65875,-0.11331,0.47244,0.89015,0.99124,0.73976,0.22516,-0.36953,-0.83278,-0.99982,-0.81124,-0.3341,0.26186,0.76469,0.99553,-0.25391
0.38956,1,-0,-0.57444,-0.94041,-0.9651,-0.63956,-0.081918,0.50545,0.90939,0.98331,0.70038,0.16328,-0.43307,-0.87226,-0.99491,-0.7565,-0.24355,0.35778,0.82927,0.99982,-0.05303
0.39357,1,-0,-0.57959,-0.94463,-0.95998,-0.61996,-0.050446,0.53774,0.92687,0.97288,0.65875,0.10076,-0.49453,-0.90675,-0.98331,-0.69587,-0.15082,0.45005,0.88433,0.99124,0.13675
0.39759,1,-0,-0.58472,-0.94869,-0.9545,-0.59997,-0.018924,0.56926,0.94254,0.95998,0.615,0.037841,-0.5536,-0.93604,-0.9651,-0.62981,-0.056745,0.53774,0.92922,0.96989,0.31335
0.40161,1,-0,-0.58982,-0.9526,-0.94869,-0.57959,0.012617,0.59997,0.95637,0.94463,0.56926,-0.025231,-0.61001,-0.95998,-0.94041,-0.55884,0.037841,0.61996,0.96343,0.93604,0.47493
0.40562,1,-0,-0.59491,-0.95637,-0.94254,-0.55884,0.044145,0.62981,0.96833,0.92687,0.52169,-0.088203,-0.66349,-0.97841,-0.90939,-0.48352,0.13209,0.69587,0.98658,0.89015,0.61986
0.40964,1,-0,-0.59997,-0.95998,-0.93604,-0.53774,0.075629,0.65875,0.97841,0.90675,0.47244,-0.15082,-0.71377,-0.99124,-0.87226,-0.40443,0.22516,0.76469,0.99839,0.83278,0.74675
0.41365,1,-0,-0.605,-0.96343,-0.92922,-0.5163,0.10704,0.68675,0.98658,0.88433,0.42167,-0.21285,-0.76061,-0.99839,-0.82927,-0.32219,0.31621,0.82573,0.99873,0.76469,0.85446
0.41767,1,-0,-0.61001,-0.96674,-0.92206,-0.49453,0.13834,0.71377,0.99283,0.85965,0.36953,-0.27402,-0.80379,-0.99982,-0.78071,-0.23743,0.40443,0.87837,0.98759,0.68675,0.94214
0.42169,1,-0,-0.615,-0.96989,-0.91457,-0.47244,0.1695,0.73976,0.99714,0.83278,0.31621,-0.3341,-0.84311,-0.99553,-0.72689,-0.15082,0.48903,0.92206,0.9651,0.59997,1.0092
0.4257,1,-0,-0.61996,-0.97288,-0.90675,-0.45005,0.2005,0.76469,0.9995,0.80379,0.26186,-0.39286,-0.87837,-0.98553,-0.66819,-0.063042,0.56926,0.95637,0.93153,0.50545,1.0553
0.42972,1,-0,-0.6249,-0.97572,-0.89861,-0.42738,0.2313,0.78853,0.99992,0.77276,0.20668,-0.45005,-0.90939,-0.96989,-0.605,0.025231,0.6444,0.98094,0.88725,0.40443,1.0805
0.43373,1,-0,-0.62981,-0.97841,-0.89015,-0.40443,0.26186,0.81124,0.99839,0.73976,0.15082,-0.50545,-0.93604,-0.94869,-0.53774,0.11331,0.71377,0.99553,0.83278,0.2982,1.0849
0.43775,1,-0,-0.6347,-0.98094,-0.88136,-0.38123,0.29217,0.83278,0.99491,0.70487,0.094485,-0.55884,-0.95819,-0.92206,-0.46687,0.2005,0.77675,0.99998,0.76874,0.18812,1.0691
0.44177,1,-0,-0.63956,-0.98331,-0.87226,-0.35778,0.32219,0.85313,0.98949,0.66819,0.037841,-0.61001,-0.97572,-0.89015,-0.39286,0.28613,0.83278,0.99425,0.69587,0.075629,1.0339
0.44578,1,-0,-0.6444,-0.98553,-0.86285,-0.3341,0.35188,0.87226,0.98215,0.62981,-0.018924,-0.65875,-0.98856,-0.85313,-0.31621,0.36953,0.88136,0.97841,0.615,-0.037841,0.9801
0.4498,1,-0,-0.64921,-0.98759,-0.85313,-0.31022,0.38123,0.89015,0.97288,0.58982,-0.075629,-0.70487,-0.99664,-0.81124,-0.23743,0.45005,0.92206,0.9526,0.52706,-0.15082,0.90908
0.45382,1,-0,-0.65399,-0.98949,-0.84311,-0.28613,0.41019,0.90675,0.96172,0.54834,-0.13209,-0.74819,-0.99992,-0.76469,-0.15706,0.52706,0.9545,0.9171,0.43307,-0.26186,0.82221
0.45783,1,-0,-0.65875,-0.99124,-0.83278,-0.26186,0.43875,0.92206,0.94869,0.50545,-0.18812,-0.78853,-0.99839,-0.71377,-0.075629,0.59997,0.97841,0.87226,0.3341,-0.36953,0.72109
0.46185,1,-0,-0.66349,-0.99283,-0.82216,-0.23743,0.46687,0.93604,0.93381,0.46128,-0.24355,-0.82573,-0.99205,-0.65875,0.0063084,0.66819,0.99356,0.81855,0.2313,-0.47244,0.60748
0.46586,1,-0,-0.66819,-0.99425,-0.81124,-0.21285,0.49453,0.94869,0.9171,0.41594,-0.2982,-0.85965,-0.98094,-0.59997,0.088203,0.73121,0.99982,0.7565,0.12583,-0.56926,0.48328
0.46988,1,-0,-0.67287,-0.99553,-0.80003,-0.18812,0.52169,0.95998,0.89861,0.36953,-0.35188,-0.89015,-0.9651,-0.53774,0.1695,0.78853,0.99714,0.68675,0.018924,-0.65875,0.35048
0.4739,1,-0,-0.67753,-0.99664,-0.78853,-0.16328,0.54834,0.96989,0.87837,0.32219,-0.40443,-0.9171,-0.94463,-0.47244,0.24967,0.8397,0.98553,0.61001,-0.088203,-0.73976,0.21115
0.47791,1,-0,-0.68215,-0.99759,-0.77675,-0.13834,0.57444,0.97841,0.85641,0.27402,-0.45568,-0.94041,-0.9196,-0.40443,0.32815,0.88433,0.9651,0.52706,-0.19432,-0.81124,0.067418
0.48193,1,-0,-0.68675,-0.99839,-0.76469,-0.11331,0.59997,0.98553,0.83278,0.22516,-0.50545,-0.95998,-0.89015,-0.3341,0.40443,0.92206,0.93604,0.43875,-0.2982,-0.87226,-0.078565
0.48594,1,-0,-0.69132,-0.99903,-0.75236,-0.088203,0.6249,0.99124,0.80753,0.17572,-0.5536,-0.97572,-0.85641,-0.26186,0.47799,0.9526,0.89861,0.34597,-0.39865,-0.92206,-0.22466
0.48996,1,-0,-0.69587,-0.9995,-0.73976,-0.063042,0.64921,0.99553,0.78071,0.12583,-0.59997,-0.98759,-0.81855,-0.18812,0.54834,0.97572,0.85313,0.24967,-0.49453,-0.95998,-0.36877
0.49398,1,-0,-0.70038,-0.99982,-0.72689,-0.037841,0.67287,0.99839,0.75236,0.075629,-0.6444,-0.99553,-0.77675,-0.11331,0.615,0.99124,0.80003,0.15082,-0.58472,-0.98553,-0.50883
0.49799,1,-0,-0.70487,-0.99998,-0.71377,-0.012617,0.69587,0.99982,0.72255,0.025231,-0.68675,-0.9995,-0.73121,-0.037841,0.67753,0.99903,0.73976,0.050446,-0.66819,-0.99839,-0.6429
0.50201,1,-0,-0.70933,-0.99998,-0.70038,0.012617,0.71817,0.99982,0.69132,-0.025231,-0.72689,-0.9995,-0.68215,0.037841,0.7355,0.99903,0.67287,-0.050446,-0.74399,-0.99839,-0.76913
0.50602,1,-0,-0.71377,-0.99982,-0.68675,0.037841,0.73976,0.99839,0.65875,-0.075629,-0.76469,-0.99553,-0.62981,0.11331,0.78853,0.99124,0.59997,-0.15082,-0.81124,-0.98553,-0.8858
0.51004,1,-0,-0.71817,-0.9995,-0.67287,0.063042,0.76061,0.99553,0.6249,-0.12583,-0.80003,-0.98759,-0.57444,0.18812,0.83626,0.97572,0.52169,-0.24967,-0.86916,-0.95998,-0.99136
0.51406,1,-0,-0.72255,-0.99903,-0.65875,0.088203,0.78071,0.99124,0.58982,-0.17572,-0.83278,-0.97572,-0.5163,0.26186,0.87837,0.9526,0.43875,-0.34597,-0.9171,-0.92206,-1.0844
0.51807,1,-0,-0.72689,-0.99839,-0.6444,0.11331,0.80003,0.98553,0.5536,-0.22516,-0.86285,-0.95998,-0.45568,0.3341,0.91457,0.92206,0.35188,-0.43875,-0.9545,-0.87226,-1.1638
0.52209,1,-0,-0.73121,-0.99759,-0.62981,0.13834,0.81855,0.97841,0.5163,-0.27402,-0.89015,-0.94041,-0.39286,0.40443,0.94463,0.88433,0.26186,-0.52706,-0.98094,-0.81124,-1.2284
0.5261,1,-0,-0.7355,-0.99664,-0.615,0.16328,0.83626,0.96989,0.47799,-0.32219,-0.91457,-0.9171,-0.32815,0.47244,0.96833,0.8397,0.1695,-0.61001,-0.9961,-0.73976,-1.2776
0.53012,1,-0,-0.73976,-0.99553,-0.59997,0.18812,0.85313,0.95998,0.43875,-0.36953,-0.93604,-0.89015,-0.26186,0.53774,0.98553,0.78853,0.075629,-0.68675,-0.99982,-0.65875,-1.3107
0.53414,1,-0,-0.74399,-0.99425,-0.58472,0.21285,0.86916,0.94869,0.39865,-0.41594,-0.9545,-0.85965,-0.19432,0.59997,0.9961,0.73121,-0.018924,-0.7565,-0.99205,-0.56926,-1.3275
0.53815,1,-0,-0.74819,-0.99283,-0.56926,0.23743,0.88433,0.93604,0.35778,-0.46128,-0.96989,-0.82573,-0.12583,0.65875,0.99998,0.66819,-0.11331,-0.81855,-0.97288,-0.47244,-1.3277
0.54217,1,-0,-0.75236,-0.99124,-0.5536,0.26186,0.89861,0.92206,0.31621,-0.50545,-0.98215,-0.78853,-0.056745,0.71377,0.99714,0.59997,-0.20668,-0.87226,-0.94254,-0.36953,-1.3115
0.54618,1,-0,-0.7565,-0.98949,-0.53774,0.28613,0.912,0.90675,0.27402,-0.54834,-0.99124,-0.74819,0.012617,0.76469,0.98759,0.52706,-0.2982,-0.9171,-0.90136,-0.26186,-1.2792
0.5502,1,-0,-0.76061,-0.98759,-0.52169,0.31022,0.92448,0.89015,0.2313,-0.58982,-0.99714,-0.70487,0.081918,0.81124,0.9714,0.45005,-0.38705,-0.9526,-0.84983,-0.15082,-1.2313
0.55422,1,-0,-0.76469,-0.98553,-0.50545,0.3341,0.93604,0.87226,0.18812,-0.62981,-0.99982,-0.65875,0.15082,0.85313,0.94869,0.36953,-0.47244,-0.97841,-0.78853,-0.037841,-1.1686
0.55823,1,-0,-0.76874,-0.98331,-0.48903,0.35778,0.94668,0.85313,0.14459,-0.66819,-0.99928,-0.61001,0.21901,0.89015,0.9196,0.28613,-0.5536,-0.99425,-0.71817,0.075629,-1.0919
0.56225,1,-0,-0.77276,-0.98094,-0.47244,0.38123,0.95637,0.83278,0.10076,-0.70487,-0.99553,-0.55884,0.28613,0.92206,0.88433,0.2005,-0.62981,-0.99998,-0.63956,0.18812,-1.0025
0.56627,1,-0,-0.77675,-0.97841,-0.45568,0.40443,0.9651,0.81124,0.056745,-0.73976,-0.98856,-0.50545,0.35188,0.94869,0.84311,0.11331,-0.70038,-0.99553,-0.5536,0.2982,-0.90142
0.57028,1,-0,-0.78071,-0.97572,-0.43875,0.42738,0.97288,0.78853,0.012617,-0.77276,-0.97841,-0.45005,0.41594,0.96989,0.79622,0.025231,-0.76469,-0.98094,-0.46128,0.40443,-0.7902
0.5743,1,-0,-0.78463,-0.97288,-0.42167,0.45005,0.97969,0.76469,-0.031537,-0.80379,-0.9651,-0.39286,0.47799,0.98553,0.74399,-0.063042,-0.82216,-0.95637,-0.36366,0.50545,-0.67031
0.57831,1,-0,-0.78853,-0.96989,-0.40443,0.47244,0.98553,0.73976,-0.075629,-0.83278,-0.94869,-0.3341,0.53774,0.99553,0.68675,-0.15082,-0.87226,-0.92206,-0.26186,0.59997,-0.54335
0.58233,1,-0,-0.79239,-0.96674,-0.38705,0.49453,0.99038,0.71377,-0.11957,-0.85965,-0.92922,-0.27402,0.59491,0.99982,0.6249,-0.23743,-0.91457,-0.87837,-0.15706,0.68675,-0.41101
0.58635,1,-0,-0.79622,-0.96343,-0.36953,0.5163,0.99425,0.68675,-0.16328,-0.88433,-0.90675,-0.21285,0.64921,0.99839,0.55884,-0.32219,-0.94869,-0.82573,-0.050446,0.76469,-0.27501
0.59036,1,-0,-0.80003,-0.95998,-0.35188,0.53774,0.99714,0.65875,-0.20668,-0.90675,-0.88136,-0.15082,0.70038,0.99124,0.48903,-0.40443,-0.97432,-0.76469,0.056745,0.83278,-0.13713
0.59438,1,-0,-0.80379,-0.95637,-0.3341,0.55884,0.99903,0.62981,-0.24967,-0.92687,-0.85313,-0.088203,0.74819,0.97841,0.41594,-0.48352,-0.99124,-0.69587,0.16328,0.89015,0.00087991
0.59839,1,-0,-0.80753,-0.9526,-0.31621,0.57959,0.99992,0.59997,-0.29217,-0.94463,-0.82216,-0.025231,0.79239,0.95998,0.34004,-0.55884,-0.99928,-0.61996,0.26795,0.93604,0.13727
0.60241,1,-0,-0.81124,-0.94869,-0.2982,0.59997,0.99982,0.56926,-0.3341,-0.95998,-0.78853,0.037841,0.83278,0.93604,0.26186,-0.62981,-0.99839,-0.53774,0.36953,0.96989,0.27033
0.60643,1,-0,-0.81491,-0.94463,-0.28008,0.61996,0.99873,0.53774,-0.37539,-0.97288,-0.75236,0.10076,0.86916,0.90675,0.18193,-0.69587,-0.98856,-0.45005,0.46687,0.99124,0.39842
0.61044,1,-0,-0.81855,-0.94041,-0.26186,0.63956,0.99664,0.50545,-0.41594,-0.98331,-0.71377,0.16328,0.90136,0.87226,0.10076,-0.7565,-0.96989,-0.35778,0.55884,0.99982,0.51999
0.61446,1,-0,-0.82216,-0.93604,-0.24355,0.65875,0.99356,0.47244,-0.45568,-0.99124,-0.67287,0.22516,0.92922,0.83278,0.018924,-0.81124,-0.94254,-0.26186,0.6444,0.99553,0.63358
0.61847,1,-0,-0.82573,-0.93153,-0.22516,0.67753,0.98949,0.43875,-0.49453,-0.99664,-0.62981,0.28613,0.9526,0.78853,-0.063042,-0.85965,-0.90675,-0.16328,0.72255,0.97841,0.73787
0.62249,1,-0,-0.82927,-0.92687,-0.20668,0.69587,0.98444,0.40443,-0.53241,-0.9995,-0.58472,0.34597,0.9714,0.73976,-0.14459,-0.90136,-0.86285,-0.063042,0.79239,0.94869,0.83166
0.62651,1,-0,-0.83278,-0.92206,-0.18812,0.71377,0.97841,0.36953,-0.56926,-0.99982,-0.53774,0.40443,0.98553,0.68675,-0.22516,-0.93604,-0.81124,0.037841,0.85313,0.90675,0.91392
0.63052,1,-0,-0.83626,-0.9171,-0.1695,0.73121,0.9714,0.3341,-0.605,-0.99759,-0.48903,0.46128,0.99491,0.62981,-0.30421,-0.96343,-0.75236,0.13834,0.90407,0.85313,0.98377
0.63454,1,-0,-0.8397,-0.912,-0.15082,0.74819,0.96343,0.2982,-0.63956,-0.99283,-0.43875,0.5163,0.9995,0.56926,-0.38123,-0.98331,-0.68675,0.23743,0.94463,0.78853,1.0405
0.63855,1,-0,-0.84311,-0.90675,-0.13209,0.76469,0.9545,0.26186,-0.67287,-0.98553,-0.38705,0.56926,0.99928,0.50545,-0.45568,-0.99553,-0.615,0.3341,0.97432,0.71377,1.0836
0.64257,1,-0,-0.84648,-0.90136,-0.11331,0.78071,0.94463,0.22516,-0.70487,-0.97572,-0.3341,0.61996,0.99425,0.43875,-0.52706,-0.99998,-0.53774,0.42738,0.99283,0.62981,1.1128
0.64659,1,-0,-0.84983,-0.89582,-0.094485,0.79622,0.93381,0.18812,-0.7355,-0.96343,-0.28008,0.66819,0.98444,0.36953,-0.59491,-0.99664,-0.45568,0.5163,0.99992,0.53774,1.1279
0.6506,1,-0,-0.85313,-0.89015,-0.075629,0.81124,0.92206,0.15082,-0.76469,-0.94869,-0.22516,0.71377,0.96989,0.2982,-0.65875,-0.98553,-0.36953,0.59997,0.99553,0.43875,1.129
0.65462,1,-0,-0.85641,-0.88433,-0.056745,0.82573,0.90939,0.11331,-0.79239,-0.93153,-0.1695,0.7565,0.95067,0.22516,-0.71817,-0.96674,-0.28008,0.67753,0.97969,0.3341,1.1162
0.65863,1,-0,-0.85965,-0.87837,-0.037841,0.8397,0.89582,0.075629,-0.81855,-0.912,-0.11331,0.79622,0.92687,0.15082,-0.77276,-0.94041,-0.18812,0.74819,0.9526,0.22516,1.09
0.66265,1,-0,-0.86285,-0.87226,-0.018924,0.85313,0.88136,0.037841,-0.84311,-0.89015,-0.056745,0.83278,0.89861,0.075629,-0.82216,-0.90675,-0.094485,0.81124,0.91457,0.11331,1.051
0.66667,1,-0,-0.86603,-0.86603,-1.2246e-16,0.86603,0.86603,2.4493e-16,-0.86603,-0.86603,-3.6739e-16,0.86603,0.86603,4.8986e-16,-0.86603,-0.86603,-2.3887e-15,0.86603,0.86603,7.3479e-16,1
0.67068,1,-0,-0.86916,-0.85965,0.018924,0.87837,0.84983,-0.037841,-0.88725,-0.8397,0.056745,0.89582,0.82927,-0.075629,-0.90407,-0.81855,0.094485,0.912,0.80753,-0.11331,0.93781
0.6747,1,-0,-0.87226,-0.85313,0.037841,0.89015,0.83278,-0.075629,-0.90675,-0.81124,0.11331,0.92206,0.78853,-0.15082,-0.93604,-0.76469,0.18812,0.94869,0.73976,-0.22516,0.86551
0.67871,1,-0,-0.87533,-0.84648,0.056745,0.90136,0.81491,-0.11331,-0.92448,-0.78071,0.1695,0.94463,0.74399,-0.22516,-0.96172,-0.70487,0.28008,0.97572,0.66349,-0.3341,0.78425
0.68273,1,-0,-0.87837,-0.8397,0.075629,0.912,0.79622,-0.15082,-0.94041,-0.74819,0.22516,0.96343,0.69587,-0.2982,-0.98094,-0.63956,0.36953,0.99283,0.57959,-0.43875,0.69532
0.68675,1,-0,-0.88136,-0.83278,0.094485,0.92206,0.77675,-0.18812,-0.9545,-0.71377,0.28008,0.97841,0.6444,-0.36953,-0.99356,-0.56926,0.45568,0.99982,0.48903,-0.53774,0.60007
0.69076,1,-0,-0.88433,-0.82573,0.11331,0.93153,0.7565,-0.22516,-0.96674,-0.67753,0.3341,0.98949,0.58982,-0.43875,-0.9995,-0.49453,0.53774,0.99664,0.39286,-0.62981,0.49994
0.69478,1,-0,-0.88725,-0.81855,0.13209,0.94041,0.7355,-0.26186,-0.97709,-0.63956,0.38705,0.99664,0.53241,-0.50545,-0.99873,-0.41594,0.615,0.98331,0.29217,-0.71377,0.39639
0.6988,1,-0,-0.89015,-0.81124,0.15082,0.94869,0.71377,-0.2982,-0.98553,-0.59997,0.43875,0.99982,0.47244,-0.56926,-0.99124,-0.3341,0.68675,0.95998,0.18812,-0.78853,0.29093
0.70281,1,-0,-0.893,-0.80379,0.1695,0.95637,0.69132,-0.3341,-0.99205,-0.55884,0.48903,0.99903,0.41019,-0.62981,-0.97709,-0.24967,0.75236,0.92687,0.081918,-0.85313,0.1851
0.70683,1,-0,-0.89582,-0.79622,0.18812,0.96343,0.66819,-0.36953,-0.99664,-0.5163,0.53774,0.99425,0.34597,-0.68675,-0.95637,-0.16328,0.81124,0.88433,-0.025231,-0.90675,0.080376
0.71084,1,-0,-0.89861,-0.78853,0.20668,0.96989,0.6444,-0.40443,-0.99928,-0.47244,0.58472,0.98553,0.28008,-0.73976,-0.92922,-0.075629,0.86285,0.83278,-0.13209,-0.94869,-0.021749
0.71486,1,-0,-0.90136,-0.78071,0.22516,0.97572,0.61996,-0.43875,-0.99998,-0.42738,0.62981,0.97288,0.21285,-0.78853,-0.89582,0.012617,0.90675,0.77276,-0.23743,-0.97841,-0.11986
0.71888,1,-0,-0.90407,-0.77276,0.24355,0.98094,0.59491,-0.47244,-0.99873,-0.38123,0.67287,0.95637,0.14459,-0.83278,-0.85641,0.10076,0.94254,0.70487,-0.34004,-0.99553,-0.21259
0.72289,1,-0,-0.90675,-0.76469,0.26186,0.98553,0.56926,-0.50545,-0.99553,-0.3341,0.71377,0.93604,0.075629,-0.87226,-0.81124,0.18812,0.96989,0.62981,-0.43875,-0.99982,-0.29868
0.72691,1,-0,-0.90939,-0.7565,0.28008,0.98949,0.54305,-0.53774,-0.99038,-0.28613,0.75236,0.912,0.0063084,-0.90675,-0.76061,0.27402,0.98856,0.54834,-0.53241,-0.99124,-0.37696
0.73092,1,-0,-0.912,-0.74819,0.2982,0.99283,0.5163,-0.56926,-0.98331,-0.23743,0.78853,0.88433,-0.063042,-0.93604,-0.70487,0.35778,0.99839,0.46128,-0.61996,-0.96989,-0.44637
0.73494,1,-0,-0.91457,-0.73976,0.31621,0.99553,0.48903,-0.59997,-0.97432,-0.18812,0.82216,0.85313,-0.13209,-0.95998,-0.6444,0.43875,0.99928,0.36953,-0.70038,-0.93604,-0.50601
0.73896,1,-0,-0.9171,-0.73121,0.3341,0.99759,0.46128,-0.62981,-0.96343,-0.13834,0.85313,0.81855,-0.2005,-0.97841,-0.57959,0.5163,0.99124,0.27402,-0.77276,-0.89015,-0.55508
0.74297,1,-0,-0.9196,-0.72255,0.35188,0.99903,0.43307,-0.65875,-0.95067,-0.088203,0.88136,0.78071,-0.26795,-0.99124,-0.51089,0.58982,0.97432,0.17572,-0.83626,-0.83278,-0.59296
0.74699,1,-0,-0.92206,-0.71377,0.36953,0.99982,0.40443,-0.68675,-0.93604,-0.037841,0.90675,0.73976,-0.3341,-0.99839,-0.43875,0.65875,0.94869,0.075629,-0.89015,-0.76469,-0.61918
0.751,1,-0,-0.92448,-0.70487,0.38705,0.99998,0.37539,-0.71377,-0.9196,0.012617,0.92922,0.69587,-0.39865,-0.99982,-0.36366,0.72255,0.91457,-0.025231,-0.93381,-0.68675,-0.63341
0.75502,1,-0,-0.92687,-0.69587,0.40443,0.9995,0.34597,-0.73976,-0.90136,0.063042,0.94869,0.64921,-0.46128,-0.99553,-0.28613,0.78071,0.87226,-0.12583,-0.96674,-0.59997,-0.63552
0.75904,1,-0,-0.92922,-0.68675,0.42167,0.99839,0.31621,-0.76469,-0.88136,0.11331,0.9651,0.59997,-0.52169,-0.98553,-0.20668,0.83278,0.82216,-0.22516,-0.98856,-0.50545,-0.62551
0.76305,1,-0,-0.93153,-0.67753,0.43875,0.99664,0.28613,-0.78853,-0.85965,0.16328,0.97841,0.54834,-0.57959,-0.96989,-0.12583,0.87837,0.76469,-0.32219,-0.99903,-0.40443,-0.60358
0.76707,1,-0,-0.93381,-0.66819,0.45568,0.99425,0.25577,-0.81124,-0.83626,0.21285,0.98856,0.49453,-0.6347,-0.94869,-0.044145,0.9171,0.70038,-0.41594,-0.99801,-0.2982,-0.57005
0.77108,1,-0,-0.93604,-0.65875,0.47244,0.99124,0.22516,-0.83278,-0.81124,0.26186,0.99553,0.43875,-0.68675,-0.92206,0.037841,0.94869,0.62981,-0.50545,-0.98553,-0.18812,-0.52542
0.7751,1,-0,-0.93825,-0.64921,0.48903,0.98759,0.19432,-0.85313,-0.78463,0.31022,0.99928,0.38123,-0.7355,-0.89015,0.11957,0.97288,0.5536,-0.58982,-0.96172,-0.075629,-0.47032
0.77912,1,-0,-0.94041,-0.63956,0.50545,0.98331,0.16328,-0.87226,-0.7565,0.35778,0.99982,0.32219,-0.78071,-0.85313,0.2005,0.98949,0.47244,-0.66819,-0.92687,0.037841,-0.40553
0.78313,1,-0,-0.94254,-0.62981,0.52169,0.97841,0.13209,-0.89015,-0.72689,0.40443,0.99714,0.26186,-0.82216,-0.81124,0.28008,0.99839,0.38705,-0.73976,-0.88136,0.15082,-0.33193
0.78715,1,-0,-0.94463,-0.61996,0.53774,0.97288,0.10076,-0.90675,-0.69587,0.45005,0.99124,0.2005,-0.85965,-0.76469,0.35778,0.9995,0.2982,-0.80379,-0.82573,0.26186,-0.25055
0.79116,1,-0,-0.94668,-0.61001,0.5536,0.96674,0.069337,-0.92206,-0.66349,0.49453,0.98215,0.13834,-0.893,-0.71377,0.43307,0.99283,0.20668,-0.85965,-0.76061,0.36953,-0.16247
0.79518,1,-0,-0.94869,-0.59997,0.56926,0.95998,0.037841,-0.93604,-0.62981,0.53774,0.96989,0.075629,-0.92206,-0.65875,0.50545,0.97841,0.11331,-0.90675,-0.68675,0.47244,-0.068877
0.7992,1,-0,-0.95067,-0.58982,0.58472,0.9526,0.0063084,-0.94869,-0.59491,0.57959,0.9545,0.012617,-0.94668,-0.59997,0.57444,0.95637,0.018924,-0.94463,-0.605,0.56926,0.028975
0.80321,1,-0,-0.9526,-0.57959,0.59997,0.94463,-0.025231,-0.95998,-0.55884,0.61996,0.93604,-0.050446,-0.96674,-0.53774,0.63956,0.92687,-0.075629,-0.97288,-0.5163,0.65875,0.1298
0.80723,1,-0,-0.9545,-0.56926,0.615,0.93604,-0.056745,-0.96989,-0.52169,0.65875,0.91457,-0.11331,-0.98215,-0.47244,0.70038,0.89015,-0.1695,-0.99124,-0.42167,0.73976,0.23226
0.81124,1,-0,-0.95637,-0.55884,0.62981,0.92687,-0.088203,-0.97841,-0.48352,0.69587,0.89015,-0.17572,-0.99283,-0.40443,0.7565,0.84648,-0.26186,-0.9995,-0.32219,0.81124,0.33504
0.81526,1,-0,-0.95819,-0.54834,0.6444,0.9171,-0.11957,-0.98553,-0.44441,0.73121,0.86285,-0.23743,-0.99873,-0.3341,0.80753,0.79622,-0.35188,-0.99759,-0.21901,0.87226,0.4368
0.81928,1,-0,-0.95998,-0.53774,0.65875,0.90675,-0.15082,-0.99124,-0.40443,0.76469,0.83278,-0.2982,-0.99982,-0.26186,0.85313,0.73976,-0.43875,-0.98553,-0.11331,0.92206,0.53625
0.82329,1,-0,-0.96172,-0.52706,0.67287,0.89582,-0.18193,-0.99553,-0.36366,0.79622,0.80003,-0.35778,-0.9961,-0.18812,0.893,0.67753,-0.52169,-0.96343,-0.0063084,0.95998,0.63211
0.82731,1,-0,-0.96343,-0.5163,0.68675,0.88433,-0.21285,-0.99839,-0.32219,0.82573,0.76469,-0.41594,-0.98759,-0.11331,0.92687,0.61001,-0.59997,-0.93153,0.10076,0.98553,0.72319
0.83133,1,-0,-0.9651,-0.50545,0.70038,0.87226,-0.24355,-0.99982,-0.28008,0.85313,0.72689,-0.47244,-0.97432,-0.037841,0.9545,0.53774,-0.67287,-0.89015,0.20668,0.99839,0.80835
0.83534,1,-0,-0.96674,-0.49453,0.71377,0.85965,-0.27402,-0.99982,-0.23743,0.87837,0.68675,-0.52706,-0.95637,0.037841,0.97572,0.46128,-0.73976,-0.8397,0.31022,0.99839,0.88656
0.83936,1,-0,-0.96833,-0.48352,0.72689,0.84648,-0.30421,-0.99839,-0.19432,0.90136,0.6444,-0.57959,-0.93381,0.11331,0.99038,0.38123,-0.80003,-0.78071,0.41019,0.98553,0.95687
0.84337,1,-0,-0.96989,-0.47244,0.73976,0.83278,-0.3341,-0.99553,-0.15082,0.92206,0.59997,-0.62981,-0.90675,0.18812,0.99839,0.2982,-0.85313,-0.71377,0.50545,0.95998,1.0185
0.84739,1,-0,-0.9714,-0.46128,0.75236,0.81855,-0.36366,-0.99124,-0.10704,0.94041,0.5536,-0.67753,-0.87533,0.26186,0.99968,0.21285,-0.89861,-0.63956,0.59491,0.92206,1.0706
0.85141,1,-0,-0.97288,-0.45005,0.76469,0.80379,-0.39286,-0.98553,-0.063042,0.95637,0.50545,-0.72255,-0.8397,0.3341,0.99425,0.12583,-0.93604,-0.55884,0.67753,0.87226,1.1128
0.85542,1,-0,-0.97432,-0.43875,0.77675,0.78853,-0.42167,-0.97841,-0.018924,0.96989,0.45568,-0.76469,-0.80003,0.40443,0.98215,0.037841,-0.9651,-0.47244,0.75236,0.81124,1.1445
0.85944,1,-0,-0.97572,-0.42738,0.78853,0.77276,-0.45005,-0.96989,0.025231,0.98094,0.40443,-0.80379,-0.7565,0.47244,0.96343,-0.050446,-0.98553,-0.38123,0.81855,0.73976,1.1655
0.86345,1,-0,-0.97709,-0.41594,0.80003,0.7565,-0.47799,-0.95998,0.069337,0.98949,0.35188,-0.8397,-0.70933,0.53774,0.93825,-0.13834,-0.99714,-0.28613,0.87533,0.65875,1.1757
0.86747,1,-0,-0.97841,-0.40443,0.81124,0.73976,-0.50545,-0.94869,0.11331,0.99553,0.2982,-0.87226,-0.65875,0.59997,0.90675,-0.22516,-0.99982,-0.18812,0.92206,0.56926,1.175
0.87149,1,-0,-0.97969,-0.39286,0.82216,0.72255,-0.53241,-0.93604,0.15706,0.99903,0.24355,-0.90136,-0.605,0.65875,0.86916,-0.31022,-0.99356,-0.088203,0.95819,0.47244,1.1635
0.8755,1,-0,-0.98094,-0.38123,0.83278,0.70487,-0.55884,-0.92206,0.2005,0.99998,0.18812,-0.92687,-0.54834,0.71377,0.82573,-0.39286,-0.97841,0.012617,0.98331,0.36953,1.1417
0.87952,1,-0,-0.98215,-0.36953,0.84311,0.68675,-0.58472,-0.90675,0.24355,0.99839,0.13209,-0.94869,-0.48903,0.76469,0.77675,-0.47244,-0.9545,0.11331,0.99714,0.26186,1.1098
0.88353,1,-0,-0.98331,-0.35778,0.85313,0.66819,-0.61001,-0.89015,0.28613,0.99425,0.075629,-0.96674,-0.42738,0.81124,0.72255,-0.54834,-0.92206,0.21285,0.9995,0.15082,1.0685
0.88755,1,-0,-0.98444,-0.34597,0.86285,0.64921,-0.6347,-0.87226,0.32815,0.98759,0.018924,-0.98094,-0.36366,0.85313,0.66349,-0.61996,-0.88136,0.31022,0.99038,0.037841,1.0185
0.89157,1,-0,-0.98553,-0.3341,0.87226,0.62981,-0.65875,-0.85313,0.36953,0.97841,-0.037841,-0.99124,-0.2982,0.89015,0.59997,-0.68675,-0.83278,0.40443,0.96989,-0.075629,0.96049
0.89558,1,-0,-0.98658,-0.32219,0.88136,0.61001,-0.68215,-0.83278,0.41019,0.96674,-0.094485,-0.99759,-0.2313,0.92206,0.53241,-0.74819,-0.77675,0.49453,0.93825,-0.18812,0.89541
0.8996,1,-0,-0.98759,-0.31022,0.89015,0.58982,-0.70487,-0.81124,0.45005,0.9526,-0.15082,-0.99998,-0.16328,0.94869,0.46128,-0.80379,-0.71377,0.57959,0.89582,-0.2982,0.82425
0.90361,1,-0,-0.98856,-0.2982,0.89861,0.56926,-0.72689,-0.78853,0.48903,0.93604,-0.20668,-0.99839,-0.094485,0.96989,0.38705,-0.85313,-0.6444,0.65875,0.84311,-0.40443,0.74806
0.90763,1,-0,-0.98949,-0.28613,0.90675,0.54834,-0.74819,-0.76469,0.52706,0.9171,-0.26186,-0.99283,-0.025231,0.98553,0.31022,-0.89582,-0.56926,0.73121,0.78071,-0.50545,0.66795
0.91165,1,-0,-0.99038,-0.27402,0.91457,0.52706,-0.76874,-0.73976,0.56406,0.89582,-0.31621,-0.98331,0.044145,0.99553,0.2313,-0.93153,-0.48903,0.79622,0.70933,-0.59997,0.58509
