n,w1,wr1,wd1,we1,wp1
1,885.815548040857,880.132402906541,0.0064363676531539,5.68314513431562,0.00645714794222739
2,1815.48892513823,1761.00936187128,0.030465309302582,54.4795632669498,0.030936555163488
