xi,s1,s2
0,-1.15212907877978e-26,3.27145503469886e-27
0.01,0.0033497164826168,-0.028031491011138
0.02,0.00931772481367112,-0.0513250196066006
0.03,0.0173513622142438,-0.0704629892145872
0.04,0.026945785364811,-0.0859279456727004
0.05,0.0376473129099446,-0.0981295623497065
0.06,0.0490550097095028,-0.107424408552747
0.07,0.0608208024993444,-0.114130010532195
0.08,0.0726483890941129,-0.118534484963391
0.09,0.0842911771942911,-0.120902818424848
0.1,0.0955494642194937,-0.12148068192881
0.11,0.106267046349817,-0.120496505815094
0.12,0.116327423086959,-0.118162396115543
0.13,0.12564974311674,-0.114674347656896
0.14,0.134184618034561,-0.110212100517197
0.15,0.141909912555183,-0.104938893807598
0.16,0.148826603138012,-0.0990012929403981
0.17,0.154954781488711,-0.0925292023879881
0.18,0.160329865117537,-0.0856361242588082
0.19,0.16499906401413,-0.078419682638136
0.2,0.169018140507653,-0.0709624033862269
0.21,0.172448488490107,-0.063332717776707
0.22,0.175354548359291,-0.0555861448168912
0.23,0.177801565256279,-0.0477666001415485
0.24,0.17985369040025,-0.0399077778352651
0.25,0.181572418531264,-0.0320345542386767
0.26,0.183015348628784,-0.0241643685531326
0.27,0.184235250150644,-0.0163085426998771
0.28,0.185279413003176,-0.00847351125288488
0.29,0.186189256274642,-0.000661940343062148
0.3,0.187000168397572,0.00712627833504011
0.31,0.187741549797842,0.014893166009915
0.32,0.188437028182992,0.022641930057312
0.33,0.189104816362385,0.0303763697198295
0.34,0.189758182820595,0.03810040840307
0.35,0.190406006126032,0.0458177437064895
0.36,0.191053385592266,0.0535316041217013
0.37,0.191702282363212,0.0612445997473463
0.38,0.192352167208102,0.0689586533717635
0.39,0.193000653731458,0.0766749978066354
0.4,0.193644098370007,0.0843942253605848
0.41,0.194278151405882,0.0921163757654191
0.42,0.194898246216727,0.0998410496533905
0.43,0.195500017051497,0.107567535775522
0.44,0.196079638709033,0.115294941492781
0.45,0.196634084548088,0.123022317607721
0.46,0.197161302215377,0.130748770278183
0.47,0.197660309285769,0.138473554510826
0.48,0.198131213608871,0.146196145514678
0.49,0.198575165492305,0.15391628594759
0.5,0.198994250866938,0.161634008755515
0.51,0.199391336216467,0.169349636829963
0.52,0.199769877256155,0.177063762036849
0.53,0.200133704058054,0.184777207245513
0.54,0.200486795502968,0.1924909757664
0.55,0.200833055597557,0.200206193078131
0.56,0.20117610337775,0.207924045910344
0.57,0.20151908689189,0.215645723679282
0.58,0.201864530185254,0.22337236698188
0.59,0.202214220358327,0.231105027373863
0.6,0.202569139710957,0.238844642021246
0.61,0.20292944577986,0.246592026055588
0.62,0.203294499794296,0.254347884614348
0.63,0.203662941780801,0.262112845641842
0.64,0.204032808308952,0.269887513596477
0.65,0.204401686752997,0.27767254328928
0.66,0.20476689801514,0.285468732200116
0.67,0.205125697982008,0.293277128814526
0.68,0.205475486632789,0.301099153828753
0.69,0.205814012752248,0.308936730516234
0.7,0.206139561690851,0.31679242016876
0.71,0.206451113624095,0.324669558352448
0.72,0.206748460360326,0.332572387785831
0.73,0.20703226999742,0.340506183987635
0.74,0.207304090700166,0.348477370488185
0.75,0.207566287628628,0.35649362138399
0.76,0.207821910659613,0.3645639503727
0.77,0.208074495074993,0.372698787168753
0.78,0.208327802896432,0.380910044411433
0.79,0.208585518968235,0.389211180973207
0.8,0.208850922847335,0.397617271361834
0.81,0.209126564347353,0.406145096358155
0.82,0.209413976385224,0.414813277909383
0.83,0.209713462765562,0.423642492381475
0.84,0.210023999880569,0.432655811340389
0.85,0.210343289173211,0.441879238857419
0.86,0.210667990779352,0.451342539694909
0.87,0.210994157201929,0.46108048440213
0.88,0.211317868347834,0.471134676113606
0.89,0.211636044947231,0.481556170470291
0.9,0.211947385446528,0.492409155354374
0.91,0.212253331091199,0.503776021817765
0.92,0.212558914264257,0.515764232469088
0.93,0.21287328539137,0.528515479440907
0.94,0.213209643035555,0.542217721664624
0.95,0.213584209354043,0.557120801311552
0.96,0.214013798048412,0.573556462691751
0.97,0.214511413477501,0.591963734414021
0.98,0.21507919689193,0.612920787977399
0.99,0.215697897960412,0.637184553963519
1,0.216311896062463,0.665739561406607
