xi,s1,s2
0,0,0
0.01,0.000536824023105674,-0.0101209216792793
0.02,0.00107974512383416,-0.0202399779195378
0.03,0.00162890509833547,-0.0303571572911739
0.04,0.00218445073993676,-0.040472447823156
0.05,0.00274653407637916,-0.0505858369706006
0.06,0.00331531262127928,-0.0606973115799997
0.07,0.00389094964084932,-0.0708068578518868
0.08,0.00447361443699885,-0.0809144613007263
0.09,0.00506348264803839,-0.0910201067117762
0.1,0.0056607365683119,-0.10112377809466
0.11,0.00626556548820442,-0.111225458633346
0.12,0.00687816605609968,-0.121325130632212
0.13,0.0074987426640074,-0.13142277545783
0.14,0.00812750785873884,-0.141518373476064
0.15,0.00876468278068418,-0.15161190398405
0.16,0.00941049763244112,-0.161703345136551
0.17,0.0100651921797598,-0.171792673866149
0.18,0.0107290162875096,-0.18187986579665
0.19,0.0114022304936407,-0.191964895149042
0.2,0.0120851066244115,-0.202047734639225
0.21,0.0127779284544844,-0.212128355366673
0.22,0.0134809924158661,-0.222206726693087
0.23,0.0141946083600814,-0.232282816109953
0.24,0.0149191003784395,-0.242356589093819
0.25,0.0156548076857703,-0.252428008947942
0.26,0.016402085573603,-0.262497036628787
0.27,0.0171613064394163,-0.272563630555649
0.28,0.0179328608993437,-0.282627746401482
0.29,0.0187171589925596,-0.292689336862698
0.3,0.0195146314865335,-0.302748351405478
0.31,0.0203257312934261,-0.312804735985715
0.32,0.0211509350091406,-0.322858432739358
0.33,0.0219907445879497,-0.332909379639462
0.34,0.0228456891672327,-0.342957510115666
0.35,0.0237163270586968,-0.353002752631253
0.36,0.0246032479245732,-0.363045030212152
0.37,0.0255070751597047,-0.373084259921426
0.38,0.0264284685032457,-0.383120352271744
0.39,0.0273681269069266,-0.39315321056714
0.4,0.0283267916905814,-0.403182730163976
0.41,0.0293052500199858,-0.413208797639295
0.42,0.0303043387471191,-0.4232312898528
0.43,0.0313249486588706,-0.433250072886261
0.44,0.0323680291871394,-0.443265000841321
0.45,0.0334345936414042,-0.453275914473192
0.46,0.0345257250344166,-0.4632826396336
0.47,0.0356425825829993,-0.473284985491258
0.48,0.0367864089793511,-0.48328274249201
0.49,0.0379585385442397,-0.493275680013287
0.5,0.039160406392548,-0.503263543658247
0.51,0.0403935587645081,-0.51324605212362
0.52,0.0416596647034853,-0.523222893561115
0.53,0.0429605292944304,-0.533193721334674
0.54,0.0442981087174585,-0.543158149053776
0.55,0.0456745274201734,-0.553115744735229
0.56,0.0470920977725091,-0.563066023910657
0.57,0.0485533426418224,-0.573008441452017
0.58,0.0500610214173288,-0.582942381829841
0.59,0.0516181601263841,-0.592867147444517
0.6,0.0532280864265962,-0.602781944574053
0.61,0.0548944704351725,-0.612685866354902
0.62,0.0566213725805616,-0.622577872044712
0.63,0.0584132999448697,-0.632456761592588
0.64,0.060275272926619,-0.642321144242319
0.65,0.0622129045158411,-0.652169399487146
0.66,0.0642324950687049,-0.661999628137481
0.67,0.0663411462385665,-0.671809590492367
0.68,0.0685468987196805,-0.681596627528059
0.69,0.0708588997612774,-0.69135755949383
0.7,0.0732876081069662,-0.701088554125917
0.71,0.075845046225048,-0.710784953534422
0.72,0.0785451125586017,-0.720441044188952
0.73,0.0814039701851075,-0.730049747550365
0.74,0.0844405328344007,-0.739602198541764
0.75,0.0876770745956903,-0.74908716326706
0.76,0.0911399952798494,-0.758490223043434
0.77,0.0948607774829708,-0.767792613931212
0.78,0.098877169159227,-0.77696955172379
0.79,0.103234605359854,-0.785987780197403
0.8,0.107987817669824,-0.794801940178714
0.81,0.113202408734878,-0.803349156464844
0.82,0.118955760608299,-0.811540998350126
0.83,0.125335740480861,-0.819251836755736
0.84,0.132433859351996,-0.826303155521756
0.85,0.140326626609839,-0.832446154880156
0.86,0.149036650892343,-0.837353112991279
0.87,0.158471912407488,-0.840642810181745
0.88,0.16837188027405,-0.84197127510868
0.89,0.178328179853945,-0.8411731907914
0.9,0.187912187822691,-0.838349908204654
0.91,0.196819680033034,-0.833813959137595
0.92,0.20491964469547,-0.827948656690246
0.93,0.212212102489033,-0.821099723919986
0.94,0.218764605126429,-0.813535812443053
0.95,0.2246672901619,-0.805451583088232
0.96,0.230009918757653,-0.796984371137428
0.97,0.234872779504595,-0.78823072440622
0.98,0.239324408600145,-0.779259076285907
0.99,0.243422139917209,-0.770118603642173
1,0.247213595499958,-0.760845213036123
