xi,s1,s2
0,9.29690479137625e-27,4.85109584824699e-26
0.01,-0.00102929461581939,-0.0238242164382378
0.02,-0.000681932991375574,-0.0453723556492808
0.03,0.000936457355138833,-0.0647611399329795
0.04,0.00372024890553122,-0.0821072915891849
0.05,0.00756381414160897,-0.0975275329177478
0.06,0.0123615255451795,-0.111138586218519
0.07,0.0180077555980501,-0.123057173791349
0.08,0.0243968767820283,-0.133400017936089
0.09,0.0314232615789214,-0.142283840952589
0.1,0.0389812824705368,-0.149825365140701
0.11,0.0469678882152971,-0.156128188556811
0.12,0.0552903326780851,-0.161243412283444
0.13,0.0638584460003991,-0.165209013159665
0.14,0.0725820583237372,-0.168062968024534
0.15,0.0813709997895974,-0.169843253717115
0.16,0.0901351005394781,-0.17058784707647
0.17,0.0987841907148772,-0.17033472494166
0.18,0.107228100457293,-0.169121864151749
0.19,0.115376659908223,-0.166987241545798
0.2,0.123139699209166,-0.163968833962869
0.21,0.13043984361445,-0.160111081721741
0.22,0.137250898829721,-0.15548427906005
0.23,0.143559465673454,-0.150165183695149
0.24,0.149352144964126,-0.144230553344389
0.25,0.154615537520213,-0.137757145725123
0.26,0.159336244160189,-0.130821718554704
0.27,0.163500865702532,-0.123501029550483
0.28,0.167096002965717,-0.115871836429813
0.29,0.170108256768219,-0.108010896910046
0.3,0.172524227928516,-0.0999949687085347
0.31,0.174345790172839,-0.0918895645379806
0.32,0.175635908858447,-0.0837152170924856
0.33,0.176472822250358,-0.0754812140615011
0.34,0.176934768613588,-0.0671968431344785
0.35,0.177099986213153,-0.0588713920008693
0.36,0.177046713314069,-0.050514148350125
0.37,0.176853188181353,-0.0421343998716969
0.38,0.176597649080022,-0.0337414342550366
0.39,0.17635833427509,-0.0253445391895955
0.4,0.176213482031576,-0.016953002364825
0.41,0.176224046016854,-0.00857418878876092
0.42,0.176381841507734,-0.000207772743775526
0.43,0.176661399183384,0.00814849416917442
0.44,0.177037249722973,0.0164968603491322
0.45,0.17748392380567,0.0248395741951413
0.46,0.177975952110643,0.0331788841062448
0.47,0.178487865317061,0.0415170384814861
0.48,0.178994194104092,0.0498562857199087
0.49,0.179469469150905,0.0581988742205558
0.5,0.179888221136669,0.0665470523824707
0.51,0.180230917974328,0.0749025418461405
0.52,0.180501776511934,0.0832649572178279
0.53,0.180710950831314,0.0916333863452389
0.54,0.180868595014296,0.10000691707608
0.55,0.180984863142708,0.108384637258058
0.56,0.181069909298376,0.116765634738878
0.57,0.18113388756313,0.125148997366248
0.58,0.181186952018795,0.133533812987872
0.59,0.1812392567472,0.141919169451459
0.6,0.181300955830172,0.150304154604714
0.61,0.181380018483844,0.158688064565686
0.62,0.181475674461565,0.167071028533799
0.63,0.18158496865099,0.175453383978817
0.64,0.181704945939775,0.183835468370509
0.65,0.181832651215574,0.192217619178638
0.66,0.181965129366041,0.200600173872972
0.67,0.182099425278832,0.208983469923277
0.68,0.182232583841601,0.217367844799318
0.69,0.182361649942003,0.22575363597086
0.7,0.182483668467692,0.234141180907672
0.71,0.182596375112357,0.242530736776045
0.72,0.182700268793817,0.250922239528385
0.73,0.182796539235924,0.259315544813622
0.74,0.182886376162529,0.26771050828069
0.75,0.182970969297486,0.27610698557852
0.76,0.183051508364645,0.284504832356044
0.77,0.18312918308786,0.292903904262194
0.78,0.183205183190983,0.301304056945902
0.79,0.183280698397866,0.309705146056099
0.8,0.18335691843236,0.318107027241718
0.81,0.183434816667908,0.326516602048407
0.82,0.183514501076311,0.334968955608679
0.83,0.183595863278957,0.343506218951764
0.84,0.183678794897238,0.35217052310689
0.85,0.183763187552544,0.361003999103286
0.86,0.183848932866264,0.370048777970183
0.87,0.183935922459789,0.37934699073681
0.88,0.184024047954509,0.388940768432396
0.89,0.184113200971814,0.39887224208617
0.9,0.184203273133094,0.409183542727361
0.91,0.184294435551995,0.419944979435099
0.92,0.184387977311178,0.431339573488109
0.93,0.184485466985562,0.443578524215017
0.94,0.184588473150065,0.45687303094445
0.95,0.184698564379604,0.471434293005032
0.96,0.184817309249097,0.48747350972539
0.97,0.184946276333463,0.505201880434149
0.98,0.185087034207618,0.524830604459936
0.99,0.185241151446481,0.546570881131375
1,0.185410196624968,0.570633909777092
