xi,sx,sy,cx,cy,ex,ey,ne
0,5.11430777673541e-27,-9.28103064985152e-27,0,0,5.11430777673541e-27,-9.28103064985152e-27,1.05968709513073e-26
0.01,0.000629509063415944,-0.0221089047930918,0.000718759007899098,-0.0101185281433818,-8.92499444831547e-05,-0.01199037664971,0.0119907088095117
0.02,0.0012335208562905,-0.0429171467321916,0.00144515754416966,-0.0202349704999181,-0.000211636687879164,-0.0226821762322736,0.0226831635518411
0.03,0.0018132471112076,-0.0624930746328778,0.00217936170381723,-0.0303493091320727,-0.000366114592609622,-0.0321437655008051,0.0321458504392972
0.04,0.0023698995607512,-0.0809050373107285,0.00292154304330926,-0.040461525308402,-0.000551643482558057,-0.0404435120023265,0.0404472739948463
0.05,0.00290468993750524,-0.098221383581322,0.00367187882199311,-0.0505715994592009,-0.000767188884487862,-0.0476497841221211,0.0476559598126953
0.06,0.00341882997405366,-0.114510462260237,0.00443055225696318,-0.0606795111291504,-0.00101172228290952,-0.0538309511310862,0.0538404576657288
0.07,0.0039135314029804,-0.129840622163051,0.00519775279228419,-0.0707852389267189,-0.00128422138930379,-0.0590553832363318,0.0590693449579963
0.08,0.00439000595686941,-0.144280212105342,0.00597367638354836,-0.0808887604700637,-0.00158367042667895,-0.0633914516352786,0.0634112304915163
0.09,0.00484946536830462,-0.15789758090269,0.00675852579882367,-0.0909900523291409,-0.00190906043051905,-0.0669075285735489,0.0669347584708247
0.1,0.00529312136986998,-0.170761077370671,0.00755251093713535,-0.101089089963712,-0.00225938956726537,-0.0696719874069593,0.0697086125988185
0.11,0.00572218569414944,-0.182939050324865,0.0083558491657171,-0.111185847656909,-0.00263366347156766,-0.0717532026679564,0.0718015200144837
0.12,0.00613787007372693,-0.19449984858085,0.00916876567736999,-0.121280298443975,-0.00303089560364307,-0.0732195501368753,0.0732822546760576
0.13,0.00654138624118639,-0.205511820954204,0.00999149386938062,-0.131372414035773,-0.00345010762819423,-0.0741394069184308,0.0742196395899548
0.14,0.00693394592911178,-0.216043316260504,0.0108242757455721,-0.14146216473661,-0.00389032981646029,-0.0745811515238942,0.0746825470154233
0.15,0.00731676087008703,-0.226162683315331,0.0116673623431976,-0.151549519355876,-0.00435060147311058,-0.0746131639594551,0.0747398954322145
0.16,0.00769104279669608,-0.235938270934261,0.0125210141865341,-0.161634445112944,-0.00482997138983797,-0.0743038258213168,0.0744606416525619
0.17,0.00805800072492393,-0.245438091868395,0.0133855017691971,-0.171716907534741,-0.0053275010442732,-0.0737211843336535,0.0739134310320746
0.18,0.00841868067481849,-0.254709995000158,0.0142611060673799,-0.181796870345305,-0.00584242539256138,-0.0729131246548534,0.0731468227703831
0.19,0.00877387602272525,-0.263770575215532,0.0151481190864138,-0.191874295346597,-0.00637424306368857,-0.0718962798689345,0.0721782933687624
0.2,0.00912435841219803,-0.272633738884672,0.0160468444432725,-0.201949142289755,-0.00692248603107446,-0.0706845965949162,0.0710227640171548
0.21,0.0094708994867907,-0.281313392377735,0.0169575979878785,-0.212021368735877,-0.00748669850108784,-0.0692920236418575,0.0696953025305862
0.22,0.00981427089005713,-0.289823442064878,0.017880708466344,-0.222090929905332,-0.00806643757628688,-0.0677325121595455,0.068211147319299
0.23,0.0101552442655511,-0.298177794316257,0.0188165182295701,-0.232157778514487,-0.00866127396401897,-0.0660200158017704,0.0665857353578513
0.24,0.0104945912568266,-0.30639035550203,0.0197653839909628,-0.242221864598601,-0.00927079273413618,-0.0641684909034289,0.0648347346932395
0.25,0.0108330835074374,-0.314475031992352,0.020727677637386,-0.252283135319513,-0.00989459412994863,-0.0621918966728397,0.0629740820080895
0.26,0.0111714926609374,-0.322445730157382,0.021703787097882,-0.262341534756569,-0.0105322944369447,-0.0601041954008128,0.0610200256545798
0.27,0.0115105903608803,-0.330316356367275,0.0226941172751411,-0.27239700367908,-0.0111835269142608,-0.057919352688195,0.0589891743463283
0.28,0.0118511482508202,-0.338100816992187,0.02369909104521,-0.282449479298364,-0.0118479427943898,-0.0556513376938231,0.0568985512607401
0.29,0.0121939379743108,-0.345813018402277,0.0247191503314916,-0.292498894997233,-0.0125252123571808,-0.0533141234050443,0.0547656525482968
0.3,0.0125397311749059,-0.3534668669677,0.0257547572597219,-0.302545180034471,-0.013215026084816,-0.0509216869332297,0.0526085080053428
0.31,0.0128892994961595,-0.361076269058614,0.0268063954013191,-0.312588259221602,-0.0139170959051596,-0.0484880098370118,0.0504457397248525
0.32,0.0132434145816254,-0.368655131045174,0.0278745711132898,-0.322628052568856,-0.0146311565316644,-0.0460270784763174,0.0482966116256528
0.33,0.0136028480748575,-0.376217359297538,0.0289598149837775,-0.332664474896875,-0.01535696690892,-0.0435528844006632,0.0461810585874685
0.34,0.0139683594484941,-0.38377614236432,0.0300626833933358,-0.342697435410226,-0.0160943239448417,-0.0410787069540936,0.0441190143618577
0.35,0.0143405666882824,-0.391336324118714,0.0311837602031482,-0.352726837228312,-0.0168431935148657,-0.0386094868904021,0.0421234571909683
0.36,0.0147199964981041,-0.398897364772348,0.0323236585826917,-0.362752576868599,-0.0176036620845876,-0.0361447879037498,0.040203664153848
0.37,0.0151071740604762,-0.406458634809161,0.0334830229907935,-0.372774543676481,-0.0183758489303173,-0.0336840911326805,0.0383704289700359
0.38,0.015502624557916,-0.414019504713089,0.0346625313256674,-0.382792619195224,-0.0191599067677514,-0.0312268855178652,0.0366363263236748
0.39,0.0159068731729407,-0.421579344968069,0.0358628972613839,-0.392806676468561,-0.0199560240884432,-0.0287726684995079,0.0350158442708597
0.4,0.0163204450880675,-0.429137526058038,0.0370848727903451,-0.402816579267413,-0.0207644277022775,-0.0263209467906248,0.0335254186813232
0.41,0.0167438654858137,-0.436693418466933,0.0383292509937549,-0.412822181230971,-0.0215853855079412,-0.0238712372359618,0.0321833005563756
0.42,0.0171776595486964,-0.444246392678691,0.0395968690648339,-0.422823324910909,-0.0224192095161375,-0.0214230677677825,0.0310091726415181
0.43,0.0176223524592327,-0.45179581917725,0.0408886116126872,-0.4328198407058,-0.0232662591534545,-0.0189759784714498,0.0300234337467357
0.44,0.0180784693999401,-0.459341068446547,0.0422054142783564,-0.442811545670805,-0.0241269448784164,-0.0165295227757413,0.0292461038834216
0.45,0.0185465355533355,-0.466881510970517,0.0435482676987512,-0.452798242185335,-0.0250017321454157,-0.0140832687851827,0.0286953841226566
0.46,0.0190270761019363,-0.4744165172331,0.0449182218589497,-0.462779716458628,-0.0258911457570134,-0.0116368007744717,0.0283860275642024
0.47,0.0195206162282596,-0.48194545771823,0.0463163908788928,-0.472755736849884,-0.0267957746506332,-0.00918972086834641,0.0283278045172166
0.48,0.0200276811148227,-0.489467702909847,0.0477439582869043,-0.482726051975681,-0.0277162771720816,-0.00674165093416618,0.0285244084530739
0.49,0.0205487959441427,-0.496982623291886,0.0492021828398901,-0.492690388572768,-0.0286533868957475,-0.00429223471911755,0.0289730885388733
0.5,0.0210844858987368,-0.504489589348284,0.050692404958712,-0.502648449078763,-0.0296079190599752,-0.00184114026952187,0.029665108605129
0.51,0.0216350601655454,-0.511988332459097,0.052216053857284,-0.512599908886602,-0.0305809936917386,0.000611576427505756,0.0305871084102574
0.52,0.0221999639492007,-0.519480027588843,0.0537746554556997,-0.522544413220615,-0.031574691506499,0.0030643856317718,0.0317230452988169
0.53,0.0227784264587582,-0.526966210598162,0.0553698411814591,-0.532481573572358,-0.0325914147227008,0.00551536297419608,0.0330547960569146
0.54,0.0233696769032734,-0.534448417347691,0.0570033577790289,-0.542410963622664,-0.0336336808757555,0.00796254627497273,0.0345633712538757
0.55,0.0239729444918017,-0.541928183698067,0.0586770782669946,-0.552332114562045,-0.0347041337751929,0.0104039308639778,0.0362300797474821
0.56,0.0245874584333984,-0.549407045509929,0.0603930142045177,-0.562244509704167,-0.0358055557711193,0.0128374641942381,0.038037327863785
0.57,0.0252124479371191,-0.556886538643914,0.062153329455388,-0.572147578265691,-0.0369408815182689,0.0152610396217772,0.0399690887772567
0.58,0.0258471422120192,-0.564368198960659,0.0639603556694829,-0.582040688159417,-0.0381132134574637,0.0176724891987583,0.0420111165590064
0.59,0.026490770467154,-0.571853562320802,0.0658166097389511,-0.591923137615016,-0.0393258392717971,0.0200695752942139,0.0441509851183565
0.6,0.0271425619115791,-0.579344164584982,0.0677248135311553,-0.601794145401014,-0.0405822516195762,0.022449980816032,0.0463780204962955
0.61,0.0278017457543498,-0.586841541613836,0.0696879162538629,-0.611652839370973,-0.0418861704995132,0.0248112977571372,0.048683177541196
0.62,0.0284675512045216,-0.594347229268001,0.0717091198722171,-0.621498242993054,-0.0432415686676956,0.0271510137250526,0.0510588954751376
0.63,0.0291392074711499,-0.601862763408116,0.0737919080739011,-0.631329259441676,-0.0446527006027512,0.0294664960335601,0.0534989538179463
0.64,0.0298159437632901,-0.609389679894817,0.0759400793713696,-0.641144652727817,-0.0461241356080795,0.0317549728330003,0.0559983409148619
0.65,0.0304969892899977,-0.616929514588743,0.0781577850413577,-0.650943025214068,-0.04766079575136,0.0340135106253253,0.0585531413052449
0.66,0.0311815732603281,-0.624483803350531,0.0804495727360483,-0.66072279069308,-0.0492679994757202,0.0362389873425486,0.0611604445369143
0.67,0.0318691297269936,-0.632054073895788,0.0828204367619499,-0.670482141991735,-0.0509513070349563,0.0384280680959472,0.0638181173817995
0.68,0.0325713833621242,-0.639641365238214,0.0852758762171068,-0.680219011782237,-0.0527044928549826,0.0405776465440231,0.0665154791469819
0.69,0.0333191092979466,-0.64724595890356,0.087821962410755,-0.689931024913688,-0.0545028531128084,0.0426850660101281,0.0692284324372968
0.7,0.0341447214159434,-0.654868071257322,0.0904654172682835,-0.699615440093893,-0.0563206958523401,0.044747368836571,0.0719329395971549
0.71,0.035080633597597,-0.662507918664994,0.0932137047542281,-0.709269078110267,-0.0581330711566311,0.0467611594452727,0.074606031892657
0.72,0.0361592597243899,-0.670165717492074,0.096075137730882,-0.718888232924469,-0.0599158780064921,0.0487225154323947,0.0772256171703974
0.73,0.0374130136778047,-0.677841684104057,0.0990590031088172,-0.72846856082937,-0.0616459894310126,0.0506268767253129,0.0797703495033621
0.74,0.0388743093393238,-0.685536034866439,0.102175708626437,-0.738004941310498,-0.063301399287113,0.0524689064440589,0.0822195432676557
0.75,0.0405755605904297,-0.693248986144715,0.10543695508609,-0.747491301155461,-0.0648613944956599,0.0542423150107464,0.084553114866613
0.76,0.0425491813126049,-0.700980754304381,0.108855938302436,-0.7569203904937,-0.0663067569898309,0.0559396361893183,0.0867515355454979
0.77,0.044827585387332,-0.708731555710934,0.112447585240453,-0.766283495534861,-0.0676199998531205,0.0575519398239271,0.0887957778142235
0.78,0.0474431866960934,-0.716501606729869,0.116228828560129,-0.775570067412873,-0.0687856418640353,0.0590684606830048,0.0906672353946397
0.79,0.0504283991203716,-0.724291123726681,0.120218922531129,-0.784767239213798,-0.0697905234107574,0.0604761154871163,0.0923475917518075
0.8,0.0538156365416491,-0.732100323066868,0.124439800102736,-0.793859193319658,-0.0706241635610873,0.0617588702527899,0.0938186044108744
0.81,0.0576373128414085,-0.739929421115924,0.128916464143939,-0.80282632792027,-0.0712791513025304,0.0628969068043463,0.0950617604295421
0.82,0.0619258419011321,-0.747778634239345,0.133677392560932,-0.811644154374955,-0.0717515506597997,0.0638655201356109,0.0960577414073323
0.83,0.0667136376023025,-0.755648178802627,0.138754912059935,-0.82028183628862,-0.0720412744576329,0.0646336574859934,0.0967856131121599
0.84,0.0720345354125218,-0.763535915975095,0.144185450208449,-0.828700259303397,-0.0721509147959271,0.0651643433283019,0.0972221484400439
0.85,0.0779388967380312,-0.771412327770581,0.150009496592881,-0.836849506182118,-0.0720705998548498,0.0654371784115365,0.0973457532812867
0.86,0.0844877448809684,-0.779230232231634,0.156270971934033,-0.844665626509584,-0.0717832270530647,0.0654353942779496,0.0971319850021741
0.87,0.0917422808417359,-0.78694215300128,0.163015497846183,-0.852066683082446,-0.0712732170044474,0.0651245300811667,0.0965457191202999
0.88,0.0997637056207364,-0.794500613722544,0.170286775957797,-0.858948324813692,-0.0705230703370604,0.0644477110911481,0.095535390901247
0.89,0.108613220218372,-0.801858138038454,0.178119995421626,-0.865179740245662,-0.0695067752032537,0.0633216022072081,0.0940256194089863
0.9,0.118352025635047,-0.808967249592037,0.186531166819266,-0.870601967799385,-0.0681791411842192,0.0616347182073487,0.0919088340754956
0.91,0.129041322871161,-0.815780472026318,0.195502171095761,-0.875032126443431,-0.0664608482245996,0.0592516544171133,0.0890382103251087
0.92,0.14074231292712,-0.822250328984323,0.20496403080651,-0.878278260293555,-0.06422171787939,0.0560279313092317,0.0852265107473722
0.93,0.153516196803323,-0.82832934410908,0.214785523082994,-0.88016771644844,-0.0612693262796705,0.05183837233936,0.0802567579058539
0.94,0.167424175500176,-0.833970041043615,0.2247776080699,-0.880584647451513,-0.0573534325697247,0.0466146064078981,0.0739076299044504
0.95,0.182527450018079,-0.839124943430954,0.234719828410398,-0.879501768211853,-0.0521923783923187,0.0403768247808992,0.0659873650150876
0.96,0.198887221357436,-0.843746574914124,0.244401187799155,-0.87698861783708,-0.0455139664417187,0.0332420429229561,0.0563609311398379
0.97,0.21656469051865,-0.847787459136151,0.253656493026254,-0.873191093590971,-0.0370918025076043,0.0254036344548203,0.0449571624635859
0.98,0.235621058502122,-0.851200119740061,0.262382922900796,-0.868294777192813,-0.0267618643986743,0.0170946574527521,0.0317557034171811
0.99,0.256117526308255,-0.853937080368882,0.270536133329308,-0.862490266003388,-0.0144186070210527,0.00855318563450636,0.016764641747615
1,0.278115294937453,-0.855950864665638,0.278115294937452,-0.855950864665637,2.77555756156289e-16,-8.88178419700125e-16,9.30536459788923e-16
