xi,s1,s2
0,3.04083665334355e-27,-1.32216226435017e-26
0.01,0.00163485942539694,-0.0405430391184687
0.02,0.00290393458543459,-0.0708053373172316
0.03,0.00394655350610801,-0.0948779190543005
0.04,0.0048481292656066,-0.115151125449489
0.05,0.00565952406126951,-0.132976525006749
0.06,0.00641035785755779,-0.149106129796175
0.07,0.0071177505553929,-0.163966760646952
0.08,0.00779176635246615,-0.177818550302394
0.09,0.00843860869337795,-0.190837718888211
0.1,0.0090623939377208,-0.203154901445027
0.11,0.00966611160876511,-0.214871452895028
0.12,0.0102521601267512,-0.226067355501029
0.13,0.0108226506850385,-0.236806493324509
0.14,0.0113795583167925,-0.247140616717175
0.15,0.0119247682245044,-0.257112297488329
0.16,0.0124600571821528,-0.266757092757918
0.17,0.0129870428641331,-0.276105106942292
0.18,0.0135071270046851,-0.285182112975767
0.19,0.0140214513411565,-0.294010365527168
0.2,0.0145308783440437,-0.30260921062659
0.21,0.0150360017865777,-0.310995567774364
0.22,0.0155371853107081,-0.319184332432852
0.23,0.0160346211934572,-0.327188721617139
0.24,0.0165283989957555,-0.33502057098301
0.25,0.0170185746850108,-0.342690588359816
0.26,0.017505232674851,-0.350208568211874
0.27,0.0179885351319234,-0.357583571219918
0.28,0.0184687548062943,-0.364824072882741
0.29,0.0189462895486578,-0.37193808474773
0.3,0.019421658584224,-0.378933251587589
0.31,0.0198954825197449,-0.385816927549149
0.32,0.0203684509480041,-0.392596234009893
0.33,0.0208412830766529,-0.399278101607517
0.34,0.0213146871872361,-0.405869298710108
0.35,0.0217893239256401,-0.412376448469336
0.36,0.0222657772952546,-0.418806036493868
0.37,0.0227445360754913,-0.42516441107608
0.38,0.02322598723957,-0.431457777801133
0.39,0.0237104217967591,-0.437692190263365
0.4,0.0241980523355238,-0.443873538510889
0.41,0.0246890403953627,-0.450007536735229
0.42,0.0251835306586184,-0.456099711618219
0.43,0.0256816880289715,-0.462155392634781
0.44,0.0261837335096896,-0.468179705463797
0.45,0.0266899754120285,-0.474177569480094
0.46,0.0272008332534085,-0.480153700112307
0.47,0.0277168525464024,-0.486112616662675
0.48,0.028238709521042,-0.492058655996079
0.49,0.0287672056644122,-0.497995992316855
0.5,0.0293032528029709,-0.503928663063219
0.51,0.0298478502944666,-0.509860600760361
0.52,0.0304020567300538,-0.515795670483462
0.53,0.0309669592469743,-0.521737712373633
0.54,0.0315436437645642,-0.527690588374299
0.55,0.0321331691813658,-0.533658232012979
0.56,0.0327365481621759,-0.539644699692306
0.57,0.0333547367272159,-0.545654221592023
0.58,0.0339886344389254,-0.551691249921526
0.59,0.0346390965652,-0.557760501900393
0.6,0.0353069591812131,-0.563866994482216
0.61,0.0359930777552634,-0.570016067474955
0.62,0.0366983793436628,-0.576213391367087
0.63,0.0374239280343608,-0.582464956139483
0.64,0.0381710025576198,-0.588777038458247
0.65,0.0389411840246022,-0.595156146903782
0.66,0.0397364507323922,-0.601608947465932
0.67,0.0405592759479023,-0.608142174127781
0.68,0.0414127235570289,-0.614762531953482
0.69,0.0423005354393359,-0.621476602688283
0.7,0.0432272034024562,-0.628290765471697
0.71,0.0441980174848899,-0.635211147857103
0.72,0.045219081552147,-0.642243624810725
0.73,0.0462972886917113,-0.649393883883938
0.74,0.0474402594584077,-0.656667568148022
0.75,0.048656265533446,-0.664070494749645
0.76,0.0499541833363609,-0.671608931256015
0.77,0.0513435442467959,-0.679289896156513
0.78,0.0528347702113812,-0.687121434085105
0.79,0.0544397056292617,-0.695112800525281
0.8,0.0561725785281299,-0.703274474956724
0.81,0.0580515461543137,-0.711617905598654
0.82,0.0601010005793754,-0.720154872675008
0.83,0.0623548020258328,-0.72889633350106
0.84,0.064860496465838,-0.73785056215786
0.85,0.0676843596489269,-0.74702031908
0.86,0.0709168669384941,-0.756398701045562
0.87,0.0746779439273903,-0.76596323679491
0.88,0.0791211083871792,-0.775667708241123
0.89,0.0844353696897308,-0.785431091970949
0.9,0.0908435074239613,-0.795122930471255
0.91,0.0985951065371304,-0.804544357191229
0.92,0.107952487484,-0.8134038991928
0.93,0.119167527436278,-0.821286819502533
0.94,0.132447576956383,-0.827615449031733
0.95,0.147909235673699,-0.831595695077922
0.96,0.165519406050826,-0.832142389285667
0.97,0.185023705423988,-0.827773598776584
0.98,0.205862977620833,-0.816461484929351
0.99,0.22707930657801,-0.795424755061543
1,0.247213595499958,-0.760845213036123
