xi,sx,sy,cx,cy,ex,ey,ne
0,-1.39499366075763e-27,1.7916256985084e-26,0,0,-1.39499366075763e-27,1.7916256985084e-26,1.79704833454508e-26
0.01,-0.00745952208669421,-0.0245908710135754,-0.00289560718190077,-0.00969859995413489,-0.00456391490479344,-0.0148922710594405,0.0155759127041096
0.02,-0.0143822633356447,-0.0468673652552391,-0.00582633224879267,-0.0193851045136035,-0.00855593108685204,-0.0274822607416356,0.0287833044008885
0.03,-0.0208374839551626,-0.0671261233948372,-0.00879300719428849,-0.0290591179134494,-0.0120444767608741,-0.0380670054813878,0.0399270124948417
0.04,-0.0268866766010122,-0.0856302045297088,-0.0117964922810474,-0.0387202248408332,-0.0150901843199648,-0.0469099796888756,0.049277376728284
0.05,-0.0325842175319469,-0.102611860959448,-0.0148376772436081,-0.0483679892457868,-0.0177465402883388,-0.0542438717136616,0.0570730874466575
0.06,-0.0379779887890409,-0.118275190753425,-0.0179174825490821,-0.0580019530667534,-0.0200605062399588,-0.0602732376866715,0.0635239096076227
0.07,-0.0431099713988165,-0.132798668111055,-0.0210368607184318,-0.0676216348639556,-0.0220731106803847,-0.0651770332470992,0.068813282714909
0.08,-0.0480168096001663,-0.146337551514834,-0.0241967977111365,-0.0772265283530195,-0.0238200118890298,-0.0691110231618141,0.0731007967731292
0.09,-0.0527303460950717,-0.15902616967612,-0.0273983143761051,-0.0868161008305841,-0.0253320317189666,-0.0722100688455357,0.0765245442566484
0.1,-0.0572781283231163,-0.170980085273677,-0.030642467971742,-0.0963897914828802,-0.0266356603513743,-0.0745902937907971,0.0792033479731204
0.11,-0.0616838857597956,-0.182298136484972,-0.0339303537580971,-0.105947009567433,-0.0277535320016986,-0.0763511269175391,0.0812388645916932
0.12,-0.0659679782386212,-0.193064356310225,-0.0372631066640299,-0.115487132457135,-0.0287048715745914,-0.07757722385309,0.0827175635090046
0.13,-0.0701478152970214,-0.203349769689222,-0.0406419030322897,-0.125009503534944,-0.0295059122647317,-0.0783402661542776,0.0837125806536693
0.14,-0.0742382465460368,-0.213214068410874,-0.0440679624453426,-0.134513429926365,-0.0301702841006942,-0.0787006384845086,0.0842854467899763
0.15,-0.0782519230638117,-0.222707163815542,-0.0475425496346584,-0.143998180055687,-0.0307093734291533,-0.0787089837598551,0.0844876898779954
0.16,-0.0821996298128811,-0.231870617290111,-0.0510669764759971,-0.153462981010621,-0.031132653336884,-0.0784076362794897,0.0843623110798379
0.17,-0.0860905890812527,-0.24073894855582,-0.0546426040729857,-0.162907015698562,-0.031447985008267,-0.0778319328572578,0.0839451340661082
0.18,-0.0899327349472852,-0.24934082174885,-0.0582708449309448,-0.172329419776106,-0.0316618900163404,-0.0770114019727439,0.0832660273653931
0.19,-0.0937329587683615,-0.25770010929367,-0.0619531652224844,-0.181729278331753,-0.0317797935458772,-0.0759708309619175,0.0823499996045101
0.2,-0.0974973256933577,-0.265836833569131,-0.0656910871458267,-0.191105622299804,-0.031806238547531,-0.074731211269327,0.0812181676001326
0.21,-0.101231262198907,-0.273767986367323,-0.0694861913760966,-0.200457424581454,-0.0317450708228109,-0.0733105617858691,0.0798885973772541
0.22,-0.104939714649462,-0.281508226145185,-0.0733401196089236,-0.209783595846776,-0.0315995950405387,-0.0717246302984088,0.0783770183036422
0.23,-0.108627278881147,-0.289070453068871,-0.0772545771945829,-0.219082979988901,-0.0313727016865637,-0.06998747307997,0.0766974106423003
0.24,-0.11229830080941,-0.296466261850871,-0.08123133585953,-0.228354349199002,-0.0310669649498796,-0.0681119126518697,0.0748624669396686
0.25,-0.115956948060471,-0.30370627237989,-0.0852722365104926,-0.23759639862783,-0.0306847115499779,-0.0661098737520593,0.0728839277921996
0.26,-0.119607252667952,-0.310800338312436,-0.0893791921142368,-0.246807740596449,-0.0302280605537152,-0.0639925977159873,0.0707727928463986
0.27,-0.123253127193898,-0.3177576432568,-0.0935541906436222,-0.25598689831543,-0.0296989365502758,-0.0617707449413696,0.068539417584548
0.28,-0.126898366773818,-0.324586735575038,-0.0977992980775529,-0.265132299068242,-0.0290990686962649,-0.059454436506796,0.0661935481699734
0.29,-0.13054664958539,-0.331295552828621,-0.102116661438803,-0.274242266810704,-0.0284299881465875,-0.0570532860179164,0.0637443461920921
0.3,-0.134201538100028,-0.337891445498384,-0.106508511849328,-0.283315014134362,-0.0276930262506997,-0.0545764313640216,0.0612004130979007
0.31,-0.137866481158699,-0.34438120014777,-0.110977167577482,-0.292348633537426,-0.0268893135812168,-0.0520325666103443,0.0585698145201855
0.32,-0.141544816871992,-0.350771062029342,-0.115525037045294,-0.301341087942517,-0.0260197798266985,-0.0494299740868251,0.0558601045510485
0.33,-0.145239776344447,-0.35706675713457,-0.120154621756604,-0.310290200396025,-0.0250851545878432,-0.0467765567385454,0.0530783500215516
0.34,-0.148954488223124,-0.363273513686899,-0.124868519098007,-0.319193642879408,-0.0240859691251175,-0.0440798708074911,0.0502311548652947
0.35,-0.152691984070435,-0.369396083078097,-0.129669424954164,-0.328048924158461,-0.023022559116271,-0.0413471589196359,0.047324684668657
0.36,-0.156455204561221,-0.375438760247871,-0.134560136066741,-0.336853376592505,-0.0218950684944798,-0.0385853836553651,0.0443646915486818
0.37,-0.160247006504087,-0.381405403506767,-0.139543552051733,-0.345604141822002,-0.0207034544523534,-0.0358012616847644,0.041356539561255
0.38,-0.164070170686983,-0.387299453802346,-0.144622676972953,-0.354298155250365,-0.0194474937140306,-0.0330012985519814,0.0383052309466249
0.39,-0.167927410547046,-0.393123953428637,-0.149800620349573,-0.362932129234314,-0.0181267901974735,-0.030191824194323,0.0352154337051829
0.4,-0.171821381664686,-0.398881564178863,-0.155080597452462,-0.371502534897357,-0.0167407842122235,-0.0273790292815058,0.0320915113454911
0.41,-0.175754692081926,-0.404574584941447,-0.160465928717189,-0.380005582483598,-0.0152887633647366,-0.024569002457849,0.0289375563411409
0.42,-0.179729913445,-0.4102049687393,-0.165960038070599,-0.388437200174886,-0.0137698753744006,-0.0217677685644131,0.025757430308561
0.43,-0.183749592971196,-0.415774339212373,-0.171566449932334,-0.396793011304283,-0.0121831430388621,-0.0189813279080901,0.0225548173005195
0.44,-0.187816266239955,-0.421284006543503,-0.177288784612218,-0.405068309914308,-0.0105274816277368,-0.0162156966291955,0.0193333051130022
0.45,-0.191932470808224,-0.426734982827521,-0.183130751778793,-0.413258034630894,-0.00880171902943069,-0.0134769481966272,0.0160965334953715
0.46,-0.196100760650056,-0.432127996883642,-0.189096141623273,-0.421356740855394,-0.00700461902678287,-0.0107712560282482,0.0128485269247662
0.47,-0.200323721420466,-0.43746350851114,-0.195188813287028,-0.429358571319604,-0.00513490813343775,-0.00810493719153543,0.00959464894707354
0.48,-0.204603986543542,-0.442741722188283,-0.201412680059762,-0.437257225105257,-0.00319130648377969,-0.00548449708302634,0.00634540348024763
0.49,-0.208944254124799,-0.447962600214566,-0.207771690790913,-0.445045925303018,-0.0011725633338856,-0.00291667491154729,0.00314354852223126
0.5,-0.213347304687797,-0.453125875296198,-0.214269806890273,-0.452717385580112,0.000922502202475195,-0.00040848971608598,0.00100889749812337
0.51,-0.217816019732016,-0.45823106256905,-0.220910974228024,-0.46026377604434,0.00309495449600775,0.00203271347528988,0.00370279183927258
0.52,-0.222353400941687,-0.463277470726113,-0.227699089183592,-0.467676688939475,0.00534568824190546,0.00439921821336198,0.00692311372638223
0.53,-0.226962589143258,-0.468264210485701,-0.234637958042487,-0.474947104886951,0.0076753688992289,0.00668289440125003,0.0101770509145582
0.54,-0.231646882109154,-0.473190198636579,-0.241731248908648,-0.482065360605006,0.0100843667994932,0.00887516196842641,0.0134336500517366
0.55,-0.23640975103753,-0.478054157327106,-0.248982435297016,-0.489021119291535,0.0125726842594861,0.0109669619644291,0.0166837239313639
0.56,-0.241254855705026,-0.482854608592568,-0.256394730610307,-0.495803345151495,0.0151398749052806,0.0129487365589276,0.0199219876172046
0.57,-0.24618605829253,-0.48758986412069,-0.263971012801567,-0.502400283881037,0.0177849545090375,0.0148104197603467,0.0231441815661345
0.58,-0.25120743588394,-0.492258010255336,-0.271713738699303,-0.508799451281439,0.0205063028153625,0.0165414410261032,0.0263463038465625
0.59,-0.256323291637936,-0.496856888238383,-0.279624847746317,-0.514987632552262,0.023301556108381,0.0181307443138793,0.0295243358341436
0.6,-0.261538164632749,-0.501384069689785,-0.287705655299753,-0.520950895182233,0.0261674906670041,0.0195668254924484,0.0326741216815338
0.61,-0.266856838383937,-0.505836827325817,-0.295956736179477,-0.526674618684543,0.0290998977955395,0.0208377913587264,0.0357913062128313
0.62,-0.27228434803517,-0.510212100915501,-0.304377799851565,-0.532143544664113,0.0320934518163941,0.0219314437486121,0.0388712988513344
0.63,-0.277825986222008,-0.514506458475216,-0.312967559499589,-0.537341850798233,0.0351415732775803,0.0228353923230177,0.0419092509473706
0.64,-0.283487307608692,-0.51871605270149,-0.321723598258577,-0.542253252186917,0.0382362906498848,0.0235371994854271,0.0449000410053182
0.65,-0.289274132097935,-0.522836572641975,-0.330642237030333,-0.546861133105333,0.0413681049323975,0.024024560463358,0.0478382651353014
0.66,-0.29519254671372,-0.526863190604605,-0.339718409497983,-0.551148711388178,0.0445258627842627,0.0242855207835727,0.0507182312035064
0.67,-0.301248906157095,-0.530790504304935,-0.348945551108119,-0.555099236428305,0.047696644951024,0.0243087321233704,0.0535339555518722
0.68,-0.307449832034981,-0.534612474251664,-0.358315509747852,-0.558696220044084,0.0508656777128708,0.0240837457924198,0.0562791611574261
0.69,-0.313802210761977,-0.538322356370342,-0.367818486435779,-0.561923697278481,0.0540162756738021,0.0236013409081394,0.058947275851649
0.7,-0.320313190135173,-0.541912629865257,-0.377443014378343,-0.564766511627389,0.0571298242431708,0.0228538817621318,0.0615314287958039
0.71,-0.326990174581963,-0.545374920319506,-0.387175984036005,-0.567210616432601,0.0601858094540426,0.0218356961130945,0.064024442866625
0.72,-0.333840819080865,-0.548699918033249,-0.397002720266933,-0.569243381483526,0.0631619011860672,0.020543463450277,0.0664188200133922
0.73,-0.340873021755348,-0.551877291600145,-0.406907115132114,-0.570853891591069,0.0660340933767665,0.0189765999909243,0.0687067160858898
0.74,-0.34809491514065,-0.55489559672197,-0.41687181664818,-0.572033222399039,0.0687769015075298,0.0171376256770693,0.0708799012049523
0.75,-0.355514856123619,-0.557742180261421,-0.426878469906494,-0.572774678324591,0.0713636137828746,0.0150324980631699,0.072929701563701
0.76,-0.363141414616078,-0.560403079422972,-0.43690800292391,-0.5730739785077,0.0737665883078313,0.0126708990847275,0.0748469186686561
0.77,-0.370983364412436,-0.56286290978467,-0.446940945832406,-0.572929379067278,0.0759575814199703,0.0100664692826077,0.0766217200210821
0.78,-0.379049694514118,-0.565104708923102,-0.456957769050616,-0.572341723661475,0.0779080745364972,0.00723701473837268,0.0782434819030175
0.79,-0.387349659203437,-0.567109702373795,-0.466939224333697,-0.571314418972663,0.0795895651302599,0.00420471659886723,0.0797005553261749
0.8,-0.395892870317574,-0.568856985649919,-0.476866672329524,-0.569853336760785,0.08097380201195,0.000996351110865934,0.0809799316362184
0.81,-0.404689431783227,-0.570323122209163,-0.486722381519528,-0.567966648956525,0.0820329497363011,-0.0023564732526381,0.0820667887066924
0.82,-0.41375011641191,-0.571481657368791,-0.496489786003614,-0.565664606338157,0.0827396695917045,-0.00581705103063401,0.0829439027707126
0.83,-0.423086584955914,-0.572302548168873,-0.506153693124772,-0.562959274228663,0.0830671081688578,-0.00934327394021073,0.0835909159386266
0.84,-0.432711647424926,-0.572751509183697,-0.515700435936686,-0.559864240139239,0.0829887885117598,-0.0128872690444578,0.0839834550496337
0.85,-0.442639566663305,-0.572789274281351,-0.525117969499937,-0.55639430836692,0.0824784028366325,-0.0163949659144309,0.0840921033261577
0.86,-0.452886404188014,-0.572370774331489,-0.534395913524153,-0.552565195412818,0.0815095093361393,-0.0198055789186716,0.0838812319206264
0.87,-0.463470408287218,-0.571444230861274,-0.543525546659122,-0.548393238037541,0.0800551383719044,-0.023050992823733,0.0833077034247407
0.88,-0.474412444379529,-0.569950165659489,-0.5524997596326,-0.543895123180871,0.0780873152530714,-0.0260550424786185,0.082319463324266
0.89,-0.485736467633919,-0.567820326328838,-0.561312975431864,-0.539087646200699,0.0755765077979451,-0.0287326801281391,0.0808540378600773
0.9,-0.497470037850283,-0.564976527786412,-0.569961044932615,-0.533987501227337,0.0724910070823322,-0.0309890265590759,0.078836957544605
0.91,-0.509644876600669,-0.561329409712344,-0.578441125960245,-0.528611105093,0.0687962493595762,-0.0327183046193438,0.0761801245936836
0.92,-0.522297466631155,-0.556777109946627,-0.58675155291629,-0.522974454401564,0.0644540862851347,-0.0338026555450636,0.0727801398786084
0.93,-0.535469693524397,-0.551203853834125,-0.594891703001107,-0.517093013890508,0.0594220094767096,-0.0341108399436172,0.0685166009950088
0.94,-0.549209529622823,-0.544478459517745,-0.60286186386774,-0.510981633285666,0.0536523342449174,-0.0334968262320793,0.0632503781613237
0.95,-0.56357176021249,-0.536452759179801,-0.610663106369477,-0.504654489302146,0.0470913461569868,-0.0317982698776554,0.0568218694702081
0.96,-0.578618751967607,-0.526959936231543,-0.618297164993616,-0.49812504922478,0.0396784130260093,-0.0288348870067638,0.0490492320934326
0.97,-0.594421263655697,-0.515812778450871,-0.625766327651312,-0.4914060525277,0.0313450639956148,-0.0244067259231711,0.039726581871311
0.98,-0.611059299103441,-0.50280184706822,-0.633073335735825,-0.484509507189699,0.022014036632384,-0.018292339878521,0.0286221506369328
0.99,-0.628623002423158,-0.487693561800628,-0.640221294767518,-0.477446697665705,0.0115982923443601,-0.0102468641349234,0.0154763887875958
1,-0.647213595499958,-0.470228201833978,-0.647213595499958,-0.470228201833979,1.11022302462516e-16,1.11022302462516e-16,1.57009245868378e-16
