xi,s1,s2
0,1.01995815690749e-26,-1.21290286143138e-26
0.01,0.00135703754670335,-0.0234488421990453
0.02,0.00266341439112517,-0.0443717400148165
0.03,0.00389366160534874,-0.0631864277513521
0.04,0.00503678272775957,-0.0802441982869119
0.05,0.00609204062234278,-0.0958395467073534
0.06,0.00706556278307263,-0.110218616583377
0.07,0.0079676572995386,-0.123586565946551
0.08,0.00881074060443018,-0.136113962100218
0.09,0.00960778667268163,-0.147942306759138
0.1,0.0103712155359595,-0.159188785645917
0.11,0.0111121468147593,-0.169950329583072
0.12,0.0118399514536613,-0.180307067306817
0.13,0.0125620419732846,-0.190325243692472
0.14,0.0132838483251652,-0.200059670821683
0.15,0.0140089328531756,-0.209555773338468
0.16,0.0147392039271955,-0.218851283834457
0.17,0.0154751935215382,-0.227977638573517
0.18,0.0162163693621318,-0.236961118712371
0.19,0.0169614572626543,-0.245823777296653
0.2,0.0177087539107203,-0.254584187711305
0.21,0.0184564146508199,-0.263258044940093
0.22,0.0192027047410117,-0.271858646941491
0.23,0.0199462061353805,-0.280397279677123
0.24,0.0206859750639747,-0.288883525834431
0.25,0.0214216485463502,-0.297325514067213
0.26,0.0221535004839548,-0.305730122636201
0.27,0.022882450130406,-0.314103148666858
0.28,0.0236100275372224,-0.322449451853106
0.29,0.0243383020157923,-0.330773079323763
0.3,0.0250697807442778,-0.339077376553044
0.31,0.0258072853807723,-0.347365087637548
0.32,0.0265538149213562,-0.355638446979781
0.33,0.0273124030637129,-0.363899263412371
0.34,0.0280859780036996,-0.372148997067781
0.35,0.0288772319038187,-0.380388828845398
0.36,0.0296885062364814,-0.388619722146705
0.37,0.0305216978939799,-0.396842476594983
0.38,0.0313781895613815,-0.405057773611006
0.39,0.0322588065254891,-0.413266213883398
0.4,0.0331638008826468,-0.421468346926928
0.41,0.0340928630130003,-0.429664693062365
0.42,0.0350451592088523,-0.437855758277857
0.43,0.0360193934799977,-0.446042042543785
0.44,0.0370138908093722,-0.454224042251056
0.45,0.0380266984980053,-0.462402247526467
0.46,0.0390557017191353,-0.470577135248424
0.47,0.0400987489974141,-0.478749158641678
0.48,0.0411537830404127,-0.486918734371003
0.49,0.0422189721761241,-0.49508622808084
0.5,0.0432928375918589,-0.503251939340834
0.51,0.0443743716268288,-0.511416086955956
0.52,0.0454631425428274,-0.519578795584477
0.53,0.0465593814847353,-0.527740084577502
0.54,0.0476640477451018,-0.535899859910006
0.55,0.048778868964792,-0.544057910015406
0.56,0.0499063535346281,-0.552213906263648
0.57,0.0510497732111023,-0.560367408736498
0.58,0.0522131148225996,-0.568517877853363
0.59,0.0534010009211285,-0.576664692286361
0.6,0.0546185803283333,-0.584807173474619
0.61,0.055871390733542,-0.592944616904878
0.62,0.0571651968257884,-0.601076330168407
0.63,0.0585058088811461,-0.609201677632955
0.64,0.059898888281313,-0.617320131383123
0.65,0.0613497481091947,-0.62543132788289
0.66,0.0628631587522581,-0.633535129600338
0.67,0.0644431703446452,-0.64163169060669
0.68,0.066092965894427,-0.649721524919686
0.69,0.0678147610654578,-0.657805576102446
0.7,0.0696097686939704,-0.665885286311415
0.71,0.0714782477465644,-0.673962662446239
0.72,0.0734196569984655,-0.682040336091593
0.73,0.0754329330109415,-0.690121612480146
0.74,0.0775169099918961,-0.698210501739023
0.75,0.0796708958335435,-0.706311723209201
0.76,0.0818954140356948,-0.714430670648342
0.77,0.0841931153425567,-0.722573322642396
0.78,0.086569855745058,-0.73074607856024
0.79,0.0890359290295847,-0.738955495888262
0.8,0.0916074322876036,-0.747207899778529
0.81,0.0943077317390107,-0.755508830134699
0.82,0.0971689838651326,-0.763862285544323
0.83,0.100233653195149,-0.772269716844573
0.84,0.103555953142292,-0.780728716080719
0.85,0.107203120043504,-0.789231339082915
0.86,0.111256413018311,-0.797761991846924
0.87,0.115811713429492,-0.806294802358491
0.88,0.120979577599682,-0.814790390448997
0.89,0.126884575014364,-0.823191938711868
0.9,0.133663721522739,-0.831420457445002
0.91,0.141463793033798,-0.839369126014127
0.92,0.150437279895424,-0.846896581955622
0.93,0.160736715539662,-0.853819017554792
0.94,0.172507085077323,-0.859900931547029
0.95,0.185875990329872,-0.864844370994605
0.96,0.200941217296052,-0.868276485291062
0.97,0.217755320264993,-0.869735200638314
0.98,0.236306803706539,-0.868652809228644
0.99,0.256497448693304,-0.864337252744717
1,0.278115294937453,-0.855950864665638
