xi,s1,s2
0,-1.07450847151948e-27,-8.2410429990795e-27
0.01,-0.00438756556686178,-0.0160625229089461
0.02,-0.00869965417600868,-0.0317055821469862
0.03,-0.0129362658274407,-0.0469291777141205
0.04,-0.0170974005211579,-0.0617333096103488
0.05,-0.0211830582571602,-0.0761179778356711
0.06,-0.0251932390354476,-0.0900831823900876
0.07,-0.0291279428560202,-0.103628923273598
0.08,-0.0329871697188779,-0.116755200486203
0.09,-0.0367709196240207,-0.129462014027901
0.1,-0.0404791925714487,-0.141749363898694
0.11,-0.0441119885611618,-0.153617250098581
0.12,-0.04766930759316,-0.165065672627562
0.13,-0.0511511496674433,-0.176094631485637
0.14,-0.0545575147840118,-0.186704126672806
0.15,-0.0578884029428654,-0.196894158189069
0.16,-0.0611438141440042,-0.206664726034426
0.17,-0.064323748387428,-0.216015830208877
0.18,-0.0674282056731371,-0.224947470712423
0.19,-0.0704571860011312,-0.233459647545062
0.2,-0.0734106893714105,-0.241552360706796
0.21,-0.076362177367586,-0.24941945424392
0.22,-0.0793851115732691,-0.257254772202733
0.23,-0.0824794919884596,-0.265058314583234
0.24,-0.0856453186131577,-0.272830081385423
0.25,-0.0888825914473632,-0.280570072609301
0.26,-0.0921913104910762,-0.288278288254866
0.27,-0.0955714757442967,-0.29595472832212
0.28,-0.0990230872070247,-0.303599392811062
0.29,-0.10254614487926,-0.311212281721692
0.3,-0.106140648761003,-0.318793395054011
0.31,-0.109806598852253,-0.326342732808017
0.32,-0.113543995153011,-0.333860294983712
0.33,-0.117352837663277,-0.341346081581095
0.34,-0.12123312638305,-0.348800092600166
0.35,-0.12518486131233,-0.356222328040926
0.36,-0.129208042451118,-0.363612787903373
0.37,-0.133302669799413,-0.370971472187509
0.38,-0.137468743357216,-0.378298380893333
0.39,-0.141706263124526,-0.385593514020845
0.4,-0.146015229101344,-0.392856871570046
0.41,-0.150427869968401,-0.400044036373657
0.42,-0.154976414406428,-0.407110591264403
0.43,-0.159660862415425,-0.414056536242283
0.44,-0.164481213995393,-0.420881871307298
0.45,-0.169437469146331,-0.427586596459447
0.46,-0.174529627868239,-0.43417071169873
0.47,-0.179757690161118,-0.440634217025147
0.48,-0.185121656024967,-0.446977112438699
0.49,-0.190621525459786,-0.453199397939385
0.5,-0.196257298465576,-0.459301073527205
0.51,-0.202028975042336,-0.46528213920216
0.52,-0.207936555190066,-0.471142594964248
0.53,-0.213980038908766,-0.476882440813472
0.54,-0.220159426198437,-0.482501676749829
0.55,-0.226474717059079,-0.488000302773321
0.56,-0.23292591149069,-0.493378318883947
0.57,-0.239513009493272,-0.498635725081707
0.58,-0.246236011066824,-0.503772521366602
0.59,-0.253094916211347,-0.508788707738631
0.6,-0.26008972492684,-0.513684284197794
0.61,-0.267192324156353,-0.518399363477897
0.62,-0.274374600842935,-0.522874058312745
0.63,-0.281636554986587,-0.527108368702337
0.64,-0.288978186587309,-0.531102294646675
0.65,-0.2963994956451,-0.534855836145758
0.66,-0.303900482159961,-0.538368993199585
0.67,-0.311481146131892,-0.541641765808158
0.68,-0.319141487560892,-0.544674153971475
0.69,-0.326881506446962,-0.547466157689537
0.7,-0.334701202790102,-0.550017776962345
0.71,-0.342600576590311,-0.552329011789897
0.72,-0.350579627847589,-0.554399862172194
0.73,-0.358638356561938,-0.556230328109236
0.74,-0.366776762733356,-0.557820409601023
0.75,-0.374994846361843,-0.559170106647555
0.76,-0.383292607447401,-0.560279419248832
0.77,-0.391670045990028,-0.561148347404854
0.78,-0.400127161989724,-0.561776891115621
0.79,-0.40866395544649,-0.562165050381132
0.8,-0.417280426360326,-0.562312825201389
0.81,-0.426078753443427,-0.562108817110718
0.82,-0.435161115407989,-0.561441627643448
0.83,-0.444527512254013,-0.560311256799577
0.84,-0.454177943981497,-0.558717704579106
0.85,-0.464112410590443,-0.556660970982035
0.86,-0.474330912080849,-0.554141056008364
0.87,-0.484833448452717,-0.551157959658094
0.88,-0.495620019706046,-0.547711681931223
0.89,-0.506690625840836,-0.543802222827753
0.9,-0.518045266857087,-0.539429582347682
0.91,-0.529683942754799,-0.534593760491012
0.92,-0.541606653533973,-0.529294757257741
0.93,-0.553813399194607,-0.523532572647871
0.94,-0.566304179736702,-0.5173072066614
0.95,-0.579078995160259,-0.51061865929833
0.96,-0.592137845465276,-0.50346693055866
0.97,-0.605480730651755,-0.495852020442389
0.98,-0.619107650719695,-0.487773928949519
0.99,-0.633018605669096,-0.479232656080049
1,-0.647213595499958,-0.470228201833978
