xi,sx,sy,cx,cy,ex,ey,ne
0,1.57755605805376e-28,2.59245486647553e-29,0,0,1.57755605805376e-28,2.59245486647553e-29,1.59871552774384e-28
0.01,0.0163885015998277,-0.00546674363270111,0.00961304866315409,-0.00348100407180598,0.00677545293667362,-0.00198573956089513,0.00706044786828592
0.02,0.0322949980685276,-0.0107013475362976,0.019247970725922,-0.00689944538335712,0.0130470273426056,-0.00380190215294047,0.0135896792625592
0.03,0.0477194894060997,-0.0157038117107894,0.0289044684837811,-0.01025490046537,0.0188150209223185,-0.0054489112454194,0.0195881506546111
0.04,0.0626619756125439,-0.0204741361561767,0.038582236674334,-0.0135469498111234,0.0240797389382099,-0.00692718634505325,0.0250563312955316
0.05,0.0771224566878603,-0.0250123208724593,0.0482809624885891,-0.0167751781013639,0.0288414941992712,-0.00823714277109538,0.0299947046772927
0.06,0.0911009326320489,-0.0293183658596372,0.0580003255883109,-0.0199391744307792,0.033100607043738,-0.00937919142885804,0.0344037704114407
0.07,0.10459740344511,-0.0333922711177105,0.0677399981295629,-0.0230385325358019,0.0368574053155469,-0.0103537385819086,0.0382840466672086
0.08,0.117611869127043,-0.0372340366466792,0.0774996447925722,-0.0260728510235236,0.0401122243344705,-0.0111611856231557,0.041636073368816
0.09,0.130144329677848,-0.0408436624465433,0.0872789228180264,-0.029041733601463,0.0428654068598215,-0.0118019288450804,0.0444604164366729
0.1,0.142194785097525,-0.0442211485173028,0.0970774820499102,-0.0319447893079493,0.045117303047615,-0.0122763592093535,0.0467576734849737
0.11,0.153763235386075,-0.0473664948589576,0.106894964984981,-0.034781632742854,0.0468682704010937,-0.0125848621161036,0.0485284815842344
0.12,0.164849680543496,-0.0502797014715078,0.116731006828972,-0.0375518842984083,0.0481186737145243,-0.0127278171730995,0.0497735280047205
0.13,0.17545412056979,-0.0529607683549533,0.126585235559601,-0.040255170389832,0.0488688850101897,-0.0127055979651213,0.0504935653503537
0.14,0.185576555464956,-0.0554096955092942,0.136457271996451,-0.0428911236854942,0.0491192834685049,-0.0125185718238,0.0506894333068242
0.15,0.195216985228995,-0.0576264829345305,0.146346729877796,-0.0454593833363163,0.0488702553511988,-0.0121670995982142,0.0503620906111357
0.16,0.204375409861905,-0.0596111306306622,0.156253215944388,-0.0479595952041291,0.0481221939175173,-0.011651535426533,0.0495126632815373
0.17,0.213078982765509,-0.0613739234307926,0.16617633003028,-0.0503914120886839,0.0469026527352296,-0.0109825113421087,0.0481713025460292
0.18,0.22168069816349,-0.0630485641652664,0.176115665160678,-0.0527544939530136,0.0455650330028122,-0.0102940702122527,0.046713382601586
0.19,0.230289169663133,-0.0646761921664971,0.186070807656846,-0.0550485081468445,0.0442183620062869,-0.00962768401965261,0.0452543460686519
0.2,0.23890439726444,-0.0662568074344848,0.196041337248067,-0.0572731296277364,0.0428630600163728,-0.00898367780674836,0.0437943875502631
0.21,0.247526380967409,-0.0677904099692294,0.206026827190629,-0.0594280411796539,0.0414995537767796,-0.0083623687895755,0.0423337002333211
0.22,0.256155120772041,-0.069276999770731,0.216026844393835,-0.0615129336286418,0.0401282763782067,-0.00776406614208925,0.0408724759238351
0.23,0.264790616678337,-0.0707165768389896,0.226040949552963,-0.0635275060552938,0.0387496671253735,-0.00718907078369578,0.0394109051032863
0.24,0.273432868686295,-0.0721091411740052,0.236068697289157,-0.0654714660037003,0.0373641713971377,-0.0066376751703049,0.037949177011645
0.25,0.282081876795916,-0.0734546927757777,0.246109636296146,-0.0673445296865529,0.0359722404997697,-0.0061101630892248,0.0364874797642999
0.26,0.2907376410072,-0.0747532316443072,0.256163309493736,-0.0691464221860978,0.0345743315134648,-0.00560680945820935,0.0350260005125283
0.27,0.299400161320148,-0.0760047577795936,0.266229254187956,-0.0708768776506172,0.0331709071321913,-0.0051278801289764,0.0335649256604213
0.28,0.308069437734758,-0.0772092711816371,0.276307002237771,-0.0725356394861339,0.0317624354969869,-0.00467363169550314,0.0321044411557881
0.29,0.316745470251031,-0.0783667718504375,0.286396080228206,-0.0741224605430286,0.0303493900228252,-0.00424431130740889,0.030644732879106
0.3,0.325428258868967,-0.0794772597859948,0.296496009649772,-0.0756371032972669,0.0289322492191952,-0.00384015648872793,0.0291859871640405
0.31,0.334117803588566,-0.0805407349883092,0.306606307084021,-0.0770793400259411,0.0275114965045452,-0.00346139496236808,0.0277283914968955
0.32,0.342814104409828,-0.0815571974573805,0.316726484395068,-0.0784489529768295,0.0260876200147601,-0.003108244480551,0.0262721354629841
0.33,0.351517161332753,-0.0825266471932087,0.326856048926901,-0.0797457345316937,0.0246611124058519,-0.00278091266151505,0.0248174120392324
0.34,0.360226169857218,-0.083447127837073,0.336994503706282,-0.080969487363033,0.0232316661509358,-0.00247764047404,0.0233634118755617
0.35,0.368938515357823,-0.0843122812231299,0.347141347651031,-0.082120024584027,0.0217971677067921,-0.00219225663910287,0.0219071337515822
0.36,0.377653996709537,-0.0851216182616993,0.357296075783474,-0.08319716989141,0.0203579209260634,-0.00192444837028934,0.0204486783426645
0.37,0.38637261391236,-0.0858751389527812,0.367458179448821,-0.0842007577010217,0.0189144344635399,-0.00167438125175949,0.0189884012926784
0.38,0.395094366966293,-0.0865728432963755,0.377627146538229,-0.0851306332758023,0.0174672204280642,-0.00144221002057322,0.0175266585299659
0.39,0.403819255871335,-0.0872147312924823,0.387802461716294,-0.0859866528459988,0.0160167941550406,-0.00122807844648351,0.0160638062636369
0.4,0.412547280627485,-0.0878008029411015,0.397983606652703,-0.0867686837213707,0.0145636739747822,-0.0010321192197308,0.0146002010166808
0.41,0.421278441234746,-0.0883310582422332,0.408170060257771,-0.0874766043951944,0.0131083809769745,-0.000854453847038805,0.0131361997249672
0.42,0.430012737693115,-0.0888054971958773,0.41836129892157,-0.0881103046398726,0.0116514387715449,-0.00069519255600474,0.0116721599602209
0.43,0.438750170002593,-0.0892241198020339,0.428556796756361,-0.0886696855939812,0.0101933732462322,-0.000554434208052679,0.0102084404013571
0.44,0.447490738163181,-0.0895869260607029,0.438756025842019,-0.0891546598405905,0.00873471232116235,-0.000432266220112457,0.00874540184431314
0.45,0.456234442174878,-0.0898939159718844,0.448958456474134,-0.089565151476716,0.0072759857007435,-0.000328764495168415,0.00728340950453201
0.46,0.464981282037684,-0.0901450895355784,0.459163557414483,-0.0899010961737751,0.00581772462320085,-0.000243993361803238,0.00582283887395156
0.47,0.473731257751599,-0.0903404467517848,0.469370796143525,-0.0901624412289316,0.0043604616080738,-0.000178005522853242,0.00436409342265398
0.48,0.482484369316623,-0.0904799876205037,0.479579639114612,-0.0903491456072381,0.00290473020201115,-0.000130842013265575,0.00290767556286996
0.49,0.491240616732757,-0.090563712141735,0.489789552009562,-0.0904611799744949,0.00145106472319551,-0.000102532167240044,0.00145468267200149
0.5,0.5,-0.0905916203154788,0.49999999999526,-0.0904985267207638,4.73970862557849e-12,-9.30935947149186e-05,9.30935947149187e-05
0.51,0.508759383267243,-0.090563712141735,0.510210447980959,-0.0904611799744949,-0.00145106471371614,-0.000102532167240058,0.0014546826625457
0.52,0.517515630683376,-0.0904799876205037,0.520420360875908,-0.0903491456072381,-0.00290473019253157,-0.000130842013265575,0.00290767555339998
0.53,0.526268742248401,-0.0903404467517848,0.530629203846995,-0.0901624412289316,-0.00436046159859438,-0.000178005522853242,0.00436409341318246
0.54,0.535018717962316,-0.0901450895355784,0.540836442576037,-0.0899010961737749,-0.00581772461372121,-0.00024399336180346,0.00582283886448026
0.55,0.543765557825122,-0.0898939159718844,0.551041543516386,-0.089565151476716,-0.00727598569126398,-0.000328764495168429,0.00728340949506215
0.56,0.552509261836819,-0.089586926060703,0.561243974148502,-0.0891546598405905,-0.00873471231168277,-0.000432266220112471,0.00874540183484515
0.57,0.561249829997407,-0.0892241198020339,0.571443203234159,-0.0886696855939812,-0.0101933732367526,-0.000554434208052679,0.0102084403918916
0.58,0.569987262306885,-0.0888054971958773,0.58163870106895,-0.0881103046398725,-0.0116514387620654,-0.000695192556004767,0.0116721599507583
0.59,0.578721558765254,-0.0883310582422332,0.591829939732749,-0.0874766043951944,-0.0131083809674949,-0.000854453847038819,0.0131361997155076
0.6,0.587452719372514,-0.0878008029411015,0.602016393337817,-0.0867686837213707,-0.0145636739653026,-0.00103211921973083,0.0146002010072248
0.61,0.596180744128665,-0.0872147312924823,0.612197538274226,-0.0859866528459986,-0.0160167941455612,-0.0012280784464837,0.0160638062541853
0.62,0.604905633033707,-0.0865728432963755,0.622372853452292,-0.0851306332758023,-0.0174672204185847,-0.00144221002057324,0.0175266585205185
0.63,0.613627386087639,-0.0858751389527812,0.6325418205417,-0.0842007577010217,-0.0189144344540603,-0.0016743812517595,0.0189884012832357
0.64,0.622346003290463,-0.0851216182616993,0.642703924207047,-0.0831971698914098,-0.0203579209165838,-0.00192444837028957,0.0204486783332271
0.65,0.631061484642177,-0.0843122812231299,0.652858652339489,-0.0821200245840268,-0.0217971676973124,-0.00219225663910311,0.0219071337421501
0.66,0.639773830142782,-0.083447127837073,0.663005496284238,-0.0809694873630328,-0.0232316661414563,-0.00247764047404024,0.0233634118661357
0.67,0.648482838667247,-0.0825266471932088,0.673143951063619,-0.0797457345316937,-0.0246611123963724,-0.00278091266151508,0.0248174120298126
0.68,0.657185895590172,-0.0815571974573805,0.683273515595452,-0.0784489529768295,-0.0260876200052805,-0.00310824448055101,0.0262721354535711
0.69,0.665882196411434,-0.0805407349883092,0.6933936929065,-0.0770793400259411,-0.0275114964950657,-0.00346139496236812,0.0277283914874902
0.7,0.674571741131033,-0.0794772597859948,0.703503990340749,-0.0756371032972669,-0.0289322492097156,-0.00384015648872796,0.0291859871546434
0.71,0.683254529748969,-0.0783667718504375,0.713603919762315,-0.0741224605430284,-0.0303493900133457,-0.00424431130740911,0.0306447328697179
0.72,0.691930562265242,-0.0772092711816371,0.72369299775275,-0.0725356394861339,-0.0317624354875072,-0.00467363169550317,0.0321044411464095
0.73,0.700599838679852,-0.0760047577795937,0.733770745802564,-0.0708768776506172,-0.0331709071227115,-0.00512788012897641,0.0335649256510529
0.74,0.709262358992799,-0.0747532316443072,0.743836690496785,-0.0691464221860978,-0.0345743315039853,-0.00560680945820935,0.035026000503171
0.75,0.717918123204084,-0.0734546927757777,0.753890363694374,-0.0673445296865527,-0.0359722404902902,-0.00611016308922503,0.0364874797549544
0.76,0.726567131313705,-0.0721091411740052,0.763931302701363,-0.0654714660037,-0.0373641713876582,-0.00663767517030514,0.0379491770023117
0.77,0.735209383321663,-0.0707165768389896,0.773959050437557,-0.0635275060552936,-0.0387496671158939,-0.00718907078369602,0.0394109050939658
0.78,0.743844879227959,-0.069276999770731,0.783973155596686,-0.0615129336286416,-0.0401282763687271,-0.00776406614208945,0.0408724759145281
0.79,0.752473619032591,-0.0677904099692294,0.793973172799891,-0.0594280411796537,-0.0414995537673,-0.00836236878957571,0.0423337002240283
0.8,0.76109560273556,-0.0662568074344848,0.803958662742454,-0.0572731296277362,-0.0428630600068931,-0.00898367780674855,0.043794387540985
0.81,0.769710830336867,-0.0646761921664971,0.813929192333674,-0.0550485081468443,-0.0442183619968071,-0.00962768401965282,0.0452543460593891
0.82,0.77831930183651,-0.0630485641652664,0.823884334829843,-0.0527544939530136,-0.0455650329933325,-0.0102940702122528,0.0467133825923393
0.83,0.786921017234491,-0.0613739234307927,0.83382366996024,-0.0503914120886837,-0.0469026527257499,-0.0109825113421089,0.0481713025367993
0.84,0.795624590138095,-0.0596111306306622,0.843746784046133,-0.0479595952041289,-0.0481221939080377,-0.0116515354265333,0.049512663272324
0.85,0.804783014771005,-0.0576264829345305,0.853653270112725,-0.0454593833363161,-0.0488702553417193,-0.0121670995982144,0.050362090601937
0.86,0.814423444535043,-0.0554096955092942,0.863542727994069,-0.042891123685494,-0.0491192834590253,-0.0125185718238002,0.0506894332976383
0.87,0.82454587943021,-0.0529607683549533,0.87341476443092,-0.0402551703898318,-0.0488688850007102,-0.0127055979651215,0.0504935653411792
0.88,0.835150319456503,-0.0502797014715077,0.883268993161548,-0.0375518842984079,-0.0481186737050446,-0.0127278171730999,0.0497735279955561
0.89,0.846236764613925,-0.0473664948589576,0.893105035005539,-0.0347816327428538,-0.0468682703916141,-0.0125848621161038,0.0485284815750792
0.9,0.857805214902475,-0.0442211485173027,0.90292251794061,-0.0319447893079491,-0.0451173030381354,-0.0122763592093537,0.0467576734758267
0.91,0.869855670322152,-0.0408436624465433,0.912721077172494,-0.0290417336014627,-0.0428654068503419,-0.0118019288450806,0.0444604164275334
0.92,0.882388130872957,-0.0372340366466792,0.922500355197948,-0.0260728510235234,-0.0401122243249906,-0.0111611856231558,0.0416360733596831
0.93,0.89540259655489,-0.0333922711177105,0.932260001860958,-0.0230385325358019,-0.0368574053060674,-0.0103537385819086,0.0382840466580824
0.94,0.908899067367951,-0.0293183658596372,0.94199967440221,-0.0199391744307788,-0.0331006070342589,-0.00937919142885847,0.0344037704023207
0.95,0.922877543312139,-0.0250123208724593,0.951719037501931,-0.0167751781013639,-0.0288414941897918,-0.0082371427710954,0.0299947046681777
0.96,0.937338024387456,-0.0204741361561767,0.961417763316186,-0.013546949811123,-0.0240797389287304,-0.00692718634505368,0.0250563312864216
0.97,0.9522805105939,-0.0157038117107894,0.971095531506739,-0.01025490046537,-0.0188150209128387,-0.00544891124541941,0.0195881506455055
0.98,0.967705001931472,-0.0107013475362976,0.980752029264598,-0.00689944538335691,-0.0130470273331259,-0.00380190215294068,0.0135896792534581
0.99,0.983611498400172,-0.00546674363270111,0.990386951327366,-0.00348100407180577,-0.00677545292719373,-0.00198573956089535,0.00706044785918874
1,1,6.48723145067605e-29,0.99999999999052,2.09161433216126e-16,9.4796392957619e-12,-2.09161433216061e-16,9.4796392980694e-12
