xi,s1,s2
0,-2.57769556468936e-26,-1.32438910424832e-25
0.01,-0.00274504554416996,-0.0178394128216842
0.02,-0.00477777635746298,-0.0347140399010844
0.03,-0.00609819243987904,-0.0506238812382006
0.04,-0.00670629379141814,-0.0655689368330329
0.05,-0.0066020804120803,-0.0795492066855813
0.06,-0.00578555230186551,-0.0925646907958457
0.07,-0.00425670946077376,-0.104615389163826
0.08,-0.00201555188880505,-0.115701301789523
0.09,0.000937920414040592,-0.125822428672935
0.1,0.0046037074477632,-0.134978769814064
0.11,0.00888176478534345,-0.143372070031363
0.12,0.0136720479997621,-0.151204074143289
0.13,0.018974557091019,-0.158474782149841
0.14,0.0247892920591143,-0.16518419405102
0.15,0.031116252904048,-0.171332309846824
0.16,0.03795543962582,-0.176919129537255
0.17,0.0453068522244303,-0.181944653122312
0.18,0.053170490699879,-0.186408880601995
0.19,0.0615463550521661,-0.190311811976305
0.2,0.0704344452812915,-0.19365344724524
0.21,0.079534660265628,-0.196315482319422
0.22,0.0885468988835484,-0.198179613109471
0.23,0.0974711611350527,-0.199245839615387
0.24,0.106307447020141,-0.19951416183717
0.25,0.115055756538813,-0.198984579774819
0.26,0.123716089691069,-0.197657093428335
0.27,0.132288446476909,-0.195531702797718
0.28,0.140772826896333,-0.192608407882968
0.29,0.14916923094934,-0.188887208684084
0.3,0.157477658635932,-0.184368105201068
0.31,0.165460675972283,-0.179243724500513
0.32,0.172880848974567,-0.173706693649015
0.33,0.179738177642786,-0.167757012646573
0.34,0.18603266197694,-0.161394681493188
0.35,0.191764301977027,-0.15461970018886
0.36,0.196933097643049,-0.147432068733588
0.37,0.201539048975005,-0.139831787127373
0.38,0.205582155972895,-0.131818855370215
0.39,0.209062418636719,-0.123393273462113
0.4,0.211979836966477,-0.114555041403068
0.41,0.214393908020844,-0.105512325267181
0.42,0.216364128858492,-0.0964732911285533
0.43,0.217890499479422,-0.0874379389871844
0.44,0.218973019883633,-0.0784062688430745
0.45,0.219611690071126,-0.0693782806962238
0.46,0.219806510041901,-0.0603539745466321
0.47,0.219557479795957,-0.0513333503942996
0.48,0.218864599333295,-0.042316408239226
0.49,0.217727868653915,-0.0333031480814116
0.5,0.216147287757816,-0.0242935699208563
0.51,0.214359534447271,-0.0152863939854565
0.52,0.212601286524551,-0.00628034050310885
0.53,0.210872543989656,0.00272459052618671
0.54,0.209173306842587,0.0117283991024302
0.55,0.207503575083342,0.0207310852256215
0.56,0.205863348711923,0.0297326488957608
0.57,0.204252627728329,0.0387330901128478
0.58,0.20267141213256,0.0477324088768829
0.59,0.201119701924616,0.0567306051878658
0.6,0.199597497104498,0.0657276790457967
0.61,0.198105057916353,0.0747281145202094
0.62,0.196642644604329,0.0837363956806382
0.63,0.195210257168427,0.092752522527083
0.64,0.193807895608647,0.101776495059544
0.65,0.192435559924988,0.110808313278021
0.66,0.191093250117451,0.119847977182514
0.67,0.189780966186035,0.128895486773022
0.68,0.188498708130741,0.137950842049547
0.69,0.187246475951568,0.147014043012088
0.7,0.186024269648517,0.156085089660645
0.71,0.184828367648856,0.165161777904809
0.72,0.183655048379856,0.174241903654171
0.73,0.182504311841516,0.183325466908731
0.74,0.181376158033835,0.192412467668489
0.75,0.180270586956815,0.201502905933445
0.76,0.179187598610454,0.210596781703599
0.77,0.178127192994754,0.219694094978951
0.78,0.177089370109714,0.228794845759501
0.79,0.176074129955333,0.237899034045249
0.8,0.175081472531613,0.247006659836196
0.81,0.174106560621761,0.256117262667321
0.82,0.173144557008989,0.265230382073607
0.83,0.172195461693294,0.274346018055054
0.84,0.171259274674678,0.283464170611662
0.85,0.17033599595314,0.29258483974343
0.86,0.16942562552868,0.301708025450359
0.87,0.168528163401299,0.310833727732448
0.88,0.167643609570996,0.319961946589698
0.89,0.166771964037771,0.329092682022109
0.9,0.165913226801625,0.33822593402968
0.91,0.165032124726637,0.347820016536496
0.92,0.164093384676888,0.358333243466639
0.93,0.163097006652377,0.369765614820109
0.94,0.162042990653104,0.382117130596907
0.95,0.16093133667907,0.395387790797033
0.96,0.159762044730274,0.409577595420487
0.97,0.158535114806716,0.424686544467268
0.98,0.157250546908397,0.440714637937377
0.99,0.155908341035316,0.457661875830813
1,0.154508497187474,0.475528258147577
