xi,s1,s2
0,0,0
0.01,0.00757916160457597,-0.0065394013418903
0.02,0.0157323720297048,-0.0123439125360711
0.03,0.0244588019012502,-0.0172402289395707
0.04,0.033714107125971,-0.0210377531914701
0.05,0.0433954665131741,-0.0235509035722049
0.06,0.0533376868530356,-0.0246337828176015
0.07,0.0633297718401395,-0.0242168518196239
0.08,0.0731512641174041,-0.0223273956688861
0.09,0.0826131238291947,-0.0190812618218527
0.1,0.0915841281067129,-0.014651103179914
0.11,0.0999952995051751,-0.00922887562749222
0.12,0.107828518969546,-0.00299746019622148
0.13,0.115099797081408,0.00388418153474619
0.14,0.121844322993542,0.0112852381076111
0.15,0.128105798334455,0.0191013584352578
0.16,0.133929844718468,0.0272506053142683
0.17,0.139360382866423,0.0356690283293959
0.18,0.144437902364763,0.0443067102434424
0.19,0.149198830781013,0.0531245366985206
0.2,0.153675494821416,0.062091671299524
0.21,0.157896372392184,0.0711836254057659
0.22,0.161886466362318,0.0803807972070581
0.23,0.165667709681112,0.0896673690854221
0.24,0.169259356618238,0.0990304741269184
0.25,0.17267833983369,0.108459563465474
0.26,0.175939586292451,0.117945923310737
0.27,0.179056291809184,0.127482303792147
0.28,0.182040157186241,0.137062631697314
0.29,0.184901590162027,0.146681786511768
0.3,0.187649877647114,0.15633542452838
0.31,0.190293332503798,0.166019839708808
0.32,0.192839418696614,0.175731852840471
0.33,0.195294858150953,0.185468722631172
0.34,0.19766572217605,0.195228073930016
0.35,0.19995750986995,0.205007839409206
0.36,0.202175215539161,0.214806211895627
0.37,0.204323386835867,0.224621605181929
0.38,0.206406175036801,0.234452621630703
0.39,0.20842737865442,0.244298025252928
0.4,0.210390481376405,0.254156719223024
0.41,0.212298685167899,0.264027727009153
0.42,0.214154939236671,0.273910176464877
0.43,0.215961965450081,0.283803286358722
0.44,0.217722280700279,0.293706354920359
0.45,0.219438216637142,0.303618750062589
0.46,0.221111937124458,0.313539901002073
0.47,0.22274545372139,0.323469291052477
0.48,0.224340639446523,0.333406451404315
0.49,0.225899241044322,0.343350955738418
0.5,0.227422889942288,0.353302415546345
0.51,0.228913112060514,0.363260476052422
0.52,0.230371336612913,0.373224812649589
0.53,0.231798904020348,0.383195127775463
0.54,0.233197073039723,0.393171148166792
0.55,0.234567027199363,0.403152622440156
0.56,0.235909880619208,0.413139318954753
0.57,0.237226683284335,0.423131023919823
0.58,0.238518425831655,0.433127539714777
0.59,0.239786043902209,0.443128683394776
0.6,0.241030422105101,0.453134285358392
0.61,0.242252397633552,0.463144188157301
0.62,0.243452763568766,0.473158245430692
0.63,0.244632271903145,0.483176320949488
0.64,0.245791636310758,0.49319828775742
0.65,0.24693153468982,0.503224027397756
0.66,0.248052611499157,0.513253429215888
0.67,0.249155479908247,0.523286389729285
0.68,0.250240723778272,0.533322812057348
0.69,0.251308899489786,0.543362605404645
0.7,0.252360537630933,0.553405684591817
0.71,0.253396144558719,0.563451969629095
0.72,0.254416203844562,0.573501385328002
0.73,0.255421177614198,0.583553860947324
0.74,0.256411507791029,0.593609329869871
0.75,0.257387617251103,0.603667729306962
0.76,0.258349910897108,0.613729000027908
0.77,0.259298776658089,0.623793086112055
0.78,0.260234586420908,0.633859934721242
0.79,0.26115769689897,0.643929495890728
0.8,0.262068450443179,0.65400172233688
0.81,0.262967175799644,0.664076569280067
0.82,0.263854188818289,0.674153994281388
0.83,0.264729793116087,0.684233957091979
0.84,0.26559428069837,0.694316419513803
0.85,0.266447932541331,0.704401345270897
0.86,0.267291019138585,0.714488699890188
0.87,0.268123801014408,0.72457845059105
0.88,0.268946529206055,0.734670566182872
0.89,0.269759445717348,0.744765016969961
0.9,0.270562783945574,0.75486177466318
0.91,0.271356769083533,0.764960812297773
0.92,0.272141618498459,0.775062104156871
0.93,0.272917542089378,0.785165625700237
0.94,0.273684742624357,0.795271353497826
0.95,0.274443416058989,0.805379265167795
0.96,0.275193751837338,0.815489339318613
0.97,0.275935933176498,0.825601555494961
0.98,0.276670137335817,0.835715894127133
0.99,0.277396535871762,0.845832336483687
1,0.278115294879339,0.855950864627086
