xi,s1,s2
0,0,0
0.01,-0.00230459627122572,-0.00978722966912516
0.02,-0.00467347271141652,-0.0195575566890347
0.03,-0.00711022381346437,-0.0293096331297884
0.04,-0.00961874308260248,-0.0390419513774403
0.05,-0.012203255634103,-0.0487528202266645
0.06,-0.0148683550871954,-0.0584403366408753
0.07,-0.0176190453912719,-0.0681023522590709
0.08,-0.0204607883152178,-0.0777364335050264
0.09,-0.0233995574353167,-0.0873398138702407
0.1,-0.0264418995694156,-0.0969093365794315
0.11,-0.0295950047199309,-0.106441385383014
0.12,-0.0328667856963356,-0.11593180062444
0.13,-0.0362659686719583,-0.125375776961856
0.14,-0.0398021959610237,-0.134767738132038
0.15,-0.0434861422308614,-0.144101182864537
0.16,-0.0473296451104438,-0.153368494403726
0.17,-0.0513458505886443,-0.162560703977491
0.18,-0.0555493725024741,-0.171667195852433
0.19,-0.0599564634598363,-0.180675338227436
0.2,-0.0645851911905865,-0.189570020069215
0.21,-0.0694556087447151,-0.198333069132706
0.22,-0.0745898978915017,-0.206942521167491
0.23,-0.0800124506458791,-0.215371705627441
0.24,-0.0857498314290489,-0.223588111222082
0.25,-0.0918305286099187,-0.231551999792641
0.26,-0.098284355643285,-0.239214757674118
0.27,-0.105141297394045,-0.246517024729589
0.28,-0.112429522787204,-0.253386746135711
0.29,-0.120172225901816,-0.259737482027563
0.3,-0.128382976923973,-0.265467611717226
0.31,-0.13705948122414,-0.270461464205133
0.32,-0.146176221253408,-0.274593750938388
0.33,-0.155677480426622,-0.277738605412805
0.34,-0.165473459413006,-0.279783504575422
0.35,-0.175442709267906,-0.280646083358939
0.36,-0.18544272355248,-0.280289164962277
0.37,-0.195327057616683,-0.278728316197109
0.38,-0.204963760427007,-0.276028624992651
0.39,-0.214249117134581,-0.272292142243238
0.4,-0.22311341450824,-0.267641117964439
0.41,-0.231519318086683,-0.262202472023394
0.42,-0.239455794022314,-0.256096653926443
0.43,-0.246930656091185,-0.249431421186429
0.44,-0.25396375350823,-0.242299513408094
0.45,-0.260581649051271,-0.234778795886533
0.46,-0.266813872820046,-0.226933676499859
0.47,-0.272690490340228,-0.218817001983896
0.48,-0.278240640213774,-0.210471987243602
0.49,-0.283491733525149,-0.201933965815559
0.5,-0.288469079976187,-0.193231885882911
0.51,-0.293195775944724,-0.184389546278925
0.52,-0.297692744985879,-0.175426597956869
0.53,-0.301978860827365,-0.166359346681123
0.54,-0.306071109609578,-0.157201392960268
0.55,-0.309984765507463,-0.147964141323561
0.56,-0.313733564898195,-0.138657205866866
0.57,-0.317329871080799,-0.129288733909537
0.58,-0.320784825707494,-0.119865665142143
0.59,-0.324108485543532,-0.110393939945061
0.6,-0.327309944573921,-0.100878667584687
0.61,-0.330397442230082,-0.091324262647781
0.62,-0.333378458874126,-0.0817345562421291
0.63,-0.336259799813293,-0.0721128870686107
0.64,-0.339047669121024,-0.0624621763670915
0.65,-0.341747734474549,-0.0527849898843512
0.66,-0.344365184118115,-0.0430835893496261
0.67,-0.346904776947415,-0.0333599754281909
0.68,-0.349370886596629,-0.0236159237216676
0.69,-0.351767540301318,-0.0138530150693789
0.7,-0.354098453211384,-0.00407266115811019
0.71,-0.356367058739655,0.00572387374711314
0.72,-0.358576535453456,0.015535454292886
0.73,-0.360729830948095,0.0253610582122408
0.74,-0.3628296830819,0.0351997627467237
0.75,-0.364878638901103,0.0450507329566073
0.76,-0.366879071538676,0.0549132116234092
0.77,-0.36883319533315,0.0647865105000614
0.78,-0.370743079380786,0.0746700027056303
0.79,-0.372610659706316,0.0845631160953588
0.8,-0.374437750213321,0.0944653274645215
0.81,-0.376226052554533,0.104376157467345
0.82,-0.377977165044422,0.11429516615102
0.83,-0.379692590721006,0.124221949020341
0.84,-0.381373744650507,0.134156133561431
0.85,-0.383021960556942,0.1440973761637
0.86,-0.384638496848784,0.154045359388194
0.87,-0.386224542106155,0.163999789538005
0.88,-0.387781220084546,0.173960394492717
0.89,-0.389309594284471,0.183926921774223
0.9,-0.390810672130807,0.193899136815748
0.91,-0.392285408800586,0.203876821409742
0.92,-0.39373471073365,0.213859772313557
0.93,-0.395159438856774,0.223847799994616
0.94,-0.39656041154853,0.233840727499134
0.95,-0.39793840736921,0.243838389430503
0.96,-0.399294167577545,0.253840631025189
0.97,-0.400628398453675,0.263847307315511
0.98,-0.401941773445818,0.273858282369954
0.99,-0.403234935156277,0.283873428602801
1,-0.404508497180877,0.293892626145858
