xi,s1,s2
0,0,0
0.01,0.00422234216548703,-0.00915736956515348
0.02,0.00851549778676308,-0.0182802099081011
0.03,0.0128816251332509,-0.027366807157918
0.04,0.0173229660036082,-0.0364153339211715
0.05,0.0218418486308262,-0.0454238404342692
0.06,0.0264406905261209,-0.0543902449601676
0.07,0.0311220012195418,-0.0633123233653718
0.08,0.0358883848461028,-0.0721876978090804
0.09,0.0407425425154585,-0.0810138244724311
0.1,0.0456872743904732,-0.0897879802523372
0.11,0.0507254813851587,-0.0985072483415562
0.12,0.0558601663750617,-0.107168502614765
0.13,0.061094434792916,-0.115768390739928
0.14,0.0664314944588723,-0.124303315935658
0.15,0.0718746544674659,-0.132769417299294
0.16,0.0774273229223138,-0.141162548637841
0.17,0.0830930032739699,-0.149478255745853
0.18,0.0888752889761146,-0.157711752092042
0.19,0.094777856130111,-0.165857892901471
0.2,0.100804453737921,-0.173911147654534
0.21,0.106958891128713,-0.181865571069837
0.22,0.113245022065848,-0.189714772698206
0.23,0.119666724979604,-0.197451885332444
0.24,0.126227878708913,-0.205069532535485
0.25,0.132932333075714,-0.21255979571208
0.26,0.139783873562534,-0.219914181299653
0.27,0.146786179323802,-0.227123588836344
0.28,0.1539427737422,-0.234178280881238
0.29,0.161256966753727,-0.241067856015165
0.3,0.168731788222231,-0.247781226439679
0.31,0.176369911761996,-0.254306602012828
0.32,0.184173568604167,-0.260631482904267
0.33,0.192144451399541,-0.266742663403435
0.34,0.200283608267385,-0.272626249748514
0.35,0.208591327955614,-0.278267695125793
0.36,0.217067017684479,-0.283651855172122
0.37,0.225709076105018,-0.288763067338599
0.38,0.234514764798919,-0.29358525727266
0.39,0.243480082837584,-0.298102074874325
0.4,0.252599650033831,-0.302297061810088
0.41,0.261866605553584,-0.306153850970983
0.42,0.271272529366327,-0.309656396619788
0.43,0.280807394435241,-0.312789231818969
0.44,0.290459557405182,-0.315537747269459
0.45,0.300215794682993,-0.317888483105596
0.46,0.310061389119481,-0.319829422747816
0.47,0.319980269989027,-0.321350275934412
0.48,0.329955205738948,-0.322442736875896
0.49,0.339968045301227,-0.323100703396641
0.5,0.35,-0.323320444136001
0.51,0.360031954698773,-0.323100703396641
0.52,0.370044794261052,-0.322442736875896
0.53,0.380019730010973,-0.321350275934412
0.54,0.389938610880519,-0.319829422747816
0.55,0.399784205317007,-0.317888483105596
0.56,0.409540442594818,-0.315537747269459
0.57,0.419192605564759,-0.312789231818969
0.58,0.428727470633673,-0.309656396619788
0.59,0.438133394446416,-0.306153850970983
0.6,0.447400349966169,-0.302297061810088
0.61,0.456519917162416,-0.298102074874325
0.62,0.465485235201081,-0.29358525727266
0.63,0.474290923894982,-0.288763067338599
0.64,0.482932982315521,-0.283651855172122
0.65,0.491408672044386,-0.278267695125793
0.66,0.499716391732615,-0.272626249748514
0.67,0.507855548600459,-0.266742663403435
0.68,0.515826431395833,-0.260631482904267
0.69,0.523630088238004,-0.254306602012828
0.7,0.531268211777769,-0.247781226439679
0.71,0.538743033246273,-0.241067856015165
0.72,0.5460572262578,-0.234178280881238
0.73,0.553213820676198,-0.227123588836344
0.74,0.560216126437466,-0.219914181299653
0.75,0.567067666924286,-0.21255979571208
0.76,0.573772121291087,-0.205069532535485
0.77,0.580333275020396,-0.197451885332444
0.78,0.586754977934152,-0.189714772698206
0.79,0.593041108871287,-0.181865571069837
0.8,0.599195546262079,-0.173911147654534
0.81,0.605222143869889,-0.165857892901471
0.82,0.611124711023885,-0.157711752092042
0.83,0.61690699672603,-0.149478255745853
0.84,0.622572677077686,-0.141162548637841
0.85,0.628125345532534,-0.132769417299294
0.86,0.633568505541128,-0.124303315935658
0.87,0.638905565207084,-0.115768390739928
0.88,0.644139833624938,-0.107168502614765
0.89,0.649274518614841,-0.0985072483415562
0.9,0.654312725609527,-0.0897879802523372
0.91,0.659257457484542,-0.0810138244724311
0.92,0.664111615153897,-0.0721876978090804
0.93,0.668877998780458,-0.0633123233653717
0.94,0.673559309473879,-0.0543902449601675
0.95,0.678158151369174,-0.0454238404342693
0.96,0.682677033996392,-0.0364153339211714
0.97,0.687118374866749,-0.0273668071579181
0.98,0.691484502213237,-0.0182802099081011
0.99,0.695777657834513,-0.00915736956515368
1,0.7,0
