xi,sx,sy,cx,cy,ex,ey,ne
0,0,0,0,0,0,0,0
0.01,-0.0062746878,-0.0172582511,0.0002832982,-0.0101086924,-0.0065579861,-0.0071495587,0.00970172
0.02,-0.0126494926,-0.0337924735,0.0005704779,-0.0202157351,-0.0132199705,-0.0135767384,0.0189498138
0.03,-0.019113957,-0.0496274888,0.0008616479,-0.0303211235,-0.0199756049,-0.0193063654,0.0277805784
0.04,-0.0256576238,-0.0647881187,0.0011569221,-0.0404248526,-0.0268145459,-0.0243632662,0.0362296648
0.05,-0.0322700358,-0.0792991849,0.0014564189,-0.0505269172,-0.0337264547,-0.0287722677,0.0443318975
0.06,-0.0389407355,-0.0931855089,0.0017602623,-0.0606273118,-0.0407009978,-0.0325581971,0.0521210842
0.07,-0.0456592659,-0.1064719125,0.0020685815,-0.0707260306,-0.0477278474,-0.0357458819,0.0596298205
0.08,-0.0524151695,-0.1191832174,0.0023815119,-0.0808230674,-0.0547966813,-0.0383601501,0.0668892921
0.09,-0.0591979891,-0.1313442453,0.0026991947,-0.0909184156,-0.0618971838,-0.0404258297,0.0739290813
0.1,-0.0659972674,-0.1429798177,0.003021778,-0.1010120682,-0.0690190454,-0.0419677495,0.0807769808
0.11,-0.0728025472,-0.1541147564,0.0033494169,-0.1111040178,-0.0761519641,-0.0430107386,0.0874588204
0.12,-0.0796033712,-0.164773883,0.0036822739,-0.1211942564,-0.0832856451,-0.0435796266,0.0939983113
0.13,-0.0863892821,-0.1749820192,0.0040205194,-0.1312827756,-0.0904098015,-0.0436992436,0.1004169114
0.14,-0.0931498226,-0.1847639867,0.0043643324,-0.1413695665,-0.097514155,-0.0433944202,0.106733716
0.15,-0.0998745355,-0.1941446071,0.004713901,-0.1514546193,-0.1045884365,-0.0426899878,0.1129653757
0.16,-0.1065529635,-0.2031487021,0.0050694228,-0.1615379238,-0.1116223862,-0.0416107783,0.1191260424
0.17,-0.1131746492,-0.2118010934,0.0054311059,-0.171619469,-0.1186057551,-0.0401816244,0.1252273456
0.18,-0.1197291355,-0.2201266026,0.0057991695,-0.1816992431,-0.125528305,-0.0384273595,0.1312783963
0.19,-0.1262059651,-0.2281500514,0.0061738447,-0.1917772333,-0.1323798098,-0.0363728181,0.1372858184
0.2,-0.1325946806,-0.2358962615,0.0065553752,-0.2018534262,-0.1391500558,-0.0340428353,0.1432538051
0.21,-0.1388848249,-0.2433900546,0.0069440187,-0.211927807,-0.1458288435,-0.0314622476,0.149184197
0.22,-0.1450659405,-0.2506562522,0.0073400474,-0.22200036,-0.1524059879,-0.0286558922,0.1550765789
0.23,-0.1511275703,-0.2577196762,0.0077437498,-0.2320710681,-0.1588713201,-0.025648608,0.1609283923
0.24,-0.157059257,-0.2646051481,0.0081554312,-0.2421399131,-0.1652146882,-0.022465235,0.1667350592
0.25,-0.1628505433,-0.2713374896,0.0085754157,-0.2522068748,-0.171425959,-0.0191306148,0.1724901152
0.26,-0.168490972,-0.2779415224,0.0090040476,-0.2622719319,-0.1774950196,-0.0156695905,0.1781853474
0.27,-0.1739700856,-0.2844420682,0.0094416929,-0.2723350608,-0.1834117785,-0.0121070073,0.1838109358
0.28,-0.1792774271,-0.2908639486,0.0098887414,-0.2823962362,-0.1891661685,-0.0084677123,0.1893555953
0.29,-0.184402539,-0.2972319852,0.0103456087,-0.2924554303,-0.1947481478,-0.004776555,0.1948067159
0.3,-0.1893349642,-0.3035709999,0.0108127386,-0.3025126127,-0.2001477028,-0.0010583872,0.2001505012
0.31,-0.1940642454,-0.3099058141,0.0112906055,-0.3125677505,-0.2053548509,0.0026619363,0.205372103
0.32,-0.1985799252,-0.3162612497,0.0117797176,-0.3226208072,-0.2103596427,0.0063595575,0.2104557513
0.33,-0.2028715464,-0.3226621282,0.0122806198,-0.3326717431,-0.2151521662,0.0100096149,0.2153848811
0.34,-0.2069290023,-0.3291316807,0.0127938979,-0.3427205144,-0.2197229002,0.0135888337,0.2201427021
0.35,-0.2107462621,-0.3356746461,0.0133201821,-0.3527670726,-0.2240664441,0.0170924265,0.2247174279
0.36,-0.2143199242,-0.3422838331,0.0138601519,-0.3628113642,-0.2281800761,0.0205275311,0.2291015641
0.37,-0.2176466312,-0.3489518517,0.0144145416,-0.3728533299,-0.2320611729,0.0239014782,0.2332888094
0.38,-0.2207230255,-0.3556713116,0.0149841461,-0.3828929037,-0.2357071717,0.0272215921,0.2372738626
0.39,-0.2235457495,-0.3624348228,0.0155698278,-0.3929300121,-0.2391155773,0.0304951893,0.2410523094
0.4,-0.2261114456,-0.3692349952,0.0161725241,-0.4029645728,-0.2422839697,0.0337295776,0.2446205355
0.41,-0.2284167563,-0.3760644385,0.0167932571,-0.4129964935,-0.2452100135,0.036932055,0.2479756589
0.42,-0.230458324,-0.3829157628,0.0174331436,-0.4230256703,-0.2478914676,0.0401099075,0.2511154802
0.43,-0.2322327912,-0.3897815778,0.0180934069,-0.4330519856,-0.2503261981,0.0432704079,0.2540384492
0.44,-0.2337368002,-0.3966544934,0.0187753916,-0.4430753064,-0.2525121917,0.046420813,0.2567436442
0.45,-0.2349669934,-0.4035271195,0.019480579,-0.4530954809,-0.2544475725,0.0495683614,0.2592307651
0.46,-0.2359200134,-0.410392066,0.0202106075,-0.4631123355,-0.2561306209,0.0527202696,0.2615001373
0.47,-0.2365925026,-0.4172419427,0.0209672944,-0.4731256709,-0.257559797,0.0558837282,0.2635527273
0.48,-0.2369811033,-0.4240693596,0.0217526635,-0.4831352566,-0.2587337669,0.059065897,0.26539017
0.49,-0.2370824581,-0.4308669264,0.0225689777,-0.4931408252,-0.2596514357,0.0622738987,0.2670148058
0.5,-0.2368932093,-0.4376272532,0.0234187771,-0.5031420642,-0.2603119864,0.0655148111,0.2684297315
0.51,-0.2364099993,-0.4443429496,0.0243049273,-0.5131386067,-0.2607149267,0.0687956571,0.2696388611
0.52,-0.2356294707,-0.4510066257,0.0252306763,-0.5231300182,-0.260860147,0.0721233925,0.2706470026
0.53,-0.2345482658,-0.4576108912,0.0261997256,-0.5331157811,-0.2607479914,0.0755048899,0.2714599481
0.54,-0.233163027,-0.4641483561,0.0272163187,-0.5430952735,-0.2603793457,0.0789469174,0.2720845814
0.55,-0.2314703969,-0.4706116303,0.0282853509,-0.5530677418,-0.2597557478,0.0824561116,0.2725290055
0.56,-0.2294670178,-0.4769933235,0.0294125102,-0.5630322638,-0.2588795279,0.0860389404,0.2728026928
0.57,-0.2271495321,-0.4832860457,0.0306044556,-0.5729876991,-0.2577539877,0.0897016534,0.2729166627
0.58,-0.2245145823,-0.4894824067,0.0318690508,-0.5829326209,-0.2563836331,0.0934502141,0.2728836929
0.59,-0.2215588108,-0.4955750165,0.0332156698,-0.5928652201,-0.2547744806,0.0972902035,0.2727185723
0.6,-0.2182788601,-0.5015564849,0.0346556055,-0.6027831695,-0.2529344656,0.1012266846,0.2724384069
0.61,-0.2146713726,-0.5074194217,0.0362026257,-0.6126834249,-0.2508739982,0.1052640032,0.2720629952
0.62,-0.2107329906,-0.5131564369,0.0378737403,-0.6225619283,-0.2486067309,0.1094054914,0.2716152945
0.63,-0.2064603567,-0.5187601403,0.0396902874,-0.6324131522,-0.2461506441,0.1136530119,0.2711220144
0.64,-0.2018501133,-0.5242231417,0.041679502,-0.6422293755,-0.2435296153,0.1180062338,0.2706143838
0.65,-0.1968989028,-0.5295380512,0.0438768436,-0.6519994942,-0.2407757464,0.1224614431,0.2701291637
0.66,-0.1916033675,-0.5346974784,0.0463295478,-0.6617069767,-0.2379329153,0.1270094983,0.2697100014
0.67,-0.1859602129,-0.5396939441,0.0491022108,-0.6713261761,-0.2350624237,0.131632232,0.2694093309
0.68,-0.1799699109,-0.5445146099,0.0522858371,-0.6808152795,-0.232255748,0.1363006696,0.2692965002
0.69,-0.1736387726,-0.5491383318,0.0560128258,-0.6901018972,-0.2296515984,0.1409635654,0.2694635104
0.7,-0.1669736112,-0.5535432509,0.0604816201,-0.6990513421,-0.2274552313,0.1455080913,0.270015716
0.71,-0.1599812398,-0.5577075085,0.0659924246,-0.7073917793,-0.2259736644,0.1496842708,0.2710525372
0.72,-0.1526684717,-0.5616092459,0.0729634183,-0.7145350472,-0.2256318899,0.1529258013,0.2725730186
0.73,-0.14504212,-0.5652266044,0.0817197612,-0.7192494793,-0.2267618812,0.1540228749,0.2741240536
0.74,-0.137108998,-0.5685377252,0.0916105712,-0.7198176935,-0.2287195693,0.1512799683,0.27422303
0.75,-0.128875919,-0.5715207497,0.100760822,-0.7159521304,-0.229636741,0.1444313807,0.2712811393
0.76,-0.120349696,-0.574153819,0.1081467365,-0.7092482834,-0.2284964325,0.1350944644,0.2654451619
0.77,-0.1115371422,-0.5764150745,0.1139664125,-0.7011234824,-0.2255035547,0.1247084079,0.2576898139
0.78,-0.102445071,-0.5782826574,0.1186532547,-0.6922875906,-0.2210983257,0.1140049331,0.2487601142
0.79,-0.0930802955,-0.5797347091,0.1225369946,-0.6830661714,-0.2156172902,0.1033314623,0.2390987388
0.8,-0.0834496289,-0.5807493707,0.1258369576,-0.673617433,-0.2092865866,0.0928680623,0.2289658322
0.81,-0.0735598844,-0.5813047835,0.1286986954,-0.6640248091,-0.2022585798,0.0827200256,0.2185203325
0.82,-0.0634178753,-0.5813790889,0.1312214847,-0.6543357182,-0.1946393599,0.0729566293,0.2078632969
0.83,-0.0530304146,-0.5809504281,0.1334752616,-0.6445788587,-0.1865056762,0.0636284305,0.1970607633
0.84,-0.0424043157,-0.5799969424,0.1355108181,-0.6347725253,-0.1779151338,0.054775583,0.1861562766
0.85,-0.0315463917,-0.578496773,0.1373660563,-0.6249288941,-0.1689124479,0.0464321211,0.1751780721
0.86,-0.0204634558,-0.5764280612,0.139069936,-0.6150563654,-0.1595333918,0.0386283042,0.1641433793
0.87,-0.0091623213,-0.5737689483,0.1406450444,-0.6051609139,-0.1498073657,0.0313919656,0.1530611065
0.88,0.0023501987,-0.5704975755,0.1421093166,-0.5952469009,-0.1397591179,0.0247493254,0.1419335765
0.89,0.0140672909,-0.5665920842,0.1434772183,-0.5853175822,-0.1294099274,0.018725498,0.1307576903
0.9,0.0259821422,-0.5620306156,0.1447605792,-0.5753754359,-0.118778437,0.0133448203,0.119525735
0.91,0.0380879393,-0.556791311,0.1459691917,-0.5654223811,-0.1078812524,0.0086310701,0.1082259673
0.92,0.050377869,-0.5508523116,0.1471112508,-0.5554599263,-0.0967333818,0.0046076148,0.0968430548
0.93,0.0628451182,-0.5441917587,0.1481936812,-0.5454892737,-0.085348563,0.001297515,0.0853584252
0.94,0.0754828736,-0.5367877937,0.1492223855,-0.5355113926,-0.0737395119,-0.001276401,0.0737505581
0.95,0.088284322,-0.5286185576,0.1502024355,-0.5255270734,-0.0619181135,-0.0030914842,0.0619952422
0.96,0.1012426502,-0.519662192,0.1511382199,-0.5155369668,-0.0498955696,-0.0041252252,0.0500658102
0.97,0.1143510451,-0.5098968379,0.1520335615,-0.5055416133,-0.0376825164,-0.0043552246,0.037933363
0.98,0.1276026933,-0.4993006368,0.1528918102,-0.4955414656,-0.0252891169,-0.0037591711,0.0255669866
0.99,0.1409907818,-0.4878517297,0.1537159175,-0.4855369057,-0.0127251358,-0.002314824,0.0129339666
1,0.1545084972,-0.4755282581,0.1545084972,-0.4755282581,0,-0,0
