xi,sx,sy,cx,cy,ex,ey,ne
0,-0,0,0,0,-0,0,0
0.01,0.0131588501,-0.0112315609,0.001275299,-0.0099514048,0.0118835511,-0.0012801561,0.0119523047
0.02,0.026097169,-0.0217726144,0.0026126844,-0.019893112,0.0234844846,-0.0018795023,0.0235595744
0.03,0.0388149566,-0.0316231604,0.0040184702,-0.0298238331,0.0347964864,-0.0017993272,0.0348429769
0.04,0.0513122129,-0.0407831989,0.0054999738,-0.0397419947,0.0458122391,-0.0010412042,0.0458240696
0.05,0.063588938,-0.0492527299,0.0070657376,-0.0496456556,0.0565232004,0.0003929257,0.0565245661
0.06,0.0756451319,-0.0570317535,0.0087258141,-0.0595323943,0.0669193178,0.0025006408,0.0669660235
0.07,0.0874807945,-0.0641202696,0.0104921377,-0.0693991511,0.0769886568,0.0052788815,0.0771694231
0.08,0.0990959259,-0.0705182782,0.012379016,-0.0792420058,0.0867169098,0.0087237276,0.087154609
0.09,0.110490526,-0.0762257794,0.0144037876,-0.0890558558,0.0960867383,0.0128300765,0.0969395283
0.1,0.1216645948,-0.0812427731,0.016587718,-0.098833941,0.1050768769,0.017591168,0.1065391911
0.11,0.1326181325,-0.0855692593,0.0189572388,-0.1085671226,0.1136608936,0.0229978634,0.1159642206
0.12,0.1433511388,-0.089205238,0.0215456935,-0.1182427591,0.1218054453,0.0290375211,0.1252187851
0.13,0.1538636139,-0.0921507093,0.0243958381,-0.1278428959,0.1294677758,0.0356921866,0.1342975695
0.14,0.1641555578,-0.0944056731,0.0275634824,-0.1373412441,0.1365920754,0.042935571,0.143181208
0.15,0.1742269704,-0.0959701295,0.031122849,-0.1466979341,0.1431041214,0.0507278046,0.1518291794
0.16,0.1840778518,-0.0968440783,0.0351744358,-0.1558500088,0.148903416,0.0590059304,0.1601684336
0.17,0.1937082019,-0.0970275197,0.0398560779,-0.1646934423,0.1538521241,0.0676659226,0.1680748439
0.18,0.2031180208,-0.0965204537,0.0453560701,-0.1730479717,0.1577619507,0.076527518,0.1753433606
0.19,0.2123073084,-0.0953228801,0.0519178109,-0.1805885357,0.1603894975,0.0852656556,0.1816453218
0.2,0.2212760648,-0.0934347991,0.0597902701,-0.1867280017,0.1614857948,0.0932932025,0.186497409
0.21,0.2299823688,-0.0910456657,0.0690026015,-0.1905230053,0.1609797673,0.0994773395,0.1892359019
0.22,0.2383842991,-0.088344935,0.0789405038,-0.1909797655,0.1594437954,0.1026348305,0.1896212866
0.23,0.2464818559,-0.0853326069,0.0884257001,-0.1879473551,0.1580561558,0.1026147483,0.1884450449
0.24,0.2542750391,-0.0820086815,0.096650245,-0.1822960645,0.1576247942,0.1002873831,0.1868238072
0.25,0.2617638488,-0.0783731587,0.1035210245,-0.1750393095,0.1582428243,0.0966661508,0.1854322953
0.26,0.2689482848,-0.0744260386,0.1092633926,-0.1668510706,0.1596848922,0.092425032,0.1845037976
0.27,0.2758283472,-0.0701673212,0.1141309617,-0.1581095128,0.1616973855,0.0879421916,0.1840648623
0.28,0.2824040361,-0.0655970064,0.1183263392,-0.1490230954,0.1640776969,0.083426089,0.1840690168
0.29,0.2886753514,-0.0607150943,0.1219988383,-0.1397107476,0.1666765131,0.0789956533,0.1844488364
0.3,0.2946422931,-0.0555215848,0.1252571797,-0.1302435895,0.1693851134,0.0747220047,0.185134261
0.31,0.3003048612,-0.0500164781,0.1281813393,-0.1206661682,0.1721235218,0.0706496901,0.1860588226
0.32,0.3056630557,-0.0441997739,0.1308311717,-0.1110075743,0.174831884,0.0668078004,0.1871616143
0.33,0.3107168766,-0.0380714725,0.1332523185,-0.1012875105,0.1774645582,0.063216038,0.1883877301
0.34,0.315466324,-0.0316315737,0.135480219,-0.0915197486,0.179986105,0.0598881749,0.1896881427
0.35,0.3199113978,-0.0248800776,0.1375428552,-0.081714182,0.1823685426,0.0568341045,0.1910193727
0.36,0.3240520979,-0.0178169841,0.139462659,-0.0718780892,0.1845894389,0.0540611051,0.1923430894
0.37,0.3278884245,-0.0104422933,0.1412578615,-0.0620169373,0.186630563,0.051574644,0.193625698
0.38,0.3314203775,-0.0027560052,0.142943463,-0.0521349087,0.1884769145,0.0493789035,0.1948379414
0.39,0.334647957,0.0052418803,0.1445319431,-0.0422352555,0.1901160138,0.0474771358,0.1959545283
0.4,0.3375711628,0.0135513631,0.1460337889,-0.032320543,0.1915373739,0.0458719061,0.196953795
0.41,0.3401906985,0.0220015509,0.1474578929,-0.022392821,0.1927328056,0.0443943718,0.1977796617
0.42,0.3425072673,0.0304215511,0.1488118576,-0.0124537466,0.1936954098,0.0428752976,0.1983839785
0.43,0.3445208694,0.0388113637,0.1501022315,-0.0025046736,0.194418638,0.0413160373,0.1987602116
0.44,0.3462315048,0.0471709889,0.1513346936,0.0074532815,0.1948968111,0.0397177074,0.1989026477
0.45,0.3476391733,0.0555004265,0.1525142,0.0174191896,0.1951249733,0.0380812369,0.1988062771
0.46,0.348743875,0.0637996766,0.1536451005,0.0273922717,0.1950987746,0.0364074048,0.1984666999
0.47,0.34954561,0.0720687391,0.1547312331,0.0373718698,0.1948143769,0.0346968693,0.19788005
0.48,0.3500443782,0.0803076142,0.1557760011,0.0473574241,0.1942683771,0.0329501901,0.1970429328
0.49,0.3502401796,0.0885163017,0.1567824357,0.0573484556,0.193457744,0.0311678461,0.1959523752
0.5,0.3501330143,0.0966948017,0.1577532481,0.067344552,0.1923797662,0.0293502497,0.1946057851
0.51,0.3497228821,0.1048431141,0.158690873,0.0773453565,0.1910320091,0.0274977577,0.1930009202
0.52,0.3490097832,0.1129612391,0.1595975049,0.0873505588,0.1894122783,0.0256106803,0.191135863
0.53,0.3479937175,0.1210491765,0.1604751281,0.0973598879,0.1875185894,0.0236892886,0.1890090045
0.54,0.346674685,0.1291069264,0.161325543,0.1073731057,0.185349142,0.0217338207,0.1866190328
0.55,0.3450526858,0.1371344887,0.1621503882,0.1173900026,0.1829022975,0.0197444862,0.1839649292
0.56,0.3431277197,0.1451318635,0.1629511588,0.1274103931,0.1801765609,0.0177214705,0.181045971
0.57,0.3408997869,0.1530990508,0.163729223,0.1374341126,0.1771705639,0.0156649383,0.1778617413
0.58,0.3383688873,0.1610360506,0.1644858357,0.1474610143,0.1738830515,0.0135750363,0.1744121476
0.59,0.3355350209,0.1689428629,0.1652221512,0.1574909673,0.1703128697,0.0114518956,0.1706974501
0.6,0.3323981877,0.1768194876,0.1659392331,0.1675238539,0.1664589547,0.0092956337,0.1667183025
0.61,0.3291065931,0.1846751592,0.1666380636,0.1775595686,0.1624685295,0.0071155907,0.1626242747
0.62,0.3258084424,0.1925191121,0.1673195519,0.187598016,0.1584888905,0.0049210961,0.1585652724
0.63,0.3225037356,0.2003513462,0.167984541,0.19763911,0.1545191946,0.0027122362,0.1545429964
0.64,0.3191924728,0.2081718616,0.168633814,0.2076827728,0.1505586587,0.0004890889,0.1505594531
0.65,0.3158746538,0.2159806583,0.1692680997,0.2177289333,0.1466065541,-0.001748275,0.1466169777
0.66,0.3125502787,0.2237777363,0.1698880773,0.2277775272,0.1426622014,-0.0039997909,0.142718261
0.67,0.3092193475,0.2315630956,0.1704943811,0.2378284956,0.1387249664,-0.0062654,0.1388663801
0.68,0.3058818602,0.2393367361,0.1710876042,0.2478817846,0.134794256,-0.0085450486,0.1350648337
0.69,0.3025378168,0.2470986579,0.1716683018,0.2579373451,0.130869515,-0.0108386873,0.1313175811
0.7,0.2991872173,0.2548488609,0.1722369947,0.2679951319,0.1269502226,-0.013146271,0.1276290855
0.71,0.2958300617,0.2625873453,0.172794172,0.2780551033,0.1230358897,-0.0154677581,0.1240043616
0.72,0.29246635,0.2703141109,0.1733402934,0.2881172211,0.1191260567,-0.0178031103,0.120449027
0.73,0.2890960823,0.2780291577,0.1738757916,0.2981814501,0.1152202906,-0.0201522923,0.1169693561
0.74,0.2857192584,0.2857324859,0.1744010747,0.3082477575,0.1113181837,-0.0225152716,0.1135723359
0.75,0.2823358784,0.2934240953,0.1749165275,0.3183161133,0.1074193509,-0.024892018,0.1102657223
0.76,0.2789459423,0.301103986,0.1754225135,0.3283864894,0.1035234288,-0.0272825034,0.1070580931
0.77,0.2755494501,0.308772158,0.1759193765,0.3384588599,0.0996300736,-0.0296867019,0.1039588949
0.78,0.2721464019,0.3164286113,0.176407442,0.3485332007,0.0957389598,-0.0321045894,0.1009784784
0.79,0.2687367975,0.3240733458,0.1768870183,0.3586094893,0.0918497792,-0.0345361436,0.098128116
0.8,0.265320637,0.3317063616,0.1773583978,0.3686877049,0.0879622393,-0.0369813434,0.0954199942
0.81,0.2618723943,0.3395494791,0.177821858,0.378767828,0.0840505364,-0.0392183489,0.0927500488
0.82,0.2583665433,0.3478245186,0.1782776627,0.3888498402,0.0800888806,-0.0410253216,0.089985031
0.83,0.2548030839,0.3565314803,0.1787260626,0.3989337247,0.0760770213,-0.0424022444,0.0870957145
0.84,0.2511820162,0.3656703641,0.1791672965,0.4090194654,0.0720147196,-0.0433491013,0.0840551273
0.85,0.2475033401,0.37524117,0.1796015917,0.4191070475,0.0679017484,-0.0438658775,0.0808384973
0.86,0.2437670556,0.3852438979,0.1800291648,0.4291964568,0.0637378909,-0.0439525589,0.077423163
0.87,0.2399731628,0.395678548,0.1804502225,0.4392876804,0.0595229404,-0.0436091323,0.0737884602
0.88,0.2361216617,0.4065451202,0.1808649621,0.4493807057,0.0552566995,-0.0428355855,0.0699155936
0.89,0.2322125522,0.4178436144,0.1812735722,0.4594755212,0.05093898,-0.0416319067,0.0657875014
0.9,0.2282458343,0.4295740308,0.181676233,0.4695721159,0.0465696014,-0.0399980851,0.0613887171
0.91,0.2242215081,0.4417363693,0.1820731167,0.4796704795,0.0421483915,-0.0379341103,0.0567052345
0.92,0.2201395736,0.4543306298,0.1824643884,0.4897706023,0.0376751852,-0.0354399725,0.0517243775
0.93,0.2160000307,0.4673568125,0.1828502061,0.4998724751,0.0331498246,-0.0325156626,0.0464346765
0.94,0.2118028795,0.4808149172,0.1832307213,0.5099760891,0.0285721582,-0.0291611719,0.0408257537
0.95,0.2075481199,0.4947049441,0.1836060791,0.5200814362,0.0239420408,-0.0253764921,0.0348882168
0.96,0.2032357519,0.509026893,0.1839764189,0.5301885086,0.019259333,-0.0211616156,0.0286135611
0.97,0.1988657756,0.5237807641,0.1843418746,0.540297299,0.014523901,-0.0165165349,0.0219940816
0.98,0.194438191,0.5389665572,0.1847025745,0.5504078003,0.0097356164,-0.0114412431,0.0150227917
0.99,0.189952998,0.5545842724,0.1850586423,0.560520006,0.0048943557,-0.0059357336,0.007693351
1,0.1854101966,0.5706339098,0.1854101966,0.5706339098,0,0,0
