xi,sx,sy,cx,cy,ex,ey,ne
0,3.67205580175318e-26,2.88661022282421e-26,0,0,3.67205580175318e-26,2.88661022282421e-26,4.67081495990822e-26
0.01,-0.0326373921817744,-0.0120752715254552,-0.00924908450218359,-0.00395624312158773,-0.0233883076795908,-0.00811902840386745,0.0247574546013521
0.02,-0.0562528404569903,-0.0194320509386828,-0.0185893916061583,-0.0076904166083912,-0.037663448850832,-0.0117416343302916,0.0394512529089448
0.03,-0.0748034357714778,-0.0241135431014867,-0.0280172512615353,-0.0111960566002105,-0.0467861845099425,-0.0129174865012762,0.0485366718936212
0.04,-0.0905457549587375,-0.0272919908570691,-0.0375285737472517,-0.0144668626974382,-0.0530171812114859,-0.0128251281596309,0.0545463602444974
0.05,-0.104575269895292,-0.0295440522549631,-0.0471188480760601,-0.0174967443725589,-0.0574564218192315,-0.0120473078824042,0.0587058603163508
0.06,-0.117361395047415,-0.031123942556052,-0.0567831451090072,-0.020279868960081,-0.0605782499384081,-0.010844073595971,0.0615411918779209
0.07,-0.129169133193794,-0.0321784605198404,-0.0665161257873971,-0.0228107105410689,-0.0626530074063966,-0.00936774997877154,0.0633494599561098
0.08,-0.140192854979368,-0.0328144901774412,-0.0763120547998584,-0.0250840989379001,-0.0638808001795096,-0.00773039123954114,0.0643468381530189
0.09,-0.150576676645107,-0.0331083868868148,-0.0861648198892155,-0.0270952679497226,-0.0644118567558911,-0.00601311893709216,0.0646919229123161
0.1,-0.160430476149158,-0.0331131281680946,-0.0960679568702371,-0.0288399018955327,-0.0643625192789207,-0.00427322627256195,0.0645042196348886
0.11,-0.169845750938139,-0.0328654168272024,-0.106014680278835,-0.0303141794956132,-0.0638310706593045,-0.00255123733158916,0.0638820349819511
0.12,-0.17890735862202,-0.03239154357499,-0.115997919411408,-0.0315148141181622,-0.0629094392106118,-0.000876729456827804,0.062915548128695
0.13,-0.187694806558106,-0.0317101006734888,-0.12601035934658,-0.0324390894497978,-0.061684447211526,0.00072898877630901,0.0616887546675042
0.14,-0.196279424338627,-0.0308334550776853,-0.136044486378461,-0.0330848897178942,-0.0602349379601662,0.00225143464020888,0.0602769998341341
0.15,-0.204721377928448,-0.0297691738655868,-0.146092637139094,-0.0334507236988621,-0.0586287407893537,0.00368154983327531,0.058744217210889
0.16,-0.213066737948183,-0.0285214434559767,-0.156147050556326,-0.0335357418866627,-0.0569196873918578,0.005014298430686,0.0571401260196265
0.17,-0.221345955737539,-0.0270923273061101,-0.166199921689407,-0.033339746364864,-0.0551460340481323,0.00624741905875392,0.0554987866185689
0.18,-0.229575913014626,-0.0254826135969493,-0.176243456414535,-0.032863193116188,-0.0533324566000908,0.00738057951923871,0.0538407269735501
0.19,-0.237763379315503,-0.0236925013983389,-0.186269925900424,-0.032107186706945,-0.0514934534150788,0.00841468530860608,0.0521764570803132
0.2,-0.245908523579116,-0.0217222806218716,-0.196271719821958,-0.0310734674902373,-0.0496368037571575,0.00935118686836572,0.0505099691454436
0.21,-0.254008395926848,-0.0195730031644082,-0.206241397307472,-0.0297643916713296,-0.0477669986193763,0.0101913885069215,0.0488420982022938
0.22,-0.262059634501974,-0.0172469250086211,-0.21617173469928,-0.0281829047616647,-0.0458878998026933,0.0109359797530436,0.0471730325658739
0.23,-0.270059205153481,-0.0147473669067515,-0.226055769322717,-0.0263325091063846,-0.0440034358307641,0.0115851421996331,0.0455029436926655
0.24,-0.278004366179805,-0.0120783460213888,-0.235886838599232,-0.0242172262974524,-0.042117527580573,0.0121388802760636,0.0438319352054747
0.25,-0.285892603267168,-0.00924419875690624,-0.245658613996182,-0.0218415553762681,-0.0402339892709868,0.0125973566193618,0.0421600200006269
0.26,-0.293721565177708,-0.00624920782643939,-0.255365129471359,-0.019210427784098,-0.0383564357063487,0.0129612199576586,0.0404871508368527
0.27,-0.301489018932016,-0.00309733944300717,-0.265000804235857,-0.0163291600360616,-0.0364882146961586,0.0132318205930545,0.0388132823646719
0.28,-0.309192854477508,0.000207739943467663,-0.274560459816972,-0.0132034050772545,-0.034632394660536,0.0134111450207222,0.0371384109876818
0.29,-0.316831108851203,0.00366253678499598,-0.284039331547271,-0.00983910323194672,-0.0327917773039315,0.0135016400169427,0.0354625850989144
0.3,-0.324401991092292,0.00726359933881579,-0.293433074731772,-0.00624243358399018,-0.0309689163605201,0.013506032922806,0.0337858950726011
0.31,-0.331903906835544,0.0110073882222265,-0.302737765849158,-0.00241976653459118,-0.0291661409863863,0.0134271547568176,0.0321084453828163
0.32,-0.339335474606478,0.0148901899074834,-0.311949899223508,0.00162238182132351,-0.0273855753829701,0.0132678080861599,0.030430321563656
0.33,-0.346695521051804,0.0189081392183843,-0.321066379659865,0.00587739297081493,-0.0256291413919384,0.0130307462475694,0.0287515779785478
0.34,-0.353983067871639,0.0230572847669161,-0.330084511571239,0.0103385864948118,-0.0238985563003993,0.0127186982721043,0.0270722418536068
0.35,-0.361197318432552,0.027333656041442,-0.33900198513827,0.0149992575105913,-0.0221953332942824,0.0123343985308507,0.0253923257533085
0.36,-0.368337644371175,0.0317333298618546,-0.347816860038545,0.0198527108428114,-0.0205207843326303,0.0118806190190433,0.0237118472056054
0.37,-0.375403571952288,0.036252480375821,-0.356527547263421,0.0248922918150257,-0.0188760246888673,0.0113601885607953,0.0220308463793734
0.38,-0.382394767803687,0.0408873872747263,-0.365132789509419,0.0301114136362515,-0.0172619782942682,0.0107759736384748,0.0203493858012691
0.39,-0.389311024405529,0.0456344275507095,-0.373631640591937,0.0355035814274978,-0.0156793838135919,0.0101308461232118,0.0186675418828008
0.4,-0.396152245570234,0.0504900666206653,-0.382023444284059,0.0410624129909839,-0.014128801286175,0.00942765362968144,0.0169853960432327
0.41,-0.402918432059487,0.0554508495395177,-0.390307812935196,0.0467816564704133,-0.0126106191242914,0.00866919306910442,0.0153030266015371
0.42,-0.409609670765698,0.0605133945345908,-0.398484606175331,0.0526552050849156,-0.0111250645903667,0.00785818944967516,0.0136205067294435
0.43,-0.416226132941713,0.0656743924319934,-0.406553909962541,0.0586771091432038,-0.00967222297917175,0.00699728328878963,0.0119379173553176
0.44,-0.422768075994992,0.0709306084040996,-0.414516016185538,0.0648415855593672,-0.0082520598094542,0.00608902284473234,0.0102553737280745
0.45,-0.429235845418875,0.076278883806302,-0.422371402990245,0.0711430250988785,-0.00686444242863005,0.00513585870742353,0.00857307497451145
0.46,-0.435629876581889,0.0817161380318041,-0.430120715960486,0.0775759975841502,-0.00550916062140278,0.00414014044765396,0.00689141594149673
0.47,-0.441950692825929,0.0872393708353928,-0.437764750248092,0.0841352552846137,-0.00418594257783683,0.00310411555077909,0.00521130008899275
0.48,-0.448198894194687,0.0928456658477056,-0.4453044337173,0.090815734707967,-0.00289446047738623,0.00202993113973853,0.00353532486304032
0.49,-0.454375142470957,0.0985321945584785,-0.452740811142095,0.0976125569979893,-0.00163433132886176,0.00091963756048917,0.00187530587776008
0.5,-0.460480146071978,0.104296220317833,-0.460075029473018,0.104521027131052,-0.000405116598959976,-0.000224806813219028,0.000463311517256578
0.51,-0.466514645094133,0.110135102255234,-0.467308324171655,0.111536632088919,0.000793679077522036,-0.00140152983368505,0.00161065587659359
0.52,-0.472479400241085,0.116046297057955,-0.474442006596148,0.118655038170266,0.0019626063550624,-0.00260874111231062,0.00326456029137018
0.53,-0.47837519160984,0.122027355315968,-0.481477452409311,0.125872087588022,0.00310226079947173,-0.00384473227205426,0.00494024172604079
0.54,-0.484202821360236,0.128075915726339,-0.48841609097194,0.13318379448461,0.00421326961170371,-0.0051078787582706,0.00662133417296679
0.55,-0.489963116533803,0.134189699215299,-0.495259395677213,0.140586340482606,0.0052962791434103,-0.00639664126730699,0.00830467291755297
0.56,-0.495656931790408,0.140366503113071,-0.502008875177492,0.148076069874615,0.0063519433870835,-0.00770956676154411,0.009989224416511
0.57,-0.501285150007627,0.146604196700512,-0.508666065451844,0.155649484543249,0.00738091544421715,-0.00904528784273728,0.0116745511670751
0.58,-0.506848677454683,0.152900720238039,-0.515232522661096,0.163303238690214,0.00838384520641333,-0.0104025184521747,0.0133604360180698
0.59,-0.512348436829113,0.159254085366364,-0.521709816736813,0.171034133442604,0.00936137990770014,-0.0117800480762399,0.0150467593339833
0.6,-0.517785360211217,0.165662375559988,-0.528099525651085,0.178839111394636,0.0103141654398679,-0.0131767358346476,0.0167334508089949
0.61,-0.523160382076239,0.172123746552017,-0.53440323031524,0.186715251134167,0.011242848239,-0.0145915045821502,0.0184204680314073
0.62,-0.528474433807224,0.178636426013125,-0.540622510057299,0.194659761795406,0.0121480762500753,-0.0160233357822813,0.0201077857102511
0.63,-0.533728442017306,0.185198711337226,-0.546758938630167,0.202669977672193,0.0130304966128609,-0.017471266334968,0.0217953891758134
0.64,-0.538923328372691,0.191808966681302,-0.552814080704913,0.210743352920052,0.0138907523322214,-0.0189343862387498,0.0234832702704132
0.65,-0.544060009473347,0.198465619976545,-0.5587894888061,0.218877456369749,0.0147294793327536,-0.0204118363932039,0.025171424797912
0.66,-0.549139396740629,0.205167159936521,-0.564686700648784,0.227069966470438,0.015547303908155,-0.0219028065339171,0.0268598509466217
0.67,-0.55416239648509,0.211912132987927,-0.570507236839475,0.235318666376321,0.0163448403543857,-0.0234065333883937,0.0285485483251311
0.68,-0.559129910431667,0.218699140004871,-0.576252598906076,0.243621439187309,0.0171226884744098,-0.0249222991824385,0.0302375173771039
0.69,-0.564042836425058,0.225526832965736,-0.581924267624381,0.251976263351129,0.0178814311993225,-0.0264494303853927,0.0319267591441386
0.7,-0.568902069142027,0.232393911607078,-0.587523701611277,0.260381208231789,0.0186216324692499,-0.0279872966247112,0.0336162753466143
0.71,-0.573708500738984,0.239299120128631,-0.59305233615721,0.268834429847197,0.0193438354182258,-0.029535309718566,0.0353060687256316
0.72,-0.578463019816877,0.246241245227254,-0.598511582272751,0.277334166776883,0.0200485624558735,-0.0310929215496289,0.036996143407637
0.73,-0.583166506114619,0.253219117504343,-0.603902825926298,0.285878736239345,0.0207363198116782,-0.0326596187350021,0.0386865048207756
0.74,-0.587819823519824,0.260231614202192,-0.609227427451962,0.294466530337292,0.0214076039321384,-0.0342349161351002,0.0403771592474341
0.75,-0.592423813014814,0.267277661991454,-0.614486721108584,0.303096012468056,0.0220629080937701,-0.0358183504766021,0.0420681131549639
0.76,-0.596979285852615,0.274356239613925,-0.619682014772594,0.311765713895695,0.0227027289199793,-0.0374094742817707,0.0437593723269944
0.77,-0.601487022712209,0.28146637676333,-0.62481458974905,0.320474230480648,0.0233275670368409,-0.0390078537173189,0.0454509409747483
0.78,-0.60594778803197,0.28860714341647,-0.629885700686705,0.329220219562357,0.0239379126547343,-0.0406130761458866,0.0471428214715376
0.79,-0.61036235032236,0.295777635402383,-0.634896575584306,0.338002396989904,0.0245342252619459,-0.0422247615875207,0.048835015105218
0.8,-0.614731502708605,0.302976959826808,-0.639848415876635,0.346819534295478,0.0251169131680299,-0.0438425744686702,0.0505275238175318
0.81,-0.619056096007164,0.310204245726586,-0.644742396589918,0.355670456005305,0.025686300582754,-0.0454662102787189,0.0522203247283687
0.82,-0.623337397680723,0.31745931070233,-0.649579666557313,0.364554037082615,0.0262422688765902,-0.0470947263802856,0.0539126138174103
0.83,-0.627578278023308,0.324744992726683,-0.654361348686131,0.373469200497173,0.0267830706628235,-0.0487242077704907,0.0556001915193801
0.84,-0.631784722223936,0.332070137930846,-0.659088540269339,0.382414914915926,0.027303818045403,-0.0503447769850804,0.0572721140655203
0.85,-0.635967354964053,0.339452613621037,-0.663762313334662,0.39139019250939,0.0277949583706092,-0.051937578888353,0.0589073154337201
0.86,-0.640142938306806,0.346922278810995,-0.66838371502534,0.400394086868491,0.0282407767185341,-0.0534718080574966,0.0604712801799653
0.87,-0.64433517517414,0.354522850171607,-0.672953768007234,0.409425691026693,0.028618592833094,-0.0549028408550862,0.0619140193308862
0.88,-0.64857375008529,0.362310964039396,-0.67747347089758,0.418484135582378,0.0288997208122895,-0.0561731715429817,0.0631713468609426
0.89,-0.652892675483079,0.370354133842131,-0.681943798711182,0.427568586916624,0.0290511232281025,-0.0572144530744926,0.0641674481448945
0.9,-0.657328611352068,0.378728665040481,-0.68636570332037,0.436678245501662,0.029037091968302,-0.0579495804611809,0.0648174867269821
0.91,-0.66191926209682,0.387517719661638,-0.690740113925426,0.445812344295487,0.0288208518286052,-0.0582946246338492,0.0650300296888122
0.92,-0.666703782183272,0.396813270224035,-0.695067937532588,0.45497014721826,0.0283641553493158,-0.058156876994225,0.0647050821064431
0.93,-0.671728280947996,0.4067279267318,-0.699350059437115,0.464150947706341,0.0276217784891187,-0.0574230209745407,0.0637210011279208
0.94,-0.677053336170568,0.417410653060301,-0.703587343709151,0.47335406733994,0.026534007538583,-0.0559434142796391,0.061917034468076
0.95,-0.682761584906056,0.429062632933662,-0.707780633680466,0.482578854540586,0.0250190487744106,-0.053516221606924,0.0590757037762373
0.96,-0.688967129252725,0.441957759729057,-0.711930752430359,0.491824683334764,0.0229636231776338,-0.049866923605707,0.0549002555489661
0.97,-0.695872130435403,0.456583345777086,-0.71603850326925,0.501090952180249,0.020166372833847,-0.0445076064031635,0.0488631724411406
0.98,-0.703943188613196,0.474086004229183,-0.720104670218691,0.510377082851856,0.0161614816054952,-0.0362910786226734,0.0397270169441631
0.99,-0.714134911002872,0.49683775042111,-0.724130018486697,0.519682519383447,0.00999510748382526,-0.0228447689623364,0.0249356299811284
1,-0.728115294937453,0.529006727063226,-0.728115294937453,0.529006727063226,-1.11022302462516e-16,1.11022302462516e-16,1.57009245868378e-16
