xi,s1,s2
0,-2.38758474712933e-27,1.63425487593134e-27
0.01,0.00285686994917967,-0.0178230269924869
0.02,0.00558325822354017,-0.034727591081159
0.03,0.00817916482308151,-0.0507136922660165
0.04,0.0106445897478037,-0.0657813305470594
0.05,0.0129795329977067,-0.0799305059242875
0.06,0.0151839945727905,-0.093161218397701
0.07,0.0172579744730552,-0.1054734679673
0.08,0.0192014726985007,-0.116867254633084
0.09,0.0210144892491271,-0.127342578395053
0.1,0.0226970241249343,-0.136899439253208
0.11,0.0243206451546063,-0.145995360843786
0.12,0.0259569201668271,-0.155087866803023
0.13,0.0276058491615967,-0.16417695713092
0.14,0.029267432138915,-0.173262631827478
0.15,0.0309416690987822,-0.182344890892695
0.16,0.0326285600411982,-0.191423734326573
0.17,0.034328104966163,-0.20049916212911
0.18,0.0360403038736766,-0.209571174300307
0.19,0.037765156763739,-0.218639770840164
0.2,0.0395026636363502,-0.227704951748682
0.21,0.0412552195755164,-0.236766002873576
0.22,0.043025219665244,-0.245822210062566
0.23,0.044812663905533,-0.25487357331565
0.24,0.0466175522963834,-0.26392009263283
0.25,0.0484398848377952,-0.272961768014104
0.26,0.0502796615297683,-0.281998599459473
0.27,0.0521368823723028,-0.291030586968938
0.28,0.0540115473653987,-0.300057730542497
0.29,0.0559036565090559,-0.30908003018015
0.3,0.0578132098032745,-0.318097485881899
0.31,0.0597417775454604,-0.327109582392527
0.32,0.0616909300330195,-0.336115804456819
0.33,0.0636606672659519,-0.345116152074774
0.34,0.0656509892442575,-0.354110625246394
0.35,0.0676618959679363,-0.363099223971676
0.36,0.0696933874369883,-0.372081948250622
0.37,0.0717454636514136,-0.381058798083232
0.38,0.0738181246112121,-0.390029773469506
0.39,0.0759113703163838,-0.398994874409443
0.4,0.0780252007669288,-0.407954100903044
0.41,0.0801621435277504,-0.416906530939202
0.42,0.082324726163752,-0.42585124250681
0.43,0.0845129486749338,-0.43478823560587
0.44,0.0867268110612955,-0.44371751023638
0.45,0.0889663133228374,-0.452639066398341
0.46,0.0912314554595593,-0.461552904091753
0.47,0.0935222374714612,-0.470459023316616
0.48,0.0958386593585433,-0.479357424072929
0.49,0.0981807211208053,-0.488248106360693
0.5,0.100548422758247,-0.497131070179908
0.51,0.102945085928604,-0.506004911505075
0.52,0.105374032289608,-0.514868226310694
0.53,0.107835261841261,-0.523721014596765
0.54,0.110328774583561,-0.532563276363288
0.55,0.11285457051651,-0.541395011610264
0.56,0.115412649640107,-0.550216220337692
0.57,0.118003011954352,-0.559026902545573
0.58,0.120625657459245,-0.567827058233906
0.59,0.123280586154787,-0.576616687402691
0.6,0.125967798040976,-0.585395790051929
0.61,0.128692386753532,-0.594161958351775
0.62,0.13145944592817,-0.602912784472384
0.63,0.134268975564893,-0.611648268413757
0.64,0.137120975663699,-0.620368410175894
0.65,0.140015446224589,-0.629073209758794
0.66,0.142952387247562,-0.637762667162459
0.67,0.145931798732619,-0.646436782386886
0.68,0.14895368067976,-0.655095555432078
0.69,0.152018033088984,-0.663738986298033
0.7,0.155124855960292,-0.672367074984752
0.71,0.158280517167818,-0.680975793870508
0.72,0.161491384585699,-0.689561115333576
0.73,0.164757458213932,-0.698123039373956
0.74,0.168078738052519,-0.706661565991647
0.75,0.17145522410146,-0.71517669518665
0.76,0.174886916360755,-0.723668426958964
0.77,0.178373814830403,-0.73213676130859
0.78,0.181915919510405,-0.740581698235527
0.79,0.18551323040076,-0.749003237739776
0.8,0.189165747501469,-0.757401379821336
0.81,0.192885652294501,-0.765768223758146
0.82,0.196685126261824,-0.774095868828144
0.83,0.20056416940344,-0.782384315031328
0.84,0.204522781719347,-0.790633562367701
0.85,0.208560963209546,-0.798843610837261
0.86,0.212678713874037,-0.807014460440008
0.87,0.216876033712819,-0.815146111175942
0.88,0.221152922725894,-0.823238563045064
0.89,0.22550938091326,-0.831291816047374
0.9,0.229945408274918,-0.839305870182871
0.91,0.234764354889842,-0.847618385875876
0.92,0.240269570837006,-0.856567023550708
0.93,0.24646105611641,-0.866151783207367
0.94,0.253338810728053,-0.876372664845854
0.95,0.260902834671936,-0.887229668466168
0.96,0.269153127948059,-0.89872279406831
0.97,0.278089690556421,-0.91085204165228
0.98,0.287712522497023,-0.923617411218077
0.99,0.298021623769865,-0.937018902765702
1,0.309016994374947,-0.951056516295154
