xi,sx,sy,cx,cy,ex,ey,ne
0,-0,-0,0,0,-0,-0,0
0.01,0.0360421554,-0.0120119155,0.0075791616,-0.0065394013,0.0284629938,-0.0054725142,0.0289843135
0.02,0.0651677537,-0.0146551247,0.015732372,-0.0123439125,0.0494353816,-0.0023112121,0.0494893792
0.03,0.0885729975,-0.011340477,0.0244588019,-0.0172402289,0.0641141956,0.0058997519,0.0643850693
0.04,0.1073313809,-0.0043770256,0.0337141071,-0.0210377532,0.0736172738,0.0166607276,0.0754790225
0.05,0.1223787745,0.0047148103,0.0433954665,-0.0235509036,0.078983308,0.0282657139,0.0838886972
0.06,0.1345087003,0.0149609149,0.0533376869,-0.0246337828,0.0811710134,0.0395946977,0.0903131967
0.07,0.1443759181,0.0257523378,0.0633297718,-0.0242168518,0.0810461462,0.0499691896,0.0952123822
0.08,0.1525064445,0.0367157077,0.0731512641,-0.0223273957,0.0793551804,0.0590431034,0.0989107311
0.09,0.1593121259,0.0476255562,0.0826131238,-0.0190812618,0.0766990021,0.0667068181,0.1016490851
0.1,0.1651078859,0.0583489117,0.0915841281,-0.0146511032,0.0735237578,0.0730000148,0.1036086151
0.11,0.1701297707,0.0688125239,0.0999952995,-0.0092288756,0.0701344712,0.0780413995,0.104925231
0.12,0.1745519634,0.0789833023,0.107828519,-0.0029974602,0.0667234444,0.0819807625,0.1057017665
0.13,0.1785014523,0.0888547428,0.1150997971,0.0038841815,0.0634016552,0.0849705613,0.1060177635
0.14,0.1820700703,0.0984365724,0.121844323,0.0112852381,0.0602257473,0.0871513343,0.1059362813
0.15,0.1853241328,0.107747031,0.1281057983,0.0191013584,0.0572183345,0.0886456726,0.1055082607
0.16,0.1883119561,0.1168074356,0.1339298447,0.0272506053,0.0543821113,0.0895568303,0.1047751873
0.17,0.1910695326,0.1256386686,0.1393603829,0.0356690283,0.0517091497,0.0899696403,0.1037707682
0.18,0.1936246467,0.134259237,0.1444379024,0.0443067102,0.0491867443,0.0899525268,0.102522158
0.19,0.1959997078,0.1426845458,0.1491988308,0.0531245367,0.046800877,0.0895600091,0.1010510629
0.2,0.1982135832,0.1509270298,0.1536754948,0.0620916713,0.0445380884,0.0888353585,0.0993748572
0.21,0.2002827085,0.1589967898,0.1578963724,0.0711836254,0.0423863362,0.0878131644,0.0975077091
0.22,0.2022217511,0.1669023851,0.1618864664,0.0803807972,0.0403352847,0.0865215879,0.0954616172
0.23,0.2040440383,0.1746515261,0.1656677097,0.0896673691,0.0383763286,0.084984157,0.0932472495
0.24,0.2057618412,0.1822515919,0.1692593566,0.0990304741,0.0365024846,0.0832211178,0.0908745609
0.25,0.2073865414,0.1897099857,0.1726783398,0.1084595635,0.0347082015,0.0812504222,0.0883532136
0.26,0.2089287045,0.1970343518,0.1759395863,0.1179459233,0.0329891182,0.0790884285,0.0856928319
0.27,0.2103980832,0.2042326769,0.1790562918,0.1274823038,0.0313417914,0.0767503731,0.0829031221
0.28,0.2118035715,0.2113132985,0.1820401572,0.1370626317,0.0297634143,0.0742506668,0.0799938895
0.29,0.2131531334,0.2182848437,0.1849015902,0.1466817865,0.0282515432,0.0716030572,0.0769749796
0.3,0.2144537293,0.2251561209,0.1876498776,0.1563354245,0.0268038517,0.0688206963,0.0738561758
0.31,0.2157112615,0.2319359882,0.1902933325,0.1660198397,0.025417929,0.0659161485,0.0706470788
0.32,0.2169305611,0.2386332202,0.1928394187,0.1757318528,0.0240911424,0.0629013674,0.0673569979
0.33,0.2181154312,0.2452563897,0.1952948582,0.1854687226,0.022820573,0.059787667,0.0639948723
0.34,0.2192687403,0.2518137694,0.1976657222,0.1952280739,0.0216030182,0.0565856955,0.0605692276
0.35,0.2203925582,0.2583132534,0.1999575099,0.2050078394,0.0204350483,0.053305414,0.057088163
0.36,0.2214883182,0.2647622946,0.2021752155,0.2148062119,0.0193131027,0.0499560827,0.0535593702
0.37,0.2225569972,0.2711678591,0.2043233868,0.2246216052,0.0182336103,0.0465462539,0.049990182
0.38,0.2235992979,0.2775363941,0.206406175,0.2344526216,0.0171931228,0.0430837725,0.0463876592
0.39,0.2246158241,0.2838738085,0.2084273787,0.2442980253,0.0161884455,0.0395757833,0.0427587229
0.4,0.2256072342,0.2901854643,0.2103904814,0.2541567192,0.0152167528,0.0360287451,0.0391103572
0.41,0.2265743617,0.2964761776,0.2122986852,0.264027727,0.0142756765,0.0324484506,0.0354499208
0.42,0.2275182921,0.3027502267,0.2141549392,0.2739101765,0.0133633528,0.0288400502,0.0317856524
0.43,0.2284403873,0.3090113679,0.2159619655,0.2838032864,0.0124784218,0.0252080816,0.0281275379
0.44,0.2293422645,0.3152628569,0.2177222807,0.2937063549,0.0116199838,0.021556502,0.0244889118
0.45,0.2302257379,0.3215074771,0.2194382166,0.3036187501,0.0107875212,0.0178887271,0.0208896427
0.46,0.2310927334,0.3277475761,0.2211119371,0.313539901,0.0099807963,0.0142076751,0.0173630161
0.47,0.2319451883,0.3339851085,0.2227454537,0.3234692911,0.0091997345,0.0105158175,0.0139720268
0.48,0.2327849438,0.3402216876,0.2243406394,0.3334064514,0.0084443044,0.0068152362,0.0108514386
0.49,0.2336136434,0.3464586449,0.225899241,0.3433509557,0.0077144023,0.0031076892,0.0083168344
0.5,0.2344326447,0.3526970992,0.2274228899,0.3533024155,0.0070097548,-0.0006053164,0.0070358418
0.51,0.2352429578,0.3589380335,0.2289131121,0.3632604761,0.0063298458,-0.0043224426,0.0076648847
0.52,0.2360452176,0.3651823826,0.2303713366,0.3732248126,0.005673881,-0.00804243,0.009842439
0.53,0.2368396969,0.3714311288,0.231798904,0.3831951278,0.0050407929,-0.011763999,0.0127984869
0.54,0.2376263562,0.3776854026,0.233197073,0.3931711482,0.0044292831,-0.0154857456,0.0161067335
0.55,0.2384049208,0.3839465868,0.2345670272,0.4031526224,0.0038378936,-0.0192060357,0.0195857405
0.56,0.2391749777,0.3902164168,0.2359098806,0.413139319,0.003265097,-0.0229229022,0.0231542718
0.57,0.2399360816,0.3964970753,0.2372266833,0.4231310239,0.0027093983,-0.0266339486,0.0267714037
0.58,0.2406878631,0.4027912768,0.2385184258,0.4331275397,0.0021694372,-0.0303362629,0.0304137354
0.59,0.2414301281,0.4091023369,0.2397860439,0.4431286834,0.0016440842,-0.0340263465,0.0340660428
0.6,0.242162941,0.4154342237,0.2410304221,0.4531342854,0.0011325189,-0.0377000617,0.0377170684
0.61,0.2428866823,0.4217915868,0.2422523976,0.4631441882,0.0006342846,-0.0413526014,0.0413574655
0.62,0.2436020711,0.4281797595,0.2434527636,0.4731582454,0.0001493075,-0.0449784859,0.0449787337
0.63,0.2443101504,0.4346047336,0.2446322719,0.4831763209,-0.0003221215,-0.0485715874,0.0485726555
0.64,0.245012237,0.4410731101,0.2457916363,0.4931982878,-0.0007793993,-0.0521251777,0.0521310043
0.65,0.2457098463,0.4475920328,0.2469315347,0.5032240274,-0.0012216883,-0.0556319946,0.0556454072
0.66,0.2464046,0.4541691104,0.2480526115,0.5132534292,-0.0016480115,-0.0590843188,0.059107298
0.67,0.2470981258,0.460812334,0.2491554799,0.5232863897,-0.0020573541,-0.0624740557,0.0625079223
0.68,0.2477919582,0.4675299968,0.2502407238,0.5333228121,-0.0024487656,-0.0657928152,0.0658383702
0.69,0.2484874494,0.4743306225,0.2513088995,0.5433626054,-0.0028214501,-0.0690319829,0.0690896175
0.7,0.2491856985,0.4812229077,0.2523605376,0.5534056846,-0.0031748392,-0.0721827769,0.0722525632
0.71,0.2498875087,0.4882156873,0.2533961446,0.5634519696,-0.0035086359,-0.0752362824,0.0753180504
0.72,0.2505933809,0.4953179265,0.2544162038,0.5735013853,-0.003822823,-0.0781834588,0.0782768626
0.73,0.2513035469,0.5025387462,0.2554211776,0.5835538609,-0.0041176307,-0.0810151147,0.0811196875
0.74,0.2520180377,0.5098874821,0.2564115078,0.5936093299,-0.0043934701,-0.0837218478,0.0838370466
0.75,0.252736776,0.5173737775,0.2573876173,0.6036677293,-0.0046508413,-0.0862939518,0.0864191903
0.76,0.2534596837,0.5250077098,0.2583499109,0.613729,-0.0048902272,-0.0887212902,0.0888559601
0.77,0.2541867929,0.5327999503,0.2592987767,0.6237930861,-0.0051119837,-0.0909931358,0.091136618
0.78,0.2549183504,0.5407619557,0.2602345864,0.6338599347,-0.005316236,-0.0930979791,0.0932496438
0.79,0.2556549054,0.5489061928,0.2611576969,0.6439294959,-0.0055027915,-0.0950233031,0.0951825028
0.8,0.25639737,0.5572463952,0.2620684504,0.6540017223,-0.0056710804,-0.0967553271,0.096921383
0.81,0.2571470418,0.5657978506,0.2629671758,0.6640765693,-0.005820134,-0.0982787187,0.098450904
0.82,0.2579055792,0.5745777219,0.2638541888,0.6741539943,-0.0059486096,-0.0995762724,0.0997537968
0.83,0.2586749294,0.5836054199,0.2647297931,0.6842339571,-0.0060548638,-0.1006285372,0.1008105345
0.84,0.2594572232,0.592903082,0.2655942807,0.6943164195,-0.0061370575,-0.1014133375,0.1015988607
0.85,0.2602546657,0.6024962288,0.2664479325,0.7044013453,-0.0061932669,-0.1019051164,0.1020931404
0.86,0.2610694454,0.6124146725,0.2672910191,0.7144886999,-0.0062215737,-0.1020740274,0.102263459
0.87,0.2619036906,0.6226937497,0.268123801,0.7245784506,-0.0062201104,-0.1018847009,0.1020743947
0.88,0.2627594972,0.6333759539,0.2689465292,0.7346705662,-0.006187032,-0.1012946122,0.101483387
0.89,0.2636390561,0.644513039,0.2697594457,0.744765017,-0.0061203896,-0.100251978,0.1004386293
0.9,0.2645449044,0.6561686691,0.2705627839,0.7548617747,-0.0060178795,-0.0986931056,0.0988764075
0.91,0.2654803281,0.6684216902,0.2713567691,0.7649608123,-0.005876441,-0.0965391221,0.0967178094
0.92,0.2664499522,0.6813703785,0.2721416185,0.7750621042,-0.0056916663,-0.0936917256,0.0938644475
0.93,0.267460653,0.6951407982,0.2729175421,0.7851656257,-0.0054568891,-0.0900248275,0.0901900616
0.94,0.2685231302,0.7099080284,0.2736847426,0.7952713535,-0.0051616124,-0.0853633251,0.0855192348
0.95,0.2696545734,0.7259417996,0.2744434161,0.8053792652,-0.0047888427,-0.0794374655,0.079581681
0.96,0.2708828699,0.7436883558,0.2751937518,0.8154893393,-0.004310882,-0.0718009835,0.0719302783
0.97,0.2722527987,0.7639003613,0.2759359332,0.8256015555,-0.0036831345,-0.0617011942,0.0618110252
0.98,0.2738346572,0.7878266736,0.2766701373,0.8357158941,-0.0028354802,-0.0478892206,0.0479730903
0.99,0.2757357654,0.8174738008,0.2773965359,0.8458323365,-0.0016607705,-0.0283585357,0.0284071242
1,0.2781152949,0.8559508647,0.2781152949,0.8559508646,1e-10,0,1e-10
