xi,sx,sy,cx,cy,ex,ey,ne
0,0,-0,0,0,0,-0,0
0.01,0.0102946913,-0.0306786896,0.0031314169,-0.0095814661,0.0071632745,-0.0210972235,0.0222801558
0.02,0.0190984172,-0.0556682553,0.0063205337,-0.019142339,0.0127778836,-0.0365259163,0.038696471
0.03,0.026841677,-0.076568519,0.0095694086,-0.0286815281,0.0172722684,-0.047886991,0.05090673
0.04,0.0338270078,-0.0945099659,0.0128802038,-0.03819786,0.0209468039,-0.056312106,0.0600817932
0.05,0.0402655502,-0.1102836081,0.0162551924,-0.0476900717,0.0240103578,-0.0625935364,0.0670406449
0.06,0.0463042275,-0.1244386658,0.0196967646,-0.0571568018,0.0266074629,-0.0672818639,0.0723519613
0.07,0.0520455885,-0.1373548749,0.0232074357,-0.066596581,0.0288381528,-0.070758294,0.0764092614
0.08,0.057562007,-0.1492950782,0.0267898533,-0.0760078217,0.0307721537,-0.0732872565,0.079485517
0.09,0.0629056231,-0.160442742,0.030446806,-0.0853888065,0.0324588172,-0.0750539355,0.0817720493
0.1,0.0681151359,-0.1709281609,0.0341812316,-0.0947376753,0.0339339043,-0.0761904857,0.0834056351
0.11,0.0732203275,-0.1808463454,0.0379962271,-0.1040524104,0.0352241004,-0.076793935,0.0844869558
0.12,0.0782449978,-0.1902689401,0.0418950577,-0.1133308211,0.0363499401,-0.076938119,0.0850928452
0.13,0.0832088246,-0.1992519706,0.0458811672,-0.1225705248,0.0373276574,-0.0766814457,0.0852842197
0.14,0.0881285251,-0.207840765,0.0499581888,-0.1317689278,0.0381703364,-0.0760718373,0.085111098
0.15,0.0930185864,-0.2160730247,0.0541299559,-0.1409232016,0.0388886304,-0.0751498231,0.0846157284
0.16,0.0978917423,-0.2239807288,0.0584005139,-0.1500302584,0.0394912285,-0.0739504704,0.0838345346
0.17,0.1027593135,-0.2315913313,0.0627741309,-0.1590867226,0.0399851826,-0.0725046087,0.0827993546
0.18,0.1076314725,-0.2389285409,0.0672553101,-0.1680888984,0.0403761624,-0.0708396425,0.0815382698
0.19,0.1125174697,-0.2460128579,0.0718488011,-0.1770327345,0.0406686686,-0.0689801233,0.0800762013
0.2,0.1174258302,-0.2528619639,0.0765596103,-0.1859137837,0.0408662198,-0.0669481802,0.0784353667
0.21,0.1223645246,-0.2594910159,0.081393012,-0.194727158,0.0409715126,-0.0647638579,0.0766356453
0.22,0.1273411101,-0.2659128695,0.0863545562,-0.2034674777,0.0409865539,-0.0624453918,0.0746948764
0.23,0.1323628395,-0.272138251,0.0914500764,-0.2121288151,0.0409127631,-0.0600094359,0.0726291028
0.24,0.1374367363,-0.2781758907,0.0966856928,-0.220704631,0.0407510435,-0.0574712597,0.0704527731
0.25,0.1425696374,-0.2840326291,0.1020678131,-0.2291877039,0.0405018243,-0.0548449253,0.0681789088
0.26,0.147768203,-0.2897135066,0.1076031271,-0.2375700514,0.0401650759,-0.0521434552,0.0658192468
0.27,0.1530388974,-0.2952218435,0.1132985947,-0.2458428434,0.0397403027,-0.0493790001,0.0633843617
0.28,0.1583879449,-0.3005593175,0.1191614253,-0.2539963055,0.0392265196,-0.0465630121,0.0608837739
0.29,0.1638212625,-0.3057260447,0.1251990449,-0.2620196148,0.0386222176,-0.0437064298,0.0583260465
0.3,0.1693443769,-0.3107206652,0.1314190488,-0.2699007864,0.0379253281,-0.0408198789,0.0557188749
0.31,0.1749623279,-0.3155404401,0.1378291359,-0.2776265516,0.0371331919,-0.0379138885,0.0530691708
0.32,0.1806795646,-0.3201813571,0.14443702,-0.2851822318,0.0362425445,-0.0349991253,0.0503831401
0.33,0.186499839,-0.3246382493,0.1512503125,-0.2925516077,0.0352495265,-0.0320866416,0.047666358
0.34,0.1924261009,-0.3289049254,0.1582763719,-0.2997167917,0.0341497289,-0.0291881338,0.0449238371
0.35,0.198460399,-0.3329743105,0.1655221132,-0.3066581073,0.0329382858,-0.0263162032,0.0421600904
0.36,0.204603792,-0.3368385971,0.1729937709,-0.3133539874,0.0316100211,-0.0234846097,0.0393791864
0.37,0.2108562724,-0.3404894049,0.1806966112,-0.319780902,0.0301596612,-0.0207085029,0.0365847954
0.38,0.2172167075,-0.3439179462,0.1886345889,-0.3259133334,0.0285821186,-0.0180046127,0.0337802248
0.39,0.2236827979,-0.3471151955,0.1968099489,-0.3317238169,0.026872849,-0.0153913786,0.0309684444
0.4,0.2302510562,-0.3500720613,0.2052227768,-0.3371830725,0.0250282794,-0.0128889888,0.0281521013
0.41,0.2369168078,-0.3527795557,0.2138705109,-0.3422602522,0.0230462969,-0.0105193035,0.0253335262
0.42,0.2436742121,-0.3552289614,0.2227474364,-0.3469233292,0.0209267757,-0.0083056322,0.0225147389
0.43,0.2505163063,-0.3574119913,0.2318441955,-0.3511396495,0.0186721107,-0.0062723418,0.0196974615
0.44,0.2574350693,-0.3593209405,0.2411473582,-0.3548766606,0.0162877111,-0.0044442799,0.0168831619
0.45,0.2644215063,-0.3609488252,0.2506391086,-0.3581028104,0.0137823977,-0.0028460148,0.0140731762
0.46,0.2714657509,-0.3622895098,0.2602971092,-0.3607885932,0.0111686417,-0.0015009166,0.0112690421
0.47,0.2785571839,-0.3633378166,0.270094599,-0.3629076874,0.0084625849,-0.0004301292,0.008473509
0.48,0.2856845663,-0.3640896194,0.2800007709,-0.3644381064,0.0056837955,0.000348487,0.0056944687
0.49,0.2928361838,-0.3645419167,0.2899814422,-0.3653632591,0.0028547416,0.0008213424,0.0029705475
0.5,0.3,-0.3646928862,0.3,-0.3656728132,0,0.000979927,0.000979927
0.51,0.3071638162,-0.3645419167,0.3100185578,-0.3653632591,-0.0028547416,0.0008213424,0.0029705475
0.52,0.3143154337,-0.3640896194,0.3199992291,-0.3644381064,-0.0056837955,0.000348487,0.0056944687
0.53,0.3214428161,-0.3633378166,0.329905401,-0.3629076874,-0.0084625849,-0.0004301292,0.008473509
0.54,0.3285342491,-0.3622895098,0.3397028908,-0.3607885932,-0.0111686417,-0.0015009166,0.0112690421
0.55,0.3355784937,-0.3609488252,0.3493608914,-0.3581028104,-0.0137823977,-0.0028460148,0.0140731761
0.56,0.3425649307,-0.3593209405,0.3588526418,-0.3548766606,-0.0162877111,-0.0044442799,0.0168831619
0.57,0.3494836937,-0.3574119913,0.3681558045,-0.3511396495,-0.0186721107,-0.0062723418,0.0196974615
0.58,0.3563257879,-0.3552289614,0.3772525636,-0.3469233292,-0.0209267757,-0.0083056322,0.0225147389
0.59,0.3630831922,-0.3527795557,0.3861294891,-0.3422602522,-0.0230462969,-0.0105193035,0.0253335262
0.6,0.3697489438,-0.3500720613,0.3947772232,-0.3371830725,-0.0250282794,-0.0128889888,0.0281521012
0.61,0.3763172021,-0.3471151955,0.4031900511,-0.3317238169,-0.026872849,-0.0153913786,0.0309684444
0.62,0.3827832925,-0.3439179462,0.4113654111,-0.3259133334,-0.0285821186,-0.0180046127,0.0337802248
0.63,0.3891437276,-0.3404894049,0.4193033888,-0.319780902,-0.0301596612,-0.0207085029,0.0365847954
0.64,0.395396208,-0.3368385971,0.4270062291,-0.3133539874,-0.031610021,-0.0234846097,0.0393791864
0.65,0.401539601,-0.3329743105,0.4344778868,-0.3066581073,-0.0329382858,-0.0263162032,0.0421600904
0.66,0.4075738991,-0.3289049254,0.4417236281,-0.2997167917,-0.0341497289,-0.0291881338,0.0449238371
0.67,0.413500161,-0.3246382493,0.4487496875,-0.2925516077,-0.0352495265,-0.0320866416,0.047666358
0.68,0.4193204354,-0.3201813571,0.45556298,-0.2851822318,-0.0362425445,-0.0349991253,0.0503831401
0.69,0.4250376721,-0.3155404401,0.4621708641,-0.2776265516,-0.0371331919,-0.0379138885,0.0530691707
0.7,0.4306556231,-0.3107206652,0.4685809512,-0.2699007864,-0.0379253281,-0.0408198789,0.0557188749
0.71,0.4361787375,-0.3057260447,0.4748009551,-0.2620196148,-0.0386222176,-0.0437064298,0.0583260465
0.72,0.4416120551,-0.3005593175,0.4808385747,-0.2539963055,-0.0392265195,-0.0465630121,0.0608837739
0.73,0.4469611026,-0.2952218435,0.4867014053,-0.2458428434,-0.0397403027,-0.0493790001,0.0633843617
0.74,0.452231797,-0.2897135066,0.4923968729,-0.2375700514,-0.0401650759,-0.0521434552,0.0658192468
0.75,0.4574303626,-0.2840326291,0.4979321869,-0.2291877039,-0.0405018243,-0.0548449253,0.0681789088
0.76,0.4625632637,-0.2781758907,0.5033143072,-0.220704631,-0.0407510435,-0.0574712597,0.0704527731
0.77,0.4676371605,-0.272138251,0.5085499236,-0.2121288151,-0.0409127631,-0.0600094359,0.0726291028
0.78,0.4726588899,-0.2659128695,0.5136454438,-0.2034674777,-0.0409865539,-0.0624453918,0.0746948764
0.79,0.4776354754,-0.2594910159,0.518606988,-0.194727158,-0.0409715126,-0.0647638579,0.0766356453
0.8,0.4825741698,-0.2528619639,0.5234403897,-0.1859137837,-0.0408662198,-0.0669481802,0.0784353667
0.81,0.4874825303,-0.2460128579,0.5281511989,-0.1770327345,-0.0406686686,-0.0689801233,0.0800762013
0.82,0.4923685275,-0.2389285409,0.5327446899,-0.1680888984,-0.0403761624,-0.0708396425,0.0815382698
0.83,0.4972406865,-0.2315913313,0.5372258691,-0.1590867226,-0.0399851826,-0.0725046087,0.0827993546
0.84,0.5021082577,-0.2239807288,0.5415994861,-0.1500302584,-0.0394912285,-0.0739504704,0.0838345346
0.85,0.5069814136,-0.2160730247,0.5458700441,-0.1409232016,-0.0388886304,-0.0751498231,0.0846157284
0.86,0.5118714749,-0.207840765,0.5500418112,-0.1317689278,-0.0381703364,-0.0760718373,0.085111098
0.87,0.5167911754,-0.1992519706,0.5541188328,-0.1225705248,-0.0373276574,-0.0766814457,0.0852842197
0.88,0.5217550022,-0.1902689401,0.5581049423,-0.1133308211,-0.0363499401,-0.076938119,0.0850928452
0.89,0.5267796725,-0.1808463454,0.5620037729,-0.1040524104,-0.0352241004,-0.076793935,0.0844869558
0.9,0.5318848641,-0.1709281609,0.5658187684,-0.0947376753,-0.0339339043,-0.0761904857,0.0834056351
0.91,0.5370943769,-0.160442742,0.569553194,-0.0853888065,-0.0324588172,-0.0750539355,0.0817720493
0.92,0.542437993,-0.1492950782,0.5732101467,-0.0760078217,-0.0307721537,-0.0732872565,0.079485517
0.93,0.5479544115,-0.1373548749,0.5767925643,-0.066596581,-0.0288381528,-0.070758294,0.0764092614
0.94,0.5536957725,-0.1244386658,0.5803032354,-0.0571568018,-0.0266074629,-0.0672818639,0.0723519613
0.95,0.5597344498,-0.1102836081,0.5837448076,-0.0476900717,-0.0240103578,-0.0625935364,0.0670406449
0.96,0.5661729922,-0.0945099659,0.5871197962,-0.03819786,-0.0209468039,-0.056312106,0.0600817932
0.97,0.573158323,-0.076568519,0.5904305914,-0.0286815281,-0.0172722684,-0.047886991,0.05090673
0.98,0.5809015828,-0.0556682553,0.5936794663,-0.019142339,-0.0127778836,-0.0365259163,0.038696471
0.99,0.5897053087,-0.0306786896,0.5968685831,-0.0095814661,-0.0071632745,-0.0210972235,0.0222801558
1,0.6,-0,0.6,0,0,-0,0
