xi,s1,s2
0,0,0
0.01,0.000283298226080354,-0.0101086924127968
0.02,0.000570477852719945,-0.0202157351208908
0.03,0.000861647902016918,-0.0303211234749848
0.04,0.00115692205295959,-0.0404248525589387
0.05,0.00145641891036937,-0.0505269171703506
0.06,0.00176026229353461,-0.0606273117994183
0.07,0.00206858154628979,-0.0707260306058992
0.08,0.00238151187048039,-0.0808230673939681
0.09,0.00269919468496133,-0.0909184155847436
0.1,0.00302177801250998,-0.101012068186228
0.11,0.00334941689729886,-0.111104017760371
0.12,0.00368227385586875,-0.121194256386937
0.13,0.00402051936487934,-0.131282775623795
0.14,0.00436433238929422,-0.14136956646323
0.15,0.00471390095508759,-0.151454619283778
0.16,0.00506942277105101,-0.161537923797075
0.17,0.00543110590483625,-0.171619468989065
0.18,0.00579916951900801,-0.181699243054898
0.19,0.00617384467361019,-0.191777233326682
0.2,0.00655537520258558,-0.201853426193173
0.21,0.00694401867235146,-0.211927807010335
0.22,0.00734004743194197,-0.222000360001524
0.23,0.00774374976540967,-0.232071068145878
0.24,0.00815543115866262,-0.242139913053246
0.25,0.00857541569463798,-0.252206874823733
0.26,0.0090040475927219,-0.262271931889594
0.27,0.009441692910673,-0.27233506083685
0.28,0.00988874143005779,-0.282396236203521
0.29,0.0103456087494421,-0.292455430250816
0.3,0.0108127386133985,-0.302512612702971
0.31,0.0112906055099093,-0.312567750450591
0.32,0.0117797175741108,-0.322620807211406
0.33,0.0122806198427312,-0.332671743141115
0.34,0.0127938979112347,-0.342720514385558
0.35,0.0133201820549073,-0.352767072563628
0.36,0.0138601518862427,-0.362811364168119
0.37,0.0144145416344888,-0.372853329868886
0.38,0.0149841461496621,-0.382892903699273
0.39,0.0155698277534847,-0.392930012102323
0.4,0.016172524084502,-0.402964572807788
0.41,0.0167932571153393,-0.412996493503889
0.42,0.0174331435582892,-0.423025670258734
0.43,0.0180934069233048,-0.433051985634611
0.44,0.0187753915528572,-0.443075306423212
0.45,0.0194805790347604,-0.453095480909921
0.46,0.0202106074920675,-0.463112335548971
0.47,0.0209672943754169,-0.47312567089618
0.48,0.0217526635472351,-0.483135256598726
0.49,0.0225689776621288,-0.493140825177092
0.5,0.0234187771320454,-0.503142064245942
0.51,0.0243049273444225,-0.513138606697748
0.52,0.0252306763140113,-0.523130018199745
0.53,0.0261997256487125,-0.533115781107646
0.54,0.0272163186767146,-0.543095273541404
0.55,0.0282853509363101,-0.553067741841476
0.56,0.0294125101530972,-0.563032263835356
0.57,0.0306044556034946,-0.572987699141443
0.58,0.0318690508322543,-0.582932620865048
0.59,0.0332156697679164,-0.592865220060717
0.6,0.0346556055343784,-0.602783169470152
0.61,0.0362026256548517,-0.612683424882921
0.62,0.0378737402688803,-0.622561928345684
0.63,0.0396902874009899,-0.632413152158674
0.64,0.0416795020244173,-0.642229375530999
0.65,0.0438768436288571,-0.651999494248001
0.66,0.0463295477671297,-0.661706976741597
0.67,0.0491022108372961,-0.671326176116167
0.68,0.0522858370571085,-0.680815279540645
0.69,0.0560128257834505,-0.69010189718184
0.7,0.0604816201279466,-0.699051342146835
0.71,0.0659924245916565,-0.7073917792977
0.72,0.0729634182720839,-0.714535047183534
0.73,0.0817197612161659,-0.719249479276446
0.74,0.0916105712469628,-0.719817693524827
0.75,0.10076082204209,-0.715952130382971
0.76,0.108146736506618,-0.70924828343933
0.77,0.113966412484356,-0.701123482351294
0.78,0.11865325470973,-0.692287590552804
0.79,0.122536994624287,-0.683066171366221
0.8,0.125836957628794,-0.673617432985844
0.81,0.128698695364218,-0.664024809122448
0.82,0.131221484691383,-0.654335718218205
0.83,0.133475261610662,-0.644578858658345
0.84,0.13551081814538,-0.634772525333018
0.85,0.137366056262729,-0.624928894086824
0.86,0.139069935961831,-0.615056365363773
0.87,0.140645044419706,-0.605160913877258
0.88,0.142109316599677,-0.595246900916397
0.89,0.143477218302885,-0.585317582179542
0.9,0.144760579150885,-0.575375435905212
0.91,0.145969191724461,-0.565422381090391
0.92,0.147111250833688,-0.555459926341644
0.93,0.148193681169396,-0.545489273717235
0.94,0.149222385522796,-0.535511392635895
0.95,0.150202435490766,-0.525527073434213
0.96,0.151138219875011,-0.515536966809956
0.97,0.15203356151105,-0.505541613299869
0.98,0.152891810226512,-0.495541465605569
0.99,0.153715917531186,-0.485536905709959
1,0.154508497170146,-0.475528258147145
