xi,sx,sy,cx,cy,ex,ey,ne
0,7.6278030825243e-26,3.49897097027491e-26,0,0,7.6278030825243e-26,3.49897097027491e-26,8.39203060746288e-26
0.01,-0.00173749798144811,-0.016970739801372,-0.00168351364685469,-0.00996422284570915,-5.39843345934196e-05,-0.00700651695566285,0.00700672492384084
0.02,-0.00343167561418891,-0.03342094791733,-0.00339136714836573,-0.019922762098771,-4.03084658231819e-05,-0.0134981858185589,0.0134982460032688
0.03,-0.00508253289822242,-0.0493506243478739,-0.00512427135538649,-0.0298754321290566,4.17384571640726e-05,-0.0194751922188172,0.0194752369448663
0.04,-0.00669006983354861,-0.0647597690930037,-0.00688296820620116,-0.039822036138897,0.000192898372652546,-0.0249377329541067,0.0249384789967735
0.05,-0.00825428642016751,-0.0796483821527195,-0.00866823253291708,-0.0497623653175778,0.000413946112749574,-0.0298860168351417,0.0298888834461014
0.06,-0.00977518265807909,-0.0940164635270212,-0.0104808739982631,-0.0596961979185328,0.000705691340184033,-0.0343202656084884,0.0343275200342933
0.07,-0.0112527585472834,-0.107864013215909,-0.0123217391739783,-0.0696232982509354,0.0010689806266949,-0.0382407149649735,0.0382556531850209
0.08,-0.0126870140877804,-0.121191031219383,-0.0141917137730781,-0.0795434155763814,0.00150469968529776,-0.0416476156430011,0.041674788660413
0.09,-0.01407794927957,-0.133997517537442,-0.0160917250495064,-0.0894562829001755,0.00201377576993634,-0.0445412346372666,0.0445867343036426
0.1,-0.0154255641226524,-0.146283472170088,-0.0180227443800385,-0.0993616156454168,0.0025971802573861,-0.0469218565246709,0.0469936800539302
0.11,-0.0167298586170275,-0.158048895117319,-0.0199857900448119,-0.109259110196558,0.00325593142778444,-0.0487897849207611,0.0488983046953221
0.12,-0.0179908327626952,-0.169293786379137,-0.0219819302245349,-0.11914844229737,0.00399109746183965,-0.0501453440817663,0.0503039202451324
0.13,-0.0192084865596557,-0.18001814595554,-0.0240122862342944,-0.129029265286251,0.00480379967463868,-0.0509888806692886,0.0512146701953748
0.14,-0.0203828200079089,-0.190221973846529,-0.02607803601596,-0.138901208149527,0.00569521600805113,-0.0513207656970017,0.0516358061533362
0.15,-0.0215138331074547,-0.199905270052105,-0.0281804179134992,-0.148763873370753,0.00666658480604446,-0.051141396681352,0.0515740807721823
0.16,-0.0226015258582932,-0.209068034572266,-0.030320734758096,-0.158616834550961,0.00771920889980274,-0.050451200021305,0.051038316680985
0.17,-0.0236512406617834,-0.217738885876014,-0.0325003582928445,-0.168459633771319,0.00884911763106112,-0.0492792521046954,0.0500674701862045
0.18,-0.0247324287355908,-0.226289864060367,-0.0347207339699913,-0.178291778665529,0.00998830523440051,-0.0479980853948373,0.0490263443775451
0.19,-0.0258664596851511,-0.234835443001328,-0.036983386157276,-0.188112739164618,0.0111169264721248,-0.0467227038367101,0.0480270455889133
0.2,-0.0270533335104643,-0.243375622698899,-0.0392899237938967,-0.197921943871221,0.0122365902834324,-0.0454536788276785,0.0470719774466119
0.21,-0.0282930502115304,-0.25191040315308,-0.041642046541064,-0.207718776014079,0.0133489963295336,-0.0441916271390008,0.0461637911376262
0.22,-0.0295856097883494,-0.260439784363869,-0.0440415514770334,-0.217502568925955,0.0144559416886841,-0.0429372154379135,0.0453053939356941
0.23,-0.0309310122409212,-0.268963766331268,-0.0464903403919863,-0.227272600979416,0.0155593281510651,-0.0416911653518517,0.0444999546169203
0.24,-0.0323292575692459,-0.277482349055275,-0.0489904277442045,-0.237028089904629,0.0166611701749585,-0.0404542591506467,0.0437509048480898
0.25,-0.0337803457733235,-0.285995532535893,-0.0515439493456991,-0.246768186401261,0.0177636035723756,-0.0392273461346314,0.0430619355886692
0.26,-0.0352842768531541,-0.294503316773119,-0.0541531718528621,-0.256491966942293,0.0188688949997081,-0.0380113498308257,0.0424369875753619
0.27,-0.0368410508087374,-0.303005701766954,-0.0568205031458344,-0.266198425650771,0.019979452337097,-0.0368072761161832,0.0418802350851005
0.28,-0.0384506676400737,-0.311502687517399,-0.059548503689148,-0.275886465110627,0.0210978360490743,-0.0356162224067725,0.0413960624272684
0.29,-0.0401131273471628,-0.319994274024453,-0.0623398989757968,-0.285554885949111,0.0222267716286339,-0.0344393880753424,0.0409890330214739
0.3,-0.0418284299300049,-0.328480461288116,-0.065197593167163,-0.29520237500038,0.0233691632371581,-0.0332780862877364,0.0406638514823543
0.31,-0.0435965753885998,-0.336961249308389,-0.0681246840520686,-0.304827491826419,0.0245281086634688,-0.0321337574819694,0.0404253198443371
0.32,-0.0454175637229476,-0.345436638085271,-0.0711244794594344,-0.314428653331716,0.0257069157364868,-0.031007984753555,0.0402782898738208
0.33,-0.0472913949330483,-0.353906627618762,-0.0742005152702741,-0.324004116160567,0.0269091203372259,-0.0299025114581951,0.0402276142572585
0.34,-0.0492561714570889,-0.362350393006009,-0.0773565751855107,-0.333551956509037,0.0281004037284218,-0.0287984364969722,0.0402365832840021
0.35,-0.0514357262191773,-0.370700253312745,-0.0805967124155873,-0.343070046915396,0.02916098619641,-0.0276302063973488,0.0401720228704917
0.36,-0.0538395848288603,-0.378951002313254,-0.0839252734648796,-0.352556029511078,0.0300856886360193,-0.0263949728021761,0.040023033992079
0.37,-0.056467747286138,-0.387102640007538,-0.0873469241867843,-0.362007285116006,0.0308791769006464,-0.0250953548915321,0.0397907074980247
0.38,-0.0593202135910102,-0.395155166395596,-0.090866678281592,-0.371420897444128,0.0315464646905818,-0.0237342689514676,0.0394777780166859
0.39,-0.062396983743477,-0.403108581477428,-0.0944899283952986,-0.38079361154341,0.0320929446518216,-0.0223149699340187,0.0390885530504909
0.4,-0.0656980577435384,-0.410962885253035,-0.0982224799483307,-0.390121785424631,0.0325244222047923,-0.0208410998284035,0.0386288685028835
0.41,-0.0692234355911943,-0.418718077722416,-0.102070587771628,-0.399401333630135,0.0328471521804335,-0.019316744092281,0.0381060626238297
0.42,-0.0729731172864449,-0.426374158885571,-0.106040995543604,-0.408627661251341,0.0330678782571586,-0.0177464976342301,0.0375289588279771
0.43,-0.0769471028292901,-0.4339311287425,-0.110140977891139,-0.417795586616726,0.0331938750618486,-0.0161355421257739,0.03690784552523
0.44,-0.0811453922197298,-0.441388987293204,-0.114378384821351,-0.426899250534471,0.0332329926016214,-0.0144897367587324,0.0362544379158854
0.45,-0.0855679854577642,-0.448747734537682,-0.11876168786125,-0.435932009582402,0.0331937024034856,-0.0128157249552802,0.0355818027280878
0.46,-0.0902148825433931,-0.456007370475934,-0.123300026862086,-0.444886310491909,0.033085144318693,-0.0111210599840252,0.0349042225204491
0.47,-0.0950860834766166,-0.46316789510796,-0.128003255823141,-0.453753542179043,0.032917172346524,-0.00941435292891762,0.034236972359731
0.48,-0.100181588257435,-0.470229308433761,-0.132881985236779,-0.462523861454431,0.0327003969793446,-0.00770544697933012,0.0335959800535421
0.49,-0.105501396885847,-0.477191610453336,-0.137947617261232,-0.471185987935397,0.0324462203753843,-0.00600562251793929,0.0329973441124582
0.5,-0.111045509361855,-0.484054801166685,-0.143212368370641,-0.479726963265976,0.0321668590087864,-0.00432783790070879,0.0324566942153071
0.51,-0.11679631585641,-0.49071541407952,-0.148689271864362,-0.488131869558935,0.0318929560079521,-0.00258354452058485,0.0319974271655553
0.52,-0.122736206540466,-0.497069982697553,-0.154392149562328,-0.496383502234383,0.0316559430218618,-0.00068648046316927,0.0316633855427633
0.53,-0.128865181414024,-0.503118507020783,-0.160335537980552,-0.504461993505322,0.0314703565665276,0.00134348648453941,0.0314990205936395
0.54,-0.135183240477083,-0.50886098704921,-0.16653454910616,-0.512344385213484,0.0313513086290767,0.00348339816427357,0.0315442326824807
0.55,-0.141690383729643,-0.514297422782835,-0.173004639520072,-0.52000415438413,0.0313142557904291,0.00570673160129465,0.0318300078742943
0.56,-0.148386611171704,-0.519427814221658,-0.179761254262316,-0.527410702923111,0.0313746430906113,0.00798288870145303,0.0323742913603221
0.57,-0.155271922803267,-0.524252161365678,-0.186819304262646,-0.534528835862169,0.0315473814593791,0.0102766744964909,0.0331790192086867
0.58,-0.16234631862433,-0.528770464214895,-0.194192430114564,-0.541318272242185,0.0318461114902341,0.0125478080272898,0.0342289687740975
0.59,-0.169609798634895,-0.53298272276931,-0.201892003781906,-0.547733260663083,0.0322822051470108,0.0147505378937726,0.0354925222731396
0.6,-0.177062362834961,-0.536888937028923,-0.20992582903237,-0.553722408004285,0.0328634661974088,0.0168334709753626,0.0369238832679691
0.61,-0.184704011224529,-0.540489106993732,-0.218296528987869,-0.559228871874714,0.03359251776334,0.0187397648809821,0.0384660374548094
0.62,-0.192534743803597,-0.54378323266374,-0.226999664582244,-0.564191105843678,0.034464920778647,0.0204078731799383,0.0400538643829389
0.63,-0.200554560572167,-0.546771314038945,-0.236021718003276,-0.568544362950328,0.0354671574311089,0.0217730489113827,0.0416171228599542
0.64,-0.208763461530238,-0.549453351119347,-0.245338197335465,-0.572223128775043,0.0365747358052271,0.0227697776556962,0.0430833387020087
0.65,-0.21716144667781,-0.551829343904947,-0.254912248487723,-0.575164538123764,0.0377508018099124,0.0233351942188168,0.0443807878087037
0.66,-0.225748516014884,-0.553899292395744,-0.264694244897982,-0.577312611555821,0.0389457288830977,0.0234133191600762,0.0454417573639856
0.67,-0.234510177134033,-0.555658440520206,-0.274622790159823,-0.578622855702769,0.0401126130257903,0.0229644151825626,0.0462210567645734
0.68,-0.243258028738722,-0.557044959348405,-0.284627354287393,-0.579066496139353,0.0413693255486709,0.0220215367909484,0.0468654369337042
0.69,-0.251934101199249,-0.558039824594209,-0.294632383055901,-0.578633493542475,0.0426982818566514,0.0205936689482661,0.0474050891177395
0.7,-0.260538394515614,-0.558643036257617,-0.304562290915335,-0.577333648295132,0.0440238963997209,0.0186906120375152,0.0478272143507258
0.71,-0.269070908687816,-0.558854594338631,-0.314346459572682,-0.575195521856843,0.0452755508848658,0.0163409275182126,0.0481342021860085
0.72,-0.277531643715855,-0.55867449883725,-0.323923362419829,-0.572263440293686,0.0463917187039731,0.0135889414564369,0.0483409856562218
0.73,-0.285920599599733,-0.558102749753473,-0.333243220562956,-0.568593271108951,0.0473226209632231,0.0104905213554779,0.0484714502892025
0.74,-0.294237776339447,-0.557139347087302,-0.342269024615923,-0.564247822542889,0.0480312482764752,0.00710847545558679,0.048554415188519
0.75,-0.302483173935,-0.555784290838736,-0.350976139209543,-0.559292599257642,0.048492965274543,0.00350830841890581,0.0486197070032327
0.76,-0.310656792386389,-0.554037581007775,-0.359350923901177,-0.55379237416164,0.0486941315147881,-0.000245206846135271,0.0486947488994128
0.77,-0.318758631693617,-0.551899217594419,-0.367388841422204,-0.547808743365017,0.0486302097285869,-0.00409047422940234,0.0488019392818334
0.78,-0.326788691856682,-0.549369200598668,-0.375092440784256,-0.541398612255558,0.0483037489275744,-0.00797058834311004,0.0489569447473336
0.79,-0.334746972875584,-0.546447530020522,-0.3824694730704,-0.534613442277791,0.0477225001948164,-0.0118340877427311,0.0491679027165784
0.8,-0.342633474750324,-0.543134205859981,-0.389531275304788,-0.52749905296278,0.0468978005544644,-0.0156351528972014,0.049435429632655
0.81,-0.350448197480902,-0.539429228117045,-0.396291467071472,-0.520095789776517,0.0458432695905706,-0.0193334383405279,0.0497532632580088
0.82,-0.358191141067316,-0.535332596791715,-0.402764948759879,-0.512438906711631,0.0445738076925626,-0.0228936900800832,0.0501093342372103
0.83,-0.365862305509569,-0.530844311883989,-0.408967162437911,-0.504559054629776,0.0431048569283421,-0.026285257254213,0.0504870621024139
0.84,-0.373461883295105,-0.525897254483515,-0.41491356697756,-0.496482802932078,0.0414516836824544,-0.0294144515514369,0.0508276700251161
0.85,-0.380990500008126,-0.520273288131645,-0.420619280158749,-0.488233150180265,0.0396287801506225,-0.0320401379513797,0.0509608737775346
0.86,-0.388448203770493,-0.513955633100791,-0.426098846486524,-0.479829999067072,0.037650642716031,-0.0341256340337191,0.0508146612222649
0.87,-0.395834994582206,-0.506944289390952,-0.43136609702351,-0.471290584187819,0.0355311024413038,-0.0356537052031332,0.0503353348593844
0.88,-0.403150872443265,-0.49923925700213,-0.436434074901375,-0.462629849169703,0.0332832024581097,-0.0366094078324264,0.0494774727296013
0.89,-0.410395837353671,-0.490840535934323,-0.441315006560363,-0.453860774413997,0.0309191692066927,-0.0369797615203259,0.0482026740599759
0.9,-0.417569889313422,-0.481748126187531,-0.44602030395516,-0.444994659180679,0.0284504146417383,-0.0367534670068523,0.0464784189738702
0.91,-0.424673028322519,-0.471962027761756,-0.45056058701114,-0.436041362833611,0.0258875586886211,-0.0359206649281449,0.0442770805692614
0.92,-0.431705254380963,-0.461482240656996,-0.454945718680938,-0.427009510332282,0.023240464299975,-0.0344727303247144,0.0415750925064382
0.93,-0.438666567488752,-0.450308764873252,-0.45918484722732,-0.417906666868467,0.0205182797385676,-0.032402098004785,0.0383522588453641
0.94,-0.445556967645888,-0.438441600410524,-0.463286452021715,-0.408739486130253,0.0177294843758278,-0.0297021142802712,0.0345911868682041
0.95,-0.452376454852369,-0.425880747268811,-0.467258390347969,-0.399513836168139,0.0148819354956001,-0.026366911100672,0.0302768229027741
0.96,-0.459125029108197,-0.412626205448114,-0.471107943557354,-0.390234906316266,0.0119829144491569,-0.0223912991318479,0.0253960728363207
0.97,-0.465802690413371,-0.398677974948433,-0.474841861525546,-0.380907298127812,0.00903917111217495,-0.0177706768206211,0.019937491543776
0.98,-0.472409438767891,-0.384036055769768,-0.478466404784438,-0.371535102837039,0.0060569660165477,-0.0125009529327284,0.0138910280955696
0.99,-0.478945274171756,-0.368700447912118,-0.481987383992636,-0.36212196746821,0.00304210982087993,-0.00657848044390802,0.00724781602368427
1,-0.485410196624968,-0.352671151375484,-0.48541019660584,-0.352671151373477,-1.91286986250816e-11,-2.00633953895135e-12,1.92336296479567e-11
