xi,s1,s2
0,7.31663527331686e-26,6.48617667712344e-27
0.01,-0.00911941050934621,-0.0238052712108874
0.02,-0.0177521048554125,-0.045298926107819
0.03,-0.0260271050497331,-0.0647367335331288
0.04,-0.0340531383218535,-0.0823433347267226
0.05,-0.0419204745781039,-0.0983150565684879
0.06,-0.0497026829087119,-0.112822593834285
0.07,-0.0574583071432553,-0.126013560465524
0.08,-0.0652324604544545,-0.138014909852316
0.09,-0.0730583390103045,-0.148935224130217
0.1,-0.0809586546745469,-0.158866872490544
0.11,-0.0889469867554809,-0.167888038504278
0.12,-0.0970290528031148,-0.176064616459553
0.13,-0.105203898454657,-0.183451976712716
0.14,-0.113465006328347,-0.19009660005298
0.15,-0.121801323965624,-0.196037581080653
0.16,-0.130198210821639,-0.201308000598953
0.17,-0.138638304304104,-0.2059361670194
0.18,-0.14710230486048,-0.209946726780794
0.19,-0.155569680113508,-0.213361643781776
0.2,-0.164019288045076,-0.216201047826967
0.21,-0.172429919228431,-0.218483952086692
0.22,-0.180780758108722,-0.220228839570286
0.23,-0.189051763331893,-0.221454118612979
0.24,-0.197223967121907,-0.222178447376371
0.25,-0.205279693706316,-0.222420927362476
0.26,-0.213202696893721,-0.222201166132088
0.27,-0.220978222705736,-0.221539220098796
0.28,-0.228593028336912,-0.22045547499778
0.29,-0.236035388716089,-0.21897052162846
0.3,-0.243295096571782,-0.217105037742389
0.31,-0.250363456105143,-0.214879676267086
0.32,-0.257233270270524,-0.212314959865826
0.33,-0.263898821663616,-0.209431181833376
0.34,-0.270355847017176,-0.206248313327685
0.35,-0.276601505304345,-0.202785916937531
0.36,-0.28263433944955,-0.199063066586108
0.37,-0.28845423164699,-0.195098273770573
0.38,-0.294062352286711,-0.190909420137541
0.39,-0.299461102488267,-0.186513696394532
0.4,-0.30465405024197,-0.181927547557369
0.41,-0.30964586015772,-0.177166624533528
0.42,-0.314442216821428,-0.172245742041438
0.43,-0.319049741759023,-0.167178842865732
0.44,-0.323475904008045,-0.161978968448454
0.45,-0.327728924296822,-0.15665823581621
0.46,-0.331817672831242,-0.151227820843277
0.47,-0.335751560689102,-0.145697947850656
0.48,-0.339540424822046,-0.140077885541085
0.49,-0.343194406665095,-0.134375949269999
0.5,-0.346723824353756,-0.128599509652436
0.51,-0.350139038577429,-0.122755007496367
0.52,-0.353450313705366,-0.116847974518713
0.53,-0.356667682854511,-0.110883056963331
0.54,-0.359800825568541,-0.104864039240231
0.55,-0.362858959744373,-0.0987938670423012
0.56,-0.365850747834837,-0.0926746699300143
0.57,-0.368784217327527,-0.0865077833841085
0.58,-0.371666695499815,-0.0802937703262429
0.59,-0.374504758450041,-0.0740324421076299
0.6,-0.377304194404874,-0.0677228789656433
0.61,-0.380069981302839,-0.0613634499484015
0.62,-0.382806278654022,-0.0549518323073271
0.63,-0.385516433675937,-0.0484850303576821
0.64,-0.388203001705572,-0.041959393807079
0.65,-0.390867780887604,-0.035370635551967
0.66,-0.393511861138779,-0.0287138489420953
0.67,-0.396135687388467,-0.0219835245129506
0.68,-0.398739137095393,-0.015173566186172
0.69,-0.401321612040528,-0.00827730693794021
0.7,-0.403882144396159,-0.00128752393534341
0.71,-0.406419517071129,0.00580354685928114
0.72,-0.408932398332241,0.0130041966160301
0.73,-0.411419490701843,0.0203232300971412
0.74,-0.413879694131574,0.0277699526487239
0.75,-0.41631228345229,0.0353541577245155
0.76,-0.418717100027054,0.0430861151282575
0.77,-0.421094753440501,0.0509765706107215
0.78,-0.423446811148401,0.0590368131736738
0.79,-0.42577595401122,0.0672788664330669
0.8,-0.428086093545009,0.0757158146774874
0.81,-0.430382450816494,0.0843622638084564
0.82,-0.432671596982385,0.0932349371625816
0.83,-0.434961455472897,0.102353406215564
0.84,-0.437261265819481,0.111740956168054
0.85,-0.439581509126777,0.121425586413364
0.86,-0.441933795188767,0.131441145887032
0.87,-0.444330711249154,0.141828603298234
0.88,-0.446785632405947,0.152637452243059
0.89,-0.449312493660259,0.163927251199622
0.9,-0.451925523609322,0.175769298405046
0.91,-0.45463893978371,0.188248441614283
0.92,-0.457466605628782,0.201465022740796
0.93,-0.460421649130333,0.215536957379087
0.94,-0.463516043084456,0.230601949209087
0.95,-0.466760147011626,0.246819839282389
0.96,-0.470162210714986,0.264375090190337
0.97,-0.473727839482859,0.283479405113973
0.98,-0.477459420935459,0.304374481755825
0.99,-0.481355513515826,0.32733490115356
1,-0.485410196624968,0.352671151375484
