xi,s1,s2
0,-3.60117336674314e-26,-1.10060106658132e-27
0.01,-0.0266322599695306,-0.00945654087360689
0.02,-0.050232704050929,-0.0168847908258657
0.03,-0.0712420582667674,-0.0225795300465997
0.04,-0.0900594486435182,-0.0268086063263425
0.05,-0.107042401211554,-0.0298129350563377
0.06,-0.122506842005147,-0.031806499228539
0.07,-0.13672709706247,-0.0329763494356104
0.08,-0.149935892425597,-0.033482603870926
0.09,-0.1623243541405,-0.03345844832857
0.1,-0.174042008257052,-0.0330101362033367
0.11,-0.185196780829026,-0.0322169884907307
0.12,-0.195856027308561,-0.0311320040914575
0.13,-0.206062375821657,-0.0297912529279762
0.14,-0.215853915714739,-0.0282258452731248
0.15,-0.225266709468157,-0.0264634210063169
0.16,-0.234334792947496,-0.0245281497625424
0.17,-0.24309017540358,-0.0224407309323672
0.18,-0.251562839472471,-0.0202183936619332
0.19,-0.25978074117547,-0.0178748968529586
0.2,-0.267769809919116,-0.0154205291627374
0.21,-0.275553948495184,-0.01286210900414
0.22,-0.283155033080691,-0.0102029845456127
0.23,-0.290592918144885,-0.00744309404178095
0.24,-0.297885545852221,-0.00458031092196068
0.25,-0.305049123774983,-0.00161262873292937
0.26,-0.312098154652053,0.00146147298272652
0.27,-0.319045436421614,0.0046430282845751
0.28,-0.325902062221149,0.007932584834339
0.29,-0.332677420387436,0.0113302038958954
0.3,-0.339379194456556,0.014835460335276
0.31,-0.346013363163887,0.0184474426206672
0.32,-0.352584200444106,0.0221647528224098
0.33,-0.359094275431189,0.0259855066129991
0.34,-0.36554446734752,0.0299073376002064
0.35,-0.371934472664166,0.033927544924027
0.36,-0.378263857574761,0.0380433995541997
0.37,-0.384532291568411,0.0422522122660487
0.38,-0.390739548360256,0.0465513339113041
0.39,-0.396885505891474,0.0509381554181013
0.4,-0.402970146329279,0.0554101077909818
0.41,-0.408993556066923,0.0599646621108924
0.42,-0.414955925723693,0.0645993295351857
0.43,-0.420857550144915,0.06931166129762
0.44,-0.42669882840195,0.0740992487083593
0.45,-0.432480263303388,0.0789597233310812
0.46,-0.43820243379416,0.0838907669834953
0.47,-0.443865921430078,0.0888901383775258
0.48,-0.449471289041527,0.0939556808500121
0.49,-0.455019080533244,0.0990853224352514
0.5,-0.460509820884323,0.104277075864999
0.51,-0.465944016148208,0.10952903856847
0.52,-0.471322153452701,0.114839392672335
0.53,-0.476644700999955,0.120206405000725
0.54,-0.481912108066482,0.125628427075229
0.55,-0.487124805003142,0.131103895114893
0.56,-0.492283203380151,0.136631329897676
0.57,-0.497387711438788,0.142209321995981
0.58,-0.502438787338401,0.147836480897941
0.59,-0.507436959144909,0.153511415907947
0.6,-0.512382825184804,0.159232735808394
0.61,-0.517277054045145,0.164999048859684
0.62,-0.522120384573562,0.170808962800225
0.63,-0.526913625878254,0.176661084846431
0.64,-0.53165765732799,0.182554021692723
0.65,-0.536353428552108,0.188486379511526
0.66,-0.541001959440517,0.194456763953274
0.67,-0.545604340514452,0.2004637810248
0.68,-0.550161825987166,0.206506257566695
0.69,-0.554676253093151,0.212584234718987
0.7,-0.559150244152178,0.21869944664687
0.71,-0.563587212501453,0.224855334595037
0.72,-0.567991362495616,0.231057046887681
0.73,-0.572367689506741,0.237311438928493
0.74,-0.576721979924335,0.243627073200664
0.75,-0.581060811155342,0.250014219266884
0.76,-0.585391551624139,0.256484853769342
0.77,-0.589722360772536,0.263052660429727
0.78,-0.594062189033404,0.269733030061114
0.79,-0.598420753826708,0.276543071387611
0.8,-0.602808396213295,0.283501675656822
0.81,-0.607235992648476,0.290629556416401
0.82,-0.61171495102396,0.297949251298121
0.83,-0.616257210667846,0.305485122017886
0.84,-0.620875242344632,0.313263354375722
0.85,-0.625582048255206,0.321311958255779
0.86,-0.630391162036853,0.329660767626334
0.87,-0.635316648763251,0.338341440539788
0.88,-0.640373104944473,0.347387459132667
0.89,-0.645575658635092,0.35683412992455
0.9,-0.650941049949451,0.366721571594361
0.91,-0.656496315291012,0.377118728092674
0.92,-0.66228560243622,0.388142213304578
0.93,-0.668370613334957,0.399957535455053
0.94,-0.674830604110548,0.412779097108966
0.95,-0.681762385059755,0.426870195171074
0.96,-0.689280320652778,0.442543020886022
0.97,-0.69751632953326,0.460158659838344
0.98,-0.70661988451828,0.480127091952463
0.99,-0.716758012598358,0.50290719149269
1,-0.728115294937453,0.529006727063226
