xi,sx,sy,cx,cy,ex,ey,ne
0,1.18458776389064e-26,3.48209300240372e-26,0,0,1.18458776389064e-26,3.48209300240372e-26,3.67807284426891e-26
0.01,0.00219252859810489,-0.0233063785748257,0.00211666628430516,-0.0097996656857615,7.58623137997313e-05,-0.0135067128890642,0.0135069259329526
0.02,0.00640006267720131,-0.0435947312980271,0.00436446507654306,-0.0195685253637571,0.00203559760065825,-0.02402620593427,0.0241122837820841
0.03,0.0123201407446624,-0.0610805234472419,0.00676024818561099,-0.0293005811493452,0.00555989255905142,-0.0317799422978967,0.0322626275700824
0.04,0.0196560308884697,-0.0759564955199441,0.00932421005357411,-0.0389881085668203,0.0103318208348956,-0.0369683869531238,0.0383849990970467
0.05,0.028122470884747,-0.0883996520155941,0.0120807872934325,-0.0486210021389366,0.0160416835913144,-0.0397786498766575,0.0428914513446858
0.06,0.0374501600429614,-0.0985763374051836,0.0150598587271273,-0.0581858080277904,0.0223903013158341,-0.0403905293773932,0.0461813864711737
0.07,0.0473891463380626,-0.106645751651774,0.0182983584912957,-0.0676642610604596,0.0290907878467669,-0.0389814905913146,0.048639804134745
0.08,0.0577112426052235,-0.112762214040335,0.0218424516792069,-0.0770310174494492,0.0358687909260166,-0.0357311965908856,0.0506289301912534
0.09,0.0682115961306538,-0.117076443867581,0.0257504524097016,-0.0862500499851152,0.0424611437209522,-0.0308263938824663,0.0524710900009549
0.1,0.0787095268595224,-0.119736089603279,0.030096640857066,-0.0952687690440666,0.0486128860024564,-0.0244673205592122,0.0544229956988318
0.11,0.0890487406576547,-0.120885704334221,0.034975906123284,-0.104008218128207,0.0540728345343707,-0.0168774862060139,0.0566455733064431
0.12,0.0990970156057038,-0.120666334511524,0.040508250150186,-0.11234651656378,0.0585887654555178,-0.00831981794774377,0.0591765393402257
0.13,0.108745451171249,-0.11921486111159,0.0468393784904175,-0.120091262871768,0.0619060726808315,0.000876401760178058,0.0619122759621194
0.14,0.117907362294083,-0.116663207161796,0.0541259995667642,-0.126937099780788,0.0637813627273192,0.0102738926189919,0.0646035223567604
0.15,0.126516892931125,-0.113137503044257,0.0624789644279466,-0.132417203101581,0.0640379285031779,0.0192797000573242,0.0668772242342527
0.16,0.134527416438268,-0.108757280945612,0.0718290795426924,-0.135906953175269,0.0626983368955757,0.0271496722296569,0.068324125692532
0.17,0.1419097833154,-0.103634752138257,0.081760706872984,-0.136811691485181,0.0601490764424158,0.0331769393469241,0.0686922171814614
0.18,0.148650470306041,-0.0978742053295385,0.0915585317145679,-0.13494233663484,0.0570919385914733,0.0370681313053015,0.0680700801424504
0.19,0.154749678623027,-0.0915715509707332,0.100583064254411,-0.130672326092666,0.054166614368616,0.0391007751219329,0.0668048855046869
0.2,0.160219423164546,-0.0848140250478035,0.108553772366891,-0.124644595961461,0.0516656507976546,0.0398305709136571,0.0652365990196688
0.21,0.165081648989125,-0.077680056351667,0.115485551408077,-0.117436774626416,0.0495960975810484,0.0397567182747487,0.063563901258864
0.22,0.169366406032055,-0.0702392934176112,0.121516270960684,-0.109454148479147,0.0478501350713706,0.0392148550615355,0.061866309764246
0.23,0.173110108067615,-0.0625527811022417,0.126802282107294,-0.100956397547765,0.0463078259603214,0.0384036164455229,0.0601602235805873
0.24,0.176353897249668,-0.0546732720025991,0.131480714295788,-0.092106938177805,0.0448731829538805,0.0374336661752059,0.0584369909537545
0.25,0.179142131195978,-0.0466456544864694,0.135662285403491,-0.0830099937276313,0.043479845792487,0.0363643392411619,0.0566821149798132
0.26,0.181521005517384,-0.0385074768661089,0.139434036480655,-0.0737337302169195,0.0420869690367291,0.0352262533508106,0.0548835302056463
0.27,0.183537320929999,-0.0302895460802484,0.142864107270406,-0.0643240087913013,0.0406732136595929,0.0340344627110528,0.0530344695592304
0.28,0.185237400625237,-0.0220165790219963,0.146006128447673,-0.0548125506200221,0.0392312721775635,0.0327959715980258,0.0511338290149348
0.29,0.186666160407056,-0.0137078852337704,0.148902709874138,-0.0452218683460197,0.0377634505329183,0.0315139831122493,0.0491854584989436
0.3,0.187866331236614,-0.00537806095531362,0.151588074933756,-0.0355683167431815,0.0362782563028578,0.0301902557878679,0.0471970700882241
0.31,0.188877831249938,0.00296232367216074,0.154090017852502,-0.0258640290297499,0.0347878133974365,0.0288263527019107,0.0451790944029406
0.32,0.189737282032528,0.0113060602029424,0.156431355632906,-0.0161181773432211,0.0333059263996215,0.0274242375461636,0.0431436384456088
0.33,0.190477661944325,0.0196486737090825,0.158631010731906,-0.00633781312114884,0.0318466512124192,0.0259864868302313,0.041103609223805
0.34,0.191128087587583,0.0279878415549993,0.1607048252443,0.00347156002396766,0.030423262343283,0.0245162815310317,0.0390720226212699
0.35,0.191713713097134,0.0363228671197073,0.162666179254347,0.0133055877240341,0.0290475338427865,0.0230172793956731,0.0370614944804753
0.36,0.192255735805642,0.0446542138241477,0.164526465348319,0.0231607822990003,0.0277292704573228,0.0214934315251474,0.0350838999944641
0.37,0.192771495992695,0.0529831023959543,0.166295456530467,0.0330343189875824,0.0264760394622277,0.0199487834083719,0.0331501828815404
0.38,0.193274657858079,0.0613111721681333,0.167981594368417,0.0429238866712962,0.0252930634896615,0.0183872854968371,0.031270294668171
0.39,0.193775458551273,0.0696402053788676,0.169592216844205,0.0528275769333987,0.0241832417070685,0.0168126284454688,0.0294532452321962
0.4,0.194281012022568,0.0779719119046649,0.171133740179414,0.0627438005107162,0.0231472718431533,0.0152281113939488,0.0277072476151521
0.41,0.194795654617079,0.0863077706013309,0.17261180518739,0.0726712236042151,0.0221838494296891,0.0136365469971158,0.0260399421950907
0.42,0.195321319692295,0.0946489224295129,0.174031396032647,0.0826087187798265,0.0212899236596484,0.0120402036496864,0.024458686664651
0.43,0.195857929083358,0.102996109786619,0.175396937337515,0.0925553267220751,0.0204609917458434,0.0104407830645438,0.0229708975493849
0.44,0.196403789949058,0.111349655937519,0.176712374154809,0.102510226153563,0.0196914157942489,0.00883942978395597,0.0215844243584924
0.45,0.196955986386296,0.119709478115372,0.177981238274612,0.112472709964432,0.0189747481116838,0.00723676815093942,0.0203079265109045
0.46,0.197510756182426,0.128075127733933,0.179206703549382,0.122442166111509,0.0183040526330442,0.00563296162242434,0.0191512036027232
0.47,0.198063844164327,0.136445851196607,0.180391632331753,0.132418062214982,0.0176722118325734,0.00402778898162462,0.0181254008269015
0.48,0.198610824781078,0.144820664987997,0.181538614671692,0.14239993304639,0.0170722101093864,0.00242073194160713,0.0172429783144372
0.49,0.199147387804684,0.153198439073665,0.182650001577169,0.152387370295893,0.0164973862275144,0.000811068777771567,0.0165173116729708
0.5,0.199669582331154,0.161577983095871,0.183727933378424,0.162380014150088,0.0159416489527299,-0.000802031054217583,0.0159618114618612
0.51,0.200174015593407,0.169958130420139,0.184774364030724,0.172377546318337,0.0153996515626827,-0.0024194158981983,0.0155885484103072
0.52,0.200658004438668,0.178337815742219,0.185791082030087,0.182379684225803,0.0148669224085811,-0.00404186848358365,0.015406559730886
0.53,0.201119678657221,0.186716142690261,0.186779728489988,0.192386176152189,0.0143399501672327,-0.0056700334619279,0.0154202286058962
0.54,0.201558036657406,0.195092438635508,0.187741812826949,0.202396797141663,0.0138162238304568,-0.00730435850615468,0.0156282338771761
0.55,0.201972955244453,0.203466294739325,0.188678726422944,0.212411345545214,0.0132942288215084,-0.00894505080588917,0.0160234345219295
0.56,0.202365156459036,0.211837590097661,0.189591754568507,0.222429640084448,0.0127734018905287,-0.0105920499867872,0.0165937132306052
0.57,0.202736135546167,0.220206499678954,0.190482086938698,0.232451517347518,0.012254048607469,-0.0122450176685639,0.0173234570735074
0.58,0.203088055137036,0.228573486570635,0.191350826812142,0.242476829644892,0.0117372283248939,-0.0139033430742578,0.0181952047911312
0.59,0.203423611616646,0.236939279835715,0.192198999209199,0.252505443166154,0.0112246124074466,-0.0155661633304383,0.0191910751269252
0.6,0.203745880399276,0.245304840017124,0.193027558097283,0.262537236389735,0.0107183223019929,-0.0172323963726113,0.0202937901268389
0.61,0.20405814742299,0.25367131499624,0.193837392788342,0.272572098706067,0.0102207546346471,-0.0189007837098271,0.0214872857789746
0.62,0.204363734584292,0.262039989496332,0.194629333634453,0.282609929221503,0.00973440094983874,-0.0205699397251709,0.0227569985312076
0.63,0.2046658270456,0.270412232003993,0.195404157111644,0.292650635715963,0.00926166993395663,-0.0222384037119694,0.0240899383482418
0.64,0.204967310342283,0.278789443245057,0.196162590368935,0.302694133731776,0.00880471997334834,-0.0239046904867182,0.0254746407447657
0.65,0.205270624973428,0.287173010578516,0.196905315308496,0.312740345774853,0.00836530966493224,-0.025567335196337,0.026901060106101
0.66,0.205577645662238,0.295564272745588,0.197632972253603,0.322789200612408,0.00794467340863494,-0.0272249278668191,0.0283604395756373
0.67,0.205889591698721,0.303964499313881,0.198346163253238,0.332840632653868,0.00754342844548309,-0.0288761333399871,0.029845173636299
0.68,0.206206973710157,0.312374888871487,0.199045455065582,0.342894581403748,0.00716151864457434,-0.0305196925322614,0.0313486679391702
0.69,0.206529580824621,0.320796589535698,0.19973138185704,0.352950990976887,0.00679819896758133,-0.0321544014411896,0.0328651949825952
0.7,0.206856510485398,0.329230744633688,0.200404447648657,0.363009809667955,0.00645206283674085,-0.0337790650342672,0.0343897419216618
0.71,0.207186241153761,0.337678565505802,0.201065128537726,0.373070989568251,0.00612111261603487,-0.0353924240624484,0.0359178465483992
0.72,0.207516745876644,0.346141432354348,0.201713874718858,0.383134486223859,0.00580287115778577,-0.0369930538695108,0.0374454182546595
0.73,0.207845642307165,0.354621023032952,0.202351112325824,0.393200258330057,0.00549452998134098,-0.0385792352971046,0.0389685418745071
0.74,0.208170372372653,0.363119468774832,0.202977245112863,0.403268267457556,0.00519312725979035,-0.0401487986827243,0.0404832632874661
0.75,0.208488402510221,0.371639535224625,0.203592655991925,0.413338477806796,0.00489574651829588,-0.0416989425821715,0.0419853563334008
0.76,0.208797433357519,0.380184826899568,0.204197708440397,0.423410855986981,0.00459972491712118,-0.0432260290874128,0.0434700708531634
0.77,0.209095606119512,0.388760013493714,0.204792747792153,0.433485370817011,0.00430285832735977,-0.0447253573232967,0.0449318614958462
0.78,0.209381691654507,0.397371077385381,0.205378102423327,0.44356199314582,0.00400358923118033,-0.0461909157604387,0.0463640962978894
0.79,0.209655247757575,0.406025583445049,0.20595408484294,0.453640695689944,0.00370116291463529,-0.0476151122448953,0.0477587428751496
0.8,0.209916730290585,0.41473297490028,0.206520992697364,0.463721452886436,0.00339573759322073,-0.0489884779861561,0.0491060282368888
0.81,0.210167544838589,0.42350490272786,0.207079109696666,0.473804240759443,0.00308843514192295,-0.0502993380315837,0.0503940655041979
0.82,0.21041002758592,0.432355600943103,0.207628706469994,0.483889036799015,0.0027813211159266,-0.0515334358559121,0.0516084368903506
0.83,0.210647347225415,0.441302326373984,0.208170041356423,0.493975819850831,0.00247730586899245,-0.052673493476847,0.052731716826062
0.84,0.210883324064213,0.450365889175369,0.208703361137005,0.504064570015736,0.00217996292720762,-0.0536986808403671,0.0537429117406156
0.85,0.211122168193065,0.45957130958796,0.209228901713191,0.514155268558066,0.00189326647987348,-0.0545839589701058,0.0546167834535686
0.86,0.21136814576644,0.468948647409544,0.209746888736256,0.524247897821897,0.00162125703018354,-0.0552992504123531,0.0553230112207032
0.87,0.211625191221483,0.478534063454578,0.210257538191916,0.534342441154413,0.00136765302956623,-0.0558083776998346,0.0558251331955122
0.88,0.211896493768478,0.488371187064004,0.210761056943904,0.544438882835708,0.00113543682457387,-0.0560676957717034,0.0560791915591771
0.89,0.212184098837402,0.498512880622241,0.211257643239906,0.5545372080144,0.000926455597496628,-0.0560243273921583,0.056031987111987
0.9,0.212488579487869,0.509023511174522,0.211747487182942,0.564637402648499,0.000741092304927637,-0.0556138914739776,0.0556188290301385
0.91,0.212808849206771,0.519981860746923,0.212230771170985,0.574739453451043,0.000578078035785995,-0.0547575927041198,0.0547606440152573
0.92,0.213142206152649,0.531484830985526,0.212707670307346,0.584843347840046,0.000434535845303674,-0.0533585168545201,0.0533602861903397
0.93,0.213484719881774,0.543652124381941,0.213178352784118,0.594949073892383,0.00030636709765583,-0.0512969495104424,0.0512978643792839
0.94,0.213832095031553,0.556632113771894,0.213642980240791,0.605056620301245,0.000189114790762862,-0.0484245065293515,0.0484248758079491
0.95,0.214181172465682,0.570609144113482,0.214101708099915,0.615165976336839,7.94643657668626e-05,-0.0445568322233579,0.0445569030832024
0.96,0.21453225712586,0.585812545904046,0.214554685881575,0.625277131810066,-2.24287557146485e-05,-0.039464585906021,0.0394645922794445
0.97,0.214892493410458,0.602527678111149,0.215002057498239,0.635390077038901,-0.000109564087781816,-0.0328623989277521,0.0328625815719954
0.98,0.21528054343458,0.621109360305838,0.215443961531449,0.64550480281725,-0.000163418096869067,-0.0243954425114121,0.0243959898508341
0.99,0.215732861142173,0.641998098927054,0.21588053149166,0.655621300386078,-0.000147670349486623,-0.0136232014590243,0.0136240017808748
1,0.216311896062463,0.665739561406607,0.216311896062463,0.665739561406607,-1.38777878078145e-16,0,1.38777878078145e-16
