xi,s1,s2
0,1.40328880153915e-27,-3.53435901261266e-26
0.01,0.00110625527970916,-0.0176237122552082
0.02,0.00210004609309351,-0.0338264464225308
0.03,0.00301629445300638,-0.0488259969269557
0.04,0.00387979602495099,-0.0628099991272766
0.05,0.00470760763202487,-0.0759396472026888
0.06,0.00551100998252236,-0.0883530126727034
0.07,0.00629710073424478,-0.100167999544253
0.08,0.00707006804776897,-0.111484969534153
0.09,0.00783219009869025,-0.122389068394048
0.1,0.00858460160869995,-0.132952282065412
0.11,0.00932786430980018,-0.143235249211066
0.12,0.0100623743675147,-0.153288854603718
0.13,0.0107886361501422,-0.163155625898243
0.14,0.011507428334436,-0.172870954469564
0.15,0.012219885176095,-0.182464159258959
0.16,0.0129275128386361,-0.191959410935273
0.17,0.0136321579591049,-0.201376532140696
0.18,0.0143359431261807,-0.210731688150379
0.19,0.0150411816480711,-0.220037980927998
0.2,0.0157502818866779,-0.229305958302374
0.21,0.0164656495233712,-0.238544048820212
0.22,0.017189594392853,-0.24775893174384
0.23,0.0179242469675323,-0.256955850657336
0.24,0.0186714881881026,-0.266138878216529
0.25,0.0194328951091093,-0.275311138724852
0.26,0.0202097037537534,-0.284474994434833
0.27,0.0210027896425018,-0.293632200760965
0.28,0.0218126656677914,-0.302784034940616
0.29,0.0226394963247325,-0.311931402092506
0.3,0.0234831267677619,-0.321074922093802
0.31,0.0243431247381757,-0.330215000224033
0.32,0.025218833089915,-0.33935188410363
0.33,0.0261094304233861,-0.348485709083787
0.34,0.0270139972120056,-0.357616533919439
0.35,0.0279315847660703,-0.36674436827524
0.36,0.0288612844159895,-0.375869193372452
0.37,0.0298022944044002,-0.384990976879399
0.38,0.0307539821467208,-0.394109682976526
0.39,0.0317159397448193,-0.403225278385943
0.4,0.0326880309111799,-0.412337735041526
0.41,0.0336704277737724,-0.421447029986031
0.42,0.0346636363772799,-0.430553143013099
0.43,0.035668510066931,-0.439656052521422
0.44,0.036686250329444,-0.448755730012428
0.45,0.0377183950640187,-0.457852133638664
0.46,0.0387667946574535,-0.466945201194299
0.47,0.0398335766338005,-0.47603484292881
0.48,0.0409211000330581,-0.485120934556781
0.49,0.0420319010377159,-0.494203310827666
0.5,0.0431686317030635,-0.503281760006243
0.51,0.0443339939495412,-0.512356019594199
0.52,0.0455306712355863,-0.521425773592574
0.53,0.0467612605400285,-0.530490651560771
0.54,0.0480282074377653,-0.539550229667627
0.55,0.0493337471477837,-0.548604033852408
0.56,0.0506798544681134,-0.55765154511836
0.57,0.0520682054885386,-0.566692206868833
0.58,0.0535001538895166,-0.575725434066507
0.59,0.05497672449539,-0.584750623850098
0.6,0.0564986265523098,-0.593767167080504
0.61,0.0580662889469363,-0.602774460110068
0.62,0.0596799192716237,-0.61177191587472
0.63,0.0613395882760707,-0.620758973199721
0.64,0.0630453408249773,-0.629735102985716
0.65,0.0647973340067497,-0.638699809703411
0.66,0.0665960025103909,-0.647652626372492
0.67,0.0684422508070488,-0.656593100934009
0.68,0.0703376710399286,-0.665520771645524
0.69,0.0722847848420601,-0.67443512883529
0.7,0.0742873065663909,-0.683335560045966
0.71,0.0763504246275137,-0.69222127528016
0.72,0.0784810968196791,-0.701091208729811
0.73,0.080688354592239,-0.709943893029477
0.74,0.0829836103319778,-0.718777301720205
0.75,0.0853809607225567,-0.727588655246337
0.76,0.0878974782251774,-0.736374185432535
0.77,0.0905534816522243,-0.745128853003004
0.78,0.0933727756877098,-0.753846012309538
0.79,0.0963828480454831,-0.762517017030125
0.8,0.0996150117490272,-0.771130760185598
0.81,0.1031044787659,-0.779673141398763
0.82,0.106890349936136,-0.788126453888696
0.83,0.111015504797878,-0.796468683253034
0.84,0.11552637353575,-0.804672709643299
0.85,0.120472571858781,-0.812705404483015
0.86,0.12590637815554,-0.820526612415896
0.87,0.131882030775348,-0.828088008702137
0.88,0.138454821746527,-0.835331821805069
0.89,0.145679961666393,-0.842189410428563
0.9,0.153611188883607,-0.848579683777975
0.91,0.16229909444239,-0.85440735332429
0.92,0.171789132570486,-0.859561003853069
0.93,0.182119284769364,-0.863910971076909
0.94,0.193317343806599,-0.867307012582894
0.95,0.205397782117344,-0.869575758375316
0.96,0.218358167294891,-0.870517926758977
0.97,0.232175085490285,-0.869905290790183
0.98,0.246799531648307,-0.867477380001296
0.99,0.262151723582659,-0.862937901580922
1,0.278115294937453,-0.855950864665638
