xi,s1,s2
0,1.20339700705192e-26,-2.51027097832802e-26
0.01,-0.00246838105119701,-0.0178739515530835
0.02,-0.00456863705322397,-0.0352120077929556
0.03,-0.00632043013255797,-0.0520279728787316
0.04,-0.0077434224156761,-0.0683356509695269
0.05,-0.00885727602905546,-0.0841488462244567
0.06,-0.00968165309917315,-0.0994813628026366
0.07,-0.0102362157525063,-0.114347004863182
0.08,-0.0105406261155319,-0.128759576565208
0.09,-0.0106145463147271,-0.14273288206783
0.1,-0.0104776384765691,-0.156280725530163
0.11,-0.0101495647275349,-0.169416911111324
0.12,-0.00964998719410155,-0.182155242970426
0.13,-0.00899856800274622,-0.194509525266586
0.14,-0.00821496927994598,-0.206493562158919
0.15,-0.00731885315217793,-0.21812115780654
0.16,-0.00632988174591917,-0.229406116368565
0.17,-0.00526771718764679,-0.240362242004109
0.18,-0.0041520216038379,-0.251003338872287
0.19,-0.00300245712096957,-0.261343211132215
0.2,-0.00183868586551891,-0.271395662943008
0.21,-0.000680369963963027,-0.281174498463782
0.22,0.000452828457220998,-0.290693521853651
0.23,0.00154124727155607,-0.299966537271731
0.24,0.00256522435256508,-0.309007348877138
0.25,0.00350509757377095,-0.317829760828987
0.26,0.00434120480869657,-0.326447577286393
0.27,0.00505388393086485,-0.334874602408472
0.28,0.0056234728137987,-0.343124640354338
0.29,0.00603030933102101,-0.351211495283109
0.3,0.00625473135605469,-0.359148971353897
0.31,0.00627707676242264,-0.36695087272582
0.32,0.00607768342364778,-0.374631003557993
0.33,0.005636889213253,-0.38220316800953
0.34,0.00493618595252306,-0.38968012331786
0.35,0.0039704801054743,-0.397062456255808
0.36,0.00274333274433694,-0.404342901683545
0.37,0.00125844918481149,-0.411514063596036
0.38,-0.000480465257401601,-0.418568545988244
0.39,-0.00246970526660185,-0.425498952855131
0.4,-0.00470556552708878,-0.432297888191661
0.41,-0.00718434072316188,-0.438957955992797
0.42,-0.00990232553912073,-0.445471760253501
0.43,-0.0128558146592648,-0.451831904968737
0.44,-0.0160411027678937,-0.458030994133468
0.45,-0.0194544845493069,-0.464061631742657
0.46,-0.0230922546878039,-0.469916421791267
0.47,-0.0269507078676842,-0.475587968274261
0.48,-0.0310261387732474,-0.481068875186603
0.49,-0.0353148420887929,-0.486351746523254
0.5,-0.0398131124986205,-0.491429186279179
0.51,-0.0445172446870294,-0.49629379844934
0.52,-0.0494235333383193,-0.500938187028701
0.53,-0.0545282731367897,-0.505354956012223
0.54,-0.0598277587667401,-0.509536709394872
0.55,-0.06531828491247,-0.513476051171609
0.56,-0.070996146258279,-0.517165585337398
0.57,-0.0768576374884665,-0.520597915887201
0.58,-0.0828990532873322,-0.523765646815982
0.59,-0.0891166883391754,-0.526661382118704
0.6,-0.0955068373282959,-0.52927772579033
0.61,-0.102065794938993,-0.531607281825823
0.62,-0.108789855855566,-0.533642654220146
0.63,-0.115675314762315,-0.535376446968262
0.64,-0.12271846634354,-0.536801264065134
0.65,-0.129915605283539,-0.537909709505725
0.66,-0.137263026266612,-0.538694387284999
0.67,-0.144756978448355,-0.539147875366346
0.68,-0.152390979262122,-0.539261189818889
0.69,-0.16015431197179,-0.539022925775626
0.7,-0.168035895611607,-0.53842147011699
0.71,-0.176024649215819,-0.537445209723411
0.72,-0.184109491818673,-0.53608253147532
0.73,-0.192279342454414,-0.534321822253148
0.74,-0.200523120157289,-0.532151468937325
0.75,-0.208829743961545,-0.529559858408282
0.76,-0.217188132901428,-0.526535377546451
0.77,-0.225587206011185,-0.523066413232263
0.78,-0.234015882325062,-0.519141352346147
0.79,-0.242463080877305,-0.514748581768536
0.8,-0.250917720702161,-0.50987648837986
0.81,-0.259368720833876,-0.504513459060549
0.82,-0.267805000306696,-0.498647880691035
0.83,-0.276215478154869,-0.492268140151749
0.84,-0.284589073412641,-0.485362624323121
0.85,-0.292914705114257,-0.477919720085583
0.86,-0.301181292293965,-0.469927814319565
0.87,-0.309377753986011,-0.461375293905498
0.88,-0.31749300922464,-0.452250545723813
0.89,-0.325515977044101,-0.442541956654941
0.9,-0.333435576478639,-0.432237913579313
0.91,-0.3412407265625,-0.42132680337736
0.92,-0.348920346329932,-0.409797012929512
0.93,-0.356463354815179,-0.397636929116201
0.94,-0.36385867105249,-0.384834938817857
0.95,-0.37109521407611,-0.371379428914911
0.96,-0.378161902920285,-0.357258786287794
0.97,-0.385047656619263,-0.342461397816938
0.98,-0.391741394207289,-0.326975650382772
0.99,-0.398232034718611,-0.310789930865728
1,-0.404508497187474,-0.293892626146237
