xi,s1,s2
0,0,0
0.01,-0.00342281261344179,-0.00945081609464611
0.02,-0.00694379182188385,-0.0188639514633845
0.03,-0.0105683350810262,-0.0282361467540608
0.04,-0.0143022530494735,-0.0375637549424132
0.05,-0.0181518062591194,-0.0468426847941776
0.06,-0.0221237445856411,-0.0560683347561763
0.07,-0.0262253493803106,-0.0652355154942685
0.08,-0.0304644779269728,-0.0743383589579529
0.09,-0.0348496095970565,-0.0833702114591435
0.1,-0.0393898926533295,-0.0923235078060636
0.11,-0.0440951900484252,-0.101189623039223
0.12,-0.0489761217077184,-0.10995869779476
0.13,-0.054044099585894,-0.118619432812695
0.14,-0.0593113501231957,-0.127158847691753
0.15,-0.0647909164512916,-0.135561998804738
0.16,-0.0704966296328046,-0.143811651556327
0.17,-0.0764430341727797,-0.151887903253786
0.18,-0.0826452478511387,-0.159767755335384
0.19,-0.0891187295398717,-0.167424638399996
0.2,-0.0958789213068777,-0.174827901585965
0.21,-0.102940723541581,-0.181942290900664
0.22,-0.11031775582803,-0.188727460878101
0.23,-0.118021355190372,-0.195137591987212
0.24,-0.126059272711668,-0.201121222783474
0.25,-0.134434057403548,-0.206621447879106
0.26,-0.143141171997382,-0.211576671163978
0.27,-0.152166976050529,-0.215922119729669
0.28,-0.161486834193798,-0.219592288914048
0.29,-0.171063737041048,-0.222524370476874
0.3,-0.18084790569846,-0.22466249691487
0.31,-0.190777813557928,-0.225962342161968
0.32,-0.200782842326445,-0.226395344758661
0.33,-0.210787406454012,-0.225951704321954
0.34,-0.220715951715848,-0.224641460174949
0.35,-0.230497948126109,-0.222493386742897
0.36,-0.240071999278387,-0.219551977394238
0.37,-0.24938847861062,-0.215873211569629
0.38,-0.258410532031724,-0.211519954463124
0.39,-0.267113667626199,-0.206557720494332
0.4,-0.275484367581824,-0.201051256624093
0.41,-0.283518192832439,-0.195062109283091
0.42,-0.291217766499954,-0.1886471208624
0.43,-0.298590892352064,-0.18185768448259
0.44,-0.305648942352601,-0.174739551543735
0.45,-0.312405557095063,-0.167333003004952
0.46,-0.318875647509203,-0.159673233834497
0.47,-0.325074658635046,-0.151790842126518
0.48,-0.331018047053508,-0.143712350855754
0.49,-0.336720924751716,-0.135460718180472
0.5,-0.34219782824568,-0.12705581188767
0.51,-0.347462579355332,-0.118514836557239
0.52,-0.352528211380027,-0.109852710076414
0.53,-0.357406940793907,-0.101082390801159
0.54,-0.3621101697552,-0.0922151591141508
0.55,-0.366648508756273,-0.0832608582047623
0.56,-0.371031811796405,-0.0742280991569446
0.57,-0.375269218726847,-0.0651244352393058
0.58,-0.379369201074609,-0.0559565098740208
0.59,-0.383339608846808,-0.0467301822529101
0.6,-0.387187716670325,-0.0374506340474969
0.61,-0.390920268223573,-0.0281224601663607
0.62,-0.394543518337491,-0.0187497460671606
0.63,-0.398063272432507,-0.00933613373911529
0.64,-0.401484923154617,0.000115121865739114
0.65,-0.40481348420411,0.00960110446135146
0.66,-0.408053621434384,0.0191191948676438
0.67,-0.411209681349815,0.0286670352160511
0.68,-0.414285717160845,0.0382424980448416
0.69,-0.417285512568398,0.0478436595500798
0.7,-0.420212603453487,0.0574687763760641
0.71,-0.423070297645033,0.0671162654272805
0.72,-0.425861692931859,0.0767846862657141
0.73,-0.428589693475347,0.0864727257255211
0.74,-0.43125702476849,0.0961791844339527
0.75,-0.433866247275822,0.10590296497494
0.76,-0.436419768877482,0.11564306147153
0.77,-0.438919856229862,0.125398550396702
0.78,-0.441368645144975,0.135168582450123
0.79,-0.443768150081101,0.144952375361962
0.8,-0.446120272828423,0.154749207504783
0.81,-0.448426810465196,0.16455841221135
0.82,-0.450689462652631,0.174379372710405
0.83,-0.452909838329925,0.184211517604583
0.84,-0.455089461864818,0.19405431682491
0.85,-0.457229778709558,0.203907278005087
0.86,-0.459332160607238,0.213769943226283
0.87,-0.461397910389042,0.223641886089531
0.88,-0.463428266398938,0.233522709078384
0.89,-0.465424406578795,0.24341204117917
0.9,-0.467387452243701,0.253309535730285
0.91,-0.469318471574364,0.263214868475502
0.92,-0.471218482850921,0.273127735799272
0.93,-0.473088457450148,0.283047853124694
0.94,-0.474929322625988,0.292974953457074
0.95,-0.476741964091458,0.302908786058007
0.96,-0.478527228418296,0.312849115236667
0.97,-0.480285925269231,0.322795719246486
0.98,-0.48201882947637,0.332748389276751
0.99,-0.483726682977998,0.342706928529794
1,-0.485410196624968,0.352671151375484
