xi,s1,s2
0,0,0
0.01,-0.00629571360810997,-0.00807636152928641
0.02,-0.0126226143874223,-0.0161267721467242
0.03,-0.0189809214504914,-0.0241508581081572
0.04,-0.025370854228403,-0.0321482392153127
0.05,-0.0317926323980143,-0.0401185287122182
0.06,-0.0382464758056261,-0.0480613331810168
0.07,-0.0447326043869566,-0.0559762524372507
0.08,-0.0512512380832979,-0.0638628794246954
0.09,-0.0578025967537243,-0.0717208001098305
0.1,-0.0643869000832227,-0.0795495933760385
0.11,-0.0710043674866165,-0.0873488309176327
0.12,-0.0776552180081453,-0.0951180771338202
0.13,-0.0843396702165662,-0.102856889022715
0.14,-0.0910579420956372,-0.110564816075519
0.15,-0.0978102509298469,-0.118241400171008
0.16,-0.104596813185243,-0.125886175470459
0.17,-0.111417844385226,-0.133498668313155
0.18,-0.118273558981151,-0.141078397112645
0.19,-0.125164170217613,-0.148624872253912
0.2,-0.132089889992253,-0.156137595991617
0.21,-0.139050928709947,-0.163616062349635
0.22,-0.146047495131234,-0.17105975702204
0.23,-0.153079796214844,-0.17846815727579
0.24,-0.160148036954166,-0.185840731855293
0.25,-0.167252420207535,-0.193176940889117
0.26,-0.174393146522182,-0.200476235799072
0.27,-0.181570413951722,-0.20773805921192
0.28,-0.188784417867032,-0.214961844873992
0.29,-0.1960353507604,-0.22214701756899
0.3,-0.203323402042817,-0.22929299303927
0.31,-0.21064875783428,-0.236399177910922
0.32,-0.218011600747001,-0.243464969622963
0.33,-0.225412109661409,-0.250489756360993
0.34,-0.23285045949484,-0.257472916995669
0.35,-0.240326820962825,-0.264413821026347
0.36,-0.247841360332886,-0.271311828530313
0.37,-0.25539423917077,-0.278166290117964
0.38,-0.26298561407905,-0.284976546894383
0.39,-0.270615636428054,-0.291741930427729
0.4,-0.278284452079064,-0.298461762724885
0.41,-0.285992201099784,-0.305135356214835
0.42,-0.293739017472048,-0.311762013740239
0.43,-0.301525028791789,-0.318341028557702
0.44,-0.309350355961295,-0.324871684347247
0.45,-0.317215112873798,-0.331353255231508
0.46,-0.325119406090462,-0.337785005805182
0.47,-0.333063334509858,-0.344166191175286
0.48,-0.341046989030062,-0.35049605701278
0.49,-0.349070452203486,-0.356773839616138
0.5,-0.357133797884636,-0.362998765987432
0.51,-0.365237090870981,-0.36917005392154
0.52,-0.37338038653717,-0.375286912109076
0.53,-0.381563730462849,-0.381348540253645
0.54,-0.389787158054379,-0.387354129204041
0.55,-0.398050694160784,-0.393302861102014
0.56,-0.406354352684293,-0.399193909546219
0.57,-0.414698136185886,-0.405026439772968
0.58,-0.423082035486286,-0.410799608854413
0.59,-0.431506029262888,-0.416512565914773
0.6,-0.439970083643152,-0.422164452365203
0.61,-0.448474151795045,-0.427754402157919
0.62,-0.457018173515134,-0.433281542060159
0.63,-0.465602074815022,-0.438744991948547
0.64,-0.474225767506817,-0.444143865124422
0.65,-0.482889148788421,-0.44947726865065
0.66,-0.491592100829432,-0.454744303710434
0.67,-0.500334490358533,-0.459944065988588
0.68,-0.509116168253277,-0.465075646075715
0.69,-0.517936969133226,-0.470138129895702
0.7,-0.526796710957461,-0.47513059915687
0.71,-0.535695194627511,-0.480052131827117
0.72,-0.544632203596821,-0.484901802633292
0.73,-0.553607503487906,-0.489678683585024
0.74,-0.562620841718386,-0.494381844523136
0.75,-0.571671947137144,-0.49901035369273
0.76,-0.5807605296719,-0.503563278340955
0.77,-0.5898862799895,-0.508039685339379
0.78,-0.599048869170291,-0.512438641830834
0.79,-0.60824794839796,-0.516759215900494
0.8,-0.617483148666243,-0.521000477270867
0.81,-0.626754080503949,-0.525161498020292
0.82,-0.636060333719742,-0.529241353324437
0.83,-0.645401477168144,-0.53323912222017
0.84,-0.654777058538231,-0.537153888391115
0.85,-0.664186604166486,-0.540984740974043
0.86,-0.673629618875279,-0.544730775385193
0.87,-0.683105585838402,-0.548391094165455
0.88,-0.69261396647511,-0.551964807843283
0.89,-0.702154200374037,-0.555451035814034
0.9,-0.711725705248362,-0.558848907234381
0.91,-0.721327876923528,-0.562157561930268
0.92,-0.730960089358765,-0.565376151316804
0.93,-0.740621694703617,-0.568503839328364
0.94,-0.75031202339059,-0.571539803357062
0.95,-0.76003038426494,-0.574483235197639
0.96,-0.769776064752571,-0.577333341996733
0.97,-0.779548331066864,-0.580089347204377
0.98,-0.789346428455189,-0.582750491525488
0.99,-0.799169581485705,-0.585316033869034
1,-0.809016994374948,-0.587785252292473
