xi,s1,s2
0,-1.13065121738768e-25,-2.86506204355328e-26
0.01,-0.0302749014128399,-0.011244729923008
0.02,-0.0555234779959101,-0.0191157852615396
0.03,-0.0770986140019982,-0.0245648488545654
0.04,-0.0959667212397498,-0.0282665423023849
0.05,-0.112812673791377,-0.0306943857086456
0.06,-0.128119116525973,-0.032178084013551
0.07,-0.142225511306175,-0.0329460647588432
0.08,-0.155371384034027,-0.0331565315950498
0.09,-0.167727442857241,-0.0329197165316992
0.1,-0.179417546025822,-0.0323135067504492
0.11,-0.190533900117672,-0.0313941836580773
0.12,-0.201147358706445,-0.0302036376597477
0.13,-0.211314261092098,-0.0287741067916404
0.14,-0.221080893520397,-0.0271312257746074
0.15,-0.230486364448553,-0.0252959591457418
0.16,-0.239564453936341,-0.0232858228013172
0.17,-0.248344818221969,-0.0211156674512154
0.18,-0.256853797045774,-0.0187982000504063
0.19,-0.265114976378905,-0.0163443501460223
0.2,-0.273149595964859,-0.0137635421677807
0.21,-0.280976852555239,-0.0110639069036848
0.22,-0.288614128985837,-0.00825245065221365
0.23,-0.296077169454205,-0.00533519380360524
0.24,-0.303380216551247,-0.00231728748969578
0.25,-0.310536122287072,0.000796885100764956
0.26,-0.317556442550023,0.00400361783941743
0.27,-0.324451522028364,0.00729979774054054
0.28,-0.331230574578759,0.0106828257338773
0.29,-0.337901762318321,0.0141505408245074
0.3,-0.344472275321771,0.0177011471030464
0.31,-0.350948412696064,0.0213331436506837
0.32,-0.35733566495575,0.0250452577976733
0.33,-0.363638797007435,0.0288363824593082
0.34,-0.369861930644853,0.0327055184085905
0.35,-0.376008625231442,0.0366517223682009
0.36,-0.382081955178871,0.0406740617344201
0.37,-0.388084582891659,0.0447715766008077
0.38,-0.394018826014021,0.0489432495481526
0.39,-0.399886718059266,0.0531879834279095
0.4,-0.405690061798482,0.0575045871074933
0.41,-0.411430475108036,0.0618917688858415
0.42,-0.417109429298371,0.0663481370450399
0.43,-0.422728280244416,0.070872206796634
0.44,-0.428288292888709,0.0754624127246076
0.45,-0.433790659881802,0.0801171257271801
0.46,-0.439236515261272,0.084834673414069
0.47,-0.444626944155399,0.089613362919145
0.48,-0.449962989535297,0.09445150513462
0.49,-0.455245657035056,0.0993474394561716
0.5,-0.460475918818314,0.104299558242881
0.51,-0.465654717396658,0.109306330335642
0.52,-0.470782970205415,0.114366323136973
0.53,-0.475861575620778,0.11947822292799
0.54,-0.480891420963852,0.124640853278905
0.55,-0.485873392887165,0.129853191591843
0.56,-0.49080839038248,0.135114383993228
0.57,-0.495697340490451,0.140423758961545
0.58,-0.500541216637817,0.145780840229139
0.59,-0.505341059381439,0.15118535962796
0.6,-0.510097999205656,0.156637270652904
0.61,-0.514813280905156,0.162136763586871
0.62,-0.519488288994924,0.167684283062902
0.63,-0.524124573526741,0.173280548925213
0.64,-0.528723875662617,0.178926581189883
0.65,-0.533288152361747,0.184623729802313
0.66,-0.537819599579896,0.190373709755511
0.67,-0.542320673458364,0.196178641986426
0.68,-0.546794109093815,0.202041100323039
0.69,-0.551242936630214,0.207964164628752
0.7,-0.555670494599742,0.213951480198888
0.71,-0.560080440660789,0.220007323422796
0.72,-0.564476760137857,0.226136673750264
0.73,-0.568863773060345,0.232345292108742
0.74,-0.573246140724627,0.238639806124194
0.75,-0.577628873166473,0.245027802819465
0.76,-0.582017339328639,0.251517929915742
0.77,-0.586417282141205,0.258120007461187
0.78,-0.590834841199961,0.264845152272084
0.79,-0.595276586230611,0.271705918611974
0.8,-0.59974956506383,0.278716459669278
0.81,-0.604261370418044,0.285892715739903
0.82,-0.608820230394069,0.293252636596748
0.83,-0.613435128270137,0.300816447468004
0.84,-0.618115958378941,0.30860697159416
0.85,-0.622873728104008,0.3166500319245
0.86,-0.627720824026955,0.324974977773633
0.87,-0.632671376055908,0.333615427921596
0.88,-0.637741780075457,0.342610398558574
0.89,-0.642951480387663,0.352006101500563
0.9,-0.648324171069602,0.361858864089024
0.91,-0.653889653463451,0.372239845989152
0.92,-0.65968668844786,0.38324251857139
0.93,-0.665767310022185,0.39499423855264
0.94,-0.672203224175613,0.407673697940901
0.95,-0.679095107119245,0.421536575923222
0.96,-0.686585842838351,0.436952364015358
0.97,-0.694879004682122,0.454456092405989
0.98,-0.704264192457035,0.474819561832177
0.99,-0.715151188335086,0.499147690369476
1,-0.728115294937453,0.529006727063226
