xi,s1,s2
0,0,0
0.01,-0.00699230073243948,-0.00721849583172623
0.02,-0.0141402597641322,-0.0142813053557207
0.03,-0.0214472678486451,-0.0211778506937221
0.04,-0.0289164305063412,-0.0278968473908022
0.05,-0.0365504891304795,-0.0344262874681688
0.06,-0.0443517316322165,-0.0407534314516893
0.07,-0.0523218924988493,-0.0468648120565311
0.08,-0.0604620425836661,-0.0527462525675874
0.09,-0.068772469539711,-0.0583829032590241
0.1,-0.0772525505673405,-0.0637592993933611
0.11,-0.0859006200680917,-0.0688594443667233
0.12,-0.0947138358673549,-0.0736669213468956
0.13,-0.103688048840833,-0.0781650362035662
0.14,-0.112817681975802,-0.0823369935788433
0.15,-0.122095626000018,-0.0861661065329458
0.16,-0.131513159563269,-0.0896360383052655
0.17,-0.141059902375183,-0.0927310723946896
0.18,-0.15072380949634,-0.0954364045041843
0.19,-0.160491213980426,-0.0977384471225526
0.2,-0.17034692317043,-0.0996251349268129
0.21,-0.180274371166257,-0.101086217138691
0.22,-0.190255826449339,-0.102113521827503
0.23,-0.200272649667548,-0.102701177233307
0.24,-0.210305592576044,-0.102845776673729
0.25,-0.220335125593461,-0.10254647649062
0.26,-0.230341778851774,-0.101805020565069
0.27,-0.24030648036784,-0.100625689757099
0.28,-0.250210875233022,-0.0990151796495559
0.29,-0.260037611463949,-0.0969824145986308
0.3,-0.269770581121611,-0.0945383097934189
0.31,-0.279395109064175,-0.0916954954445114
0.32,-0.288898085752103,-0.0884680182101138
0.33,-0.298268044391836,-0.0848710345943351
0.34,-0.307495186001972,-0.0809205095542079
0.35,-0.316571358469622,-0.0766329312713631
0.36,-0.325489997241377,-0.0720250503529471
0.37,-0.334246036000366,-0.0671136489642636
0.38,-0.34283579564839,-0.0619153428301431
0.39,-0.351256859320478,-0.0564464168505733
0.4,-0.359507940200202,-0.0507226933482632
0.41,-0.367588747753637,-0.0447594307182923
0.42,-0.375499856800652,-0.038571249447469
0.43,-0.383242582698387,-0.0321720820470666
0.44,-0.390818864889647,-0.0255751433175249
0.45,-0.398231160202938,-0.0187929174575648
0.46,-0.405482346591306,-0.0118371587710353
0.47,-0.412575637457467,-0.00471890305298064
0.48,-0.419514506316361,0.00255151289449604
0.49,-0.42630262127193,0.00996442578963075
0.5,-0.432943788609681,0.0175108162538584
0.51,-0.43944190470904,0.0251822765309526
0.52,-0.445800915440191,0.0329709767287141
0.53,-0.452024782212925,0.0408696305143671
0.54,-0.45811745387668,0.048871460978577
0.55,-0.46408284372116,0.0569701672030778
0.56,-0.469924810887734,0.0651598919196634
0.57,-0.475647145567619,0.0734351905296883
0.58,-0.481253557429353,0.0817910016590851
0.59,-0.486747666782763,0.0902226193503733
0.6,-0.49213299804749,0.0987256669366146
0.61,-0.497412975150379,0.107296072599657
0.62,-0.502590918526999,0.115930046583607
0.63,-0.507670043448219,0.12462406001197
0.64,-0.51265345943321,0.133374825241467
0.65,-0.517544170545787,0.142179277675511
0.66,-0.522345076401945,0.151034558954564
0.67,-0.527058973743348,0.159938001437948
0.68,-0.531688558454658,0.168887113891455
0.69,-0.536236427922469,0.177879568296546
0.7,-0.540705083650623,0.18691318769961
0.71,-0.545096934061148,0.195985935023268
0.72,-0.549414297422398,0.20509590276573
0.73,-0.553659404856328,0.214241303518543
0.74,-0.557834403385713,0.223420461237524
0.75,-0.561941358989458,0.232631803206142
0.76,-0.56598225964042,0.241873852634971
0.77,-0.569959018305367,0.251145221845071
0.78,-0.573873475891026,0.260444605987197
0.79,-0.577727404123853,0.269770777252519
0.8,-0.581522508354123,0.279122579534169
0.81,-0.585260430277465,0.28849892350222
0.82,-0.588942750569005,0.297898782057867
0.83,-0.592570991426963,0.307321186135411
0.84,-0.596146619023952,0.316765220823352
0.85,-0.599671045865291,0.326230021778286
0.86,-0.603145633054606,0.335714771907608
0.87,-0.606571692467659,0.345218698299029
0.88,-0.609950488835919,0.354741069376838
0.89,-0.613283241741851,0.36428119226654
0.9,-0.616571127528206,0.373838410351093
0.91,-0.619815281123843,0.383412101003389
0.92,-0.623016797788812,0.393001673480954
0.93,-0.626176734781516,0.402606566970018
0.94,-0.629296112950866,0.41222624876722
0.95,-0.63237591825634,0.421860212588187
0.96,-0.6354171032189,0.431507976993141
0.97,-0.638420588305659,0.441169083920524
0.98,-0.641387263251155,0.45084309732037
0.99,-0.644317988318047,0.460529601879839
1,-0.647213595499947,0.470228201833974
