xi,s1,s2
0,0,0
0.01,0.00226362842973514,-0.00982072750501221
0.02,0.00457116469741903,-0.019629689340315
0.03,0.00692430942028816,-0.029426268089123
0.04,0.00932486068934436,-0.039209796383106
0.05,0.0117747213682947,-0.048979551832263
0.06,0.0142759070540897,-0.0587347513360815
0.07,0.0168305547672344,-0.0684745446879376
0.08,0.0194409324474561,-0.0781980073704479
0.09,0.0221094493384321,-0.0879041324226437
0.1,0.0248386673541393,-0.0975918212399309
0.11,0.0276313135289789,-0.107259873144191
0.12,0.0304902936640872,-0.116906973533333
0.13,0.0334187072930727,-0.126531680386217
0.14,0.0364198641016129,-0.136132408859061
0.15,0.0394973019465529,-0.145707413661855
0.16,0.042654806630876,-0.155254768846375
0.17,0.0458964336003403,-0.164772344569145
0.18,0.0492265317345368,-0.174257780310841
0.19,0.0526497694078977,-0.183708453935292
0.2,0.0561711629922782,-0.193121445853201
0.21,0.0597961079586055,-0.202493497413955
0.22,0.0635304127056727,-0.211820962478894
0.23,0.0673803351923025,-0.221099750926083
0.24,0.0713526223647659,-0.230325262594196
0.25,0.0754545522404104,-0.239492309885933
0.26,0.0796939783113009,-0.248595026913844
0.27,0.0840793756410703,-0.257626762679976
0.28,0.0886198876066069,-0.266579955335058
0.29,0.0933253716324755,-0.275445984070006
0.3,0.0982064414109721,-0.284214994672068
0.31,0.103274501902669,-0.292875694271363
0.32,0.108541771752201,-0.301415110388872
0.33,0.114021285482679,-0.309818309209865
0.34,0.119726864772929,-0.318068068274354
0.35,0.125673044085115,-0.326144499862308
0.36,0.131874930733332,-0.334024623819627
0.37,0.138347973113681,-0.341681893257121
0.38,0.145107603472044,-0.349085684637129
0.39,0.152168714035641,-0.356200776778572
0.4,0.159544919334151,-0.36298686303011
0.41,0.167247556423924,-0.369398168825707
0.42,0.175284384051864,-0.375383283306289
0.43,0.183657969549194,-0.380885355672663
0.44,0.1923638078182,-0.385842845237517
0.45,0.201388307177024,-0.390191030242314
0.46,0.210706898898945,-0.393864445789678
0.47,0.22028265674207,-0.396800303476696
0.48,0.230065896339045,-0.398942727211761
0.49,0.239995187856393,-0.400247347766676
0.5,0.25,-0.400685524656264
0.51,0.260004812143607,-0.400247347766676
0.52,0.269934103660955,-0.398942727211761
0.53,0.27971734325793,-0.396800303476696
0.54,0.289293101101055,-0.393864445789678
0.55,0.298611692822976,-0.390191030242314
0.56,0.3076361921818,-0.385842845237517
0.57,0.316342030450806,-0.380885355672663
0.58,0.324715615948136,-0.375383283306289
0.59,0.332752443576076,-0.369398168825707
0.6,0.340455080665849,-0.36298686303011
0.61,0.34783128596436,-0.356200776778572
0.62,0.354892396527956,-0.349085684637129
0.63,0.361652026886319,-0.341681893257121
0.64,0.368125069266668,-0.334024623819627
0.65,0.374326955914885,-0.326144499862308
0.66,0.380273135227072,-0.318068068274354
0.67,0.385978714517321,-0.309818309209865
0.68,0.391458228247799,-0.301415110388871
0.69,0.396725498097331,-0.292875694271363
0.7,0.401793558589028,-0.284214994672068
0.71,0.406674628367525,-0.275445984070006
0.72,0.411380112393393,-0.266579955335058
0.73,0.41592062435893,-0.257626762679976
0.74,0.420306021688699,-0.248595026913844
0.75,0.42454544775959,-0.239492309885933
0.76,0.428647377635234,-0.230325262594195
0.77,0.432619664807698,-0.221099750926083
0.78,0.436469587294327,-0.211820962478894
0.79,0.440203892041395,-0.202493497413955
0.8,0.443828837007722,-0.193121445853201
0.81,0.447350230592102,-0.183708453935292
0.82,0.450773468265463,-0.174257780310842
0.83,0.45410356639966,-0.164772344569145
0.84,0.457345193369124,-0.155254768846375
0.85,0.460502698053447,-0.145707413661855
0.86,0.463580135898387,-0.136132408859061
0.87,0.466581292706927,-0.126531680386217
0.88,0.469509706335913,-0.116906973533333
0.89,0.472368686471021,-0.107259873144191
0.9,0.475161332645861,-0.0975918212399309
0.91,0.477890550661568,-0.0879041324226437
0.92,0.480559067552544,-0.0781980073704479
0.93,0.483169445232766,-0.0684745446879375
0.94,0.48572409294591,-0.0587347513360814
0.95,0.488225278631705,-0.048979551832263
0.96,0.490675139310656,-0.0392097963831059
0.97,0.493075690579712,-0.0294262680891231
0.98,0.495428835302581,-0.019629689340315
0.99,0.497736371570265,-0.00982072750501231
1,0.5,0
