xi,s1,s2
0,2.22155605356166e-27,1.03521221188298e-29
0.01,0.0219747669576001,0.0267183788012353
0.02,0.0388788171959232,0.0490238145191724
0.03,0.0522494151277224,0.068162426542986
0.04,0.0631548776185573,0.0850087747606935
0.05,0.0723265744897951,0.100170026657865
0.06,0.0802585625787525,0.114064507479786
0.07,0.087281308665085,0.126979765807293
0.08,0.0936150250626721,0.139114543489819
0.09,0.0994072833533286,0.150608354024426
0.1,0.104758786602684,0.161561747166759
0.11,0.109740468449524,0.172049769808943
0.12,0.114404448697781,0.182130623960441
0.13,0.118790809465174,0.191851072020831
0.14,0.122931663554259,0.201249747438313
0.15,0.126853567510368,0.210359195304495
0.16,0.130578985816499,0.219207192444768
0.17,0.134127239847851,0.227817680124129
0.18,0.137515175565459,0.236211484598745
0.19,0.140757657084494,0.244406901094911
0.2,0.143867933001108,0.252420170411085
0.21,0.146857904324478,0.260265864663286
0.22,0.149738317576736,0.267957196099956
0.23,0.152518902831218,0.275506261367209
0.24,0.155208472988309,0.28292423217031
0.25,0.157814997418354,0.290221501936332
0.26,0.160345660232473,0.297407796836252
0.27,0.162806910874816,0.304492258372195
0.28,0.165204512463745,0.311483503677204
0.29,0.167543591344617,0.318389668710739
0.3,0.169828689653316,0.325218438663118
0.31,0.172063821327443,0.331977069106306
0.32,0.174252530941025,0.338672400746828
0.33,0.176397953978938,0.345310870049132
0.34,0.178502876708689,0.351898517504461
0.35,0.180569793649983,0.358440994921171
0.36,0.182600960780613,0.364943572806182
0.37,0.184598442996317,0.371411148681225
0.38,0.186564154819107,0.377848256998841
0.39,0.188499893805205,0.384259081164417
0.4,0.190407366509686,0.390647468024933
0.41,0.192288207218701,0.397016945052211
0.42,0.194143989961378,0.403370740328144
0.43,0.195976234562474,0.409711805331812
0.44,0.197786407693351,0.416042840433406
0.45,0.19957592002306,0.422366322917627
0.46,0.201346120663034,0.428684537289546
0.47,0.203098290138338,0.434999607558976
0.48,0.204833633105421,0.441313531155061
0.49,0.206553271970955,0.447628214091123
0.5,0.20825824244859,0.45394550698084
0.51,0.209949491920363,0.460267241500419
0.52,0.21162788124707,0.466595266897803
0.53,0.213294190401228,0.472931486168532
0.54,0.214949128000469,0.47927789154708
0.55,0.216593344539943,0.4856365989989
0.56,0.218227448882803,0.492009881440285
0.57,0.219852027372072,0.498400200460149
0.58,0.221467664775225,0.504810236369988
0.59,0.223074966164674,0.511242916465502
0.6,0.224674578773055,0.517701441445781
0.61,0.226267212841716,0.524189310003439
0.62,0.227853660504154,0.530710341671731
0.63,0.22943481181333,0.537268698092449
0.64,0.23101166713277,0.543868902951273
0.65,0.232585345266198,0.550515860915269
0.66,0.234157086899096,0.557214876000381
0.67,0.235728253168056,0.563971669895
0.68,0.237300319460089,0.570792400869126
0.69,0.238874864873615,0.57768368400779
0.7,0.240453558136228,0.584652613633245
0.71,0.242038141134874,0.591706788965117
0.72,0.243630411527082,0.598854344362631
0.73,0.245232206150634,0.606103985917661
0.74,0.246845387131488,0.613465036723724
0.75,0.248471832706118,0.620947493834236
0.76,0.250113434824486,0.628562100743332
0.77,0.251772105583774,0.636320440174355
0.78,0.253449794460672,0.644235053044673
0.79,0.255148518161515,0.652319590690908
0.8,0.256870404694821,0.660589008785793
0.81,0.258617752989877,0.669059812856918
0.82,0.260393109037875,0.677750366928337
0.83,0.262199359118785,0.686681278548655
0.84,0.264039840197602,0.695875875343541
0.85,0.26591846703194,0.705360790263375
0.86,0.26783987516806,0.715166676449992
0.87,0.269809581113136,0.725329093150236
0.88,0.271834171571771,0.735889680677517
0.89,0.273921557700614,0.746897907600933
0.9,0.276081369133507,0.758413935408632
0.91,0.278325616139434,0.770513505361792
0.92,0.280669816697202,0.783296209131504
0.93,0.283134868504331,0.796899059092946
0.94,0.285750043982926,0.811517925839484
0.95,0.288557599202544,0.827440159573816
0.96,0.29161961530902,0.845092558533893
0.97,0.295027833529098,0.865109791518214
0.98,0.298917402113391,0.888429422888064
0.99,0.303485625684682,0.916420827143487
1,0.309016994374947,0.951056516295154
