xi,s1,s2
0,-8.23187391507661e-27,-7.19461285597578e-27
0.01,0.0265237835243424,0.032409218783251
0.02,0.0445716372684205,0.0568578263019381
0.03,0.0579013664218226,0.0767385777911766
0.04,0.0685125402540514,0.0938715100683387
0.05,0.0774421831780454,0.109216090984103
0.06,0.0852305782893698,0.123287015920526
0.07,0.0921750805740824,0.13637996067058
0.08,0.0984570940182597,0.14868399715607
0.09,0.104200058634182,0.160332696505335
0.1,0.109494419942215,0.171426183018786
0.11,0.114409114698564,0.182041562485464
0.12,0.11899809513849,0.192239222380207
0.13,0.123304611500198,0.202067291870521
0.14,0.127364061080308,0.211564861570889
0.15,0.131205858404942,0.220764281724738
0.16,0.134854667254997,0.229692788246653
0.17,0.138331243047889,0.238373651021518
0.18,0.141653055952274,0.246826991235828
0.19,0.144834801081926,0.255070374295833
0.2,0.147888852180181,0.263119252067527
0.21,0.150825679367042,0.27098730275474
0.22,0.153654229756354,0.278686698703899
0.23,0.15638226145532,0.286228321503092
0.24,0.15901662297735,0.29362193821118
0.25,0.161563474961054,0.300876349369135
0.26,0.164028455637511,0.307999516893002
0.27,0.166416795119562,0.314998677741304
0.28,0.168733386280055,0.321880447379756
0.29,0.170982821740572,0.328650915532651
0.3,0.173169407308295,0.335315735513333
0.31,0.175297162076237,0.341880207565704
0.32,0.177369814343025,0.348349356124304
0.33,0.179390800568065,0.354728000697843
0.34,0.181363272089931,0.361020820114071
0.35,0.183290111891322,0.367232409980221
0.36,0.185173961626513,0.373367333326754
0.37,0.187017257492343,0.37943016449859
0.38,0.188822272323188,0.385425526436971
0.39,0.19059116052419,0.391358121556415
0.4,0.192326002125131,0.397232756465129
0.41,0.194028842339868,0.403054360803466
0.42,0.195701723552161,0.408828000483879
0.43,0.197346707591355,0.414558885608483
0.44,0.198965887348913,0.420252373325655
0.45,0.200561387933129,0.425913965880091
0.46,0.202135358502683,0.431549304120163
0.47,0.20368995663332,0.437164156753581
0.48,0.205227327554883,0.442764405687442
0.49,0.206749580848269,0.448356027851579
0.5,0.208258767213504,0.453945073984898
0.51,0.209756857711155,0.459537644962909
0.52,0.2112457274402,0.465139866361019
0.53,0.212727144961813,0.470757862079611
0.54,0.214202768004661,0.476397727987902
0.55,0.215674145259878,0.482065506646267
0.56,0.217142723487247,0.48776716422545
0.57,0.218609858723833,0.493508570753288
0.58,0.220076830112855,0.499295484785134
0.59,0.22154485475409,0.505133543513093
0.6,0.223015102017426,0.511028259201486
0.61,0.224488705958403,0.516985022661606
0.62,0.225966774828332,0.523009114258059
0.63,0.227450397170103,0.529105722676682
0.64,0.228940644564111,0.535279971410453
0.65,0.230438571612377,0.541536952688285
0.66,0.231945214152927,0.54788176841223
0.67,0.23346158696909,0.554319577586512
0.68,0.234988682399187,0.560855649717019
0.69,0.236527471261198,0.567495423732461
0.7,0.238078907384263,0.574244572128398
0.71,0.239643936784473,0.581109070262628
0.72,0.241223512136618,0.588095271035338
0.73,0.242818612689738,0.595209985575809
0.74,0.244430269232243,0.60246057106506
0.75,0.246059593273378,0.609855027513896
0.76,0.247707809351757,0.617402106224124
0.77,0.249376289321832,0.625111433793154
0.78,0.251066587605857,0.632993656878922
0.79,0.252780476732278,0.641060614523211
0.8,0.254519983011434,0.649325546636864
0.81,0.256287422926023,0.657803349280175
0.82,0.258085441738972,0.666510889640544
0.83,0.259917057002957,0.675467396542659
0.84,0.261785711442824,0.684694948493708
0.85,0.263695342692672,0.69421909521609
0.86,0.265650481952271,0.704069672922402
0.87,0.267656399840696,0.714281908667629
0.88,0.269719325570543,0.724897954985965
0.89,0.271846775043824,0.735969052684649
0.9,0.274048034580615,0.747558587124624
0.91,0.276334859736769,0.759746381588309
0.92,0.278722464531739,0.772634670794669
0.93,0.281230938584528,0.786356620216392
0.94,0.283887599034061,0.801090826367993
0.95,0.286731922520045,0.817093178092987
0.96,0.289826870810792,0.834772602867516
0.97,0.293283665078176,0.854859867202391
0.98,0.29731137982115,0.878748756741651
0.99,0.302308118031129,0.909126629644126
1,0.309016994374947,0.951056516295154
