xi,s1,s2
0,1.31355559495932e-28,4.94038293788147e-28
0.01,-0.00229458651165412,-0.017467268892065
0.02,-0.00451880337307615,-0.0342161249635255
0.03,-0.00667265058426611,-0.0502465682143815
0.04,-0.00875612814522399,-0.065558598644633
0.05,-0.0107692360559498,-0.0801522162542801
0.06,-0.0127119743164435,-0.0940274210433227
0.07,-0.0145843429267051,-0.107184213011761
0.08,-0.0163863418867347,-0.119622592159594
0.09,-0.0181179711965322,-0.131342558486823
0.1,-0.0197792308560976,-0.142344111993448
0.11,-0.0213701208654309,-0.152627252679468
0.12,-0.0228906412245321,-0.162191980544884
0.13,-0.0243521886698168,-0.171127654790933
0.14,-0.0258231436197784,-0.179970430625044
0.15,-0.0273149028108325,-0.188809667248454
0.16,-0.0288274662429789,-0.197645364661164
0.17,-0.0303608339162178,-0.206477522863174
0.18,-0.0319150058305491,-0.215306141854483
0.19,-0.0334899819859729,-0.224131221635092
0.2,-0.0350857623824891,-0.232952762205001
0.21,-0.0367023470200977,-0.241770763564209
0.22,-0.0383397358987988,-0.250585225712717
0.23,-0.0399979290185923,-0.259396148650525
0.24,-0.0416769263794782,-0.268203532377632
0.25,-0.0433767279814565,-0.277007376894039
0.26,-0.0451268768962598,-0.285797544348576
0.27,-0.0469569161956204,-0.294563896890073
0.28,-0.0488668458795384,-0.303306434518532
0.29,-0.0508566659480137,-0.31202515723395
0.3,-0.0529263764010464,-0.32072006503633
0.31,-0.0550759772386364,-0.32939115792567
0.32,-0.0573054684607838,-0.338038435901971
0.33,-0.0596148500674886,-0.346661898965232
0.34,-0.0620041220587507,-0.355261547115454
0.35,-0.0644732844345702,-0.363837380352637
0.36,-0.067022337194947,-0.37238939867678
0.37,-0.0696512803398812,-0.380917602087884
0.38,-0.0723359968462995,-0.389429579687063
0.39,-0.0749317845757628,-0.397970866081001
0.4,-0.0774145265051977,-0.406549050370813
0.41,-0.0797842226346043,-0.415164132556498
0.42,-0.0820408729639826,-0.423816112638057
0.43,-0.0841844774933326,-0.43250499061549
0.44,-0.0862150362226544,-0.441230766488796
0.45,-0.0881325491519477,-0.449993440257975
0.46,-0.0899370162812128,-0.458793011923028
0.47,-0.0916284376104496,-0.467629481483955
0.48,-0.0932068131396581,-0.476502848940755
0.49,-0.0946721428688383,-0.485413114293429
0.5,-0.0960244267979901,-0.494360277541976
0.51,-0.0970893506397942,-0.503296972168491
0.52,-0.0976926001069309,-0.512175831655069
0.53,-0.0978341751994003,-0.520996856001709
0.54,-0.0975140759172023,-0.529760045208411
0.55,-0.0967323022603371,-0.538465399275176
0.56,-0.0954888542288045,-0.547112918202004
0.57,-0.0937837318226046,-0.555702601988893
0.58,-0.0916169350417373,-0.564234450635845
0.59,-0.0889884638862028,-0.57270846414286
0.6,-0.0858983183560009,-0.581124642509936
0.61,-0.0823464984511316,-0.589482985737076
0.62,-0.0783330041715951,-0.597783493824277
0.63,-0.0738663996244815,-0.605968186871339
0.64,-0.0689980694523325,-0.613689185477052
0.65,-0.0637365777622385,-0.620888509741213
0.66,-0.0580819245541993,-0.627566159663823
0.67,-0.0520341098282151,-0.633722135244881
0.68,-0.0455931335842859,-0.639356436484388
0.69,-0.0387589958224116,-0.644469063382343
0.7,-0.0315316965425922,-0.649060015938747
0.71,-0.0239112357448277,-0.6531292941536
0.72,-0.0158976134291181,-0.656676898026901
0.73,-0.0074908295954635,-0.659702827558651
0.74,0.00130911575613621,-0.662207082748849
0.75,0.010502222625681,-0.664189663597496
0.76,0.0197894802496576,-0.665573675713059
0.77,0.0288718778645529,-0.666282224704006
0.78,0.0377494154703667,-0.666315310570337
0.79,0.0464220930670991,-0.665672933312052
0.8,0.0548899106547502,-0.664355092929152
0.81,0.0631528682333198,-0.662361789421635
0.82,0.071210965802808,-0.659693022789502
0.83,0.0790642033632148,-0.656348793032754
0.84,0.0867125809145403,-0.652329100151389
0.85,0.0941560984567843,-0.647633944145409
0.86,0.101394755989947,-0.642263325014812
0.87,0.108428553514028,-0.6362172427596
0.88,0.115214743567727,-0.629462700946244
0.89,0.121496841383236,-0.621801720973586
0.9,0.127232099499256,-0.613201306408098
0.91,0.132420517915784,-0.60366145724978
0.92,0.137062096632822,-0.593182173498633
0.93,0.14115683565037,-0.581763455154655
0.94,0.144704734968428,-0.569405302217848
0.95,0.147705794586995,-0.55610771468821
0.96,0.150160014506071,-0.541870692565743
0.97,0.152067394725657,-0.526694235850447
0.98,0.153427935245753,-0.51057834454232
0.99,0.154241636066359,-0.493523018641363
1,0.154508497187474,-0.475528258147577
