xi,sx,sy,cx,cy,ex,ey,ne
0,0,-0,0,0,0,-0,0
0.01,-0.0014443307,-0.0149115976,0.000718759,-0.0101185281,-0.0021630897,-0.0047930694,0.0052585617
0.02,-0.0028763215,-0.0295992841,0.0014451575,-0.0202349705,-0.0043214791,-0.0093643136,0.0103133676
0.03,-0.0042959726,-0.0440630597,0.0021793617,-0.0303493091,-0.0064753343,-0.0137137505,0.015165649
0.04,-0.0057032839,-0.0583029242,0.002921543,-0.0404615253,-0.008624827,-0.0178413989,0.0198167392
0.05,-0.0070982554,-0.0723188777,0.0036718788,-0.0505715995,-0.0107701343,-0.0217472782,0.024268084
0.06,-0.0084808872,-0.0861109201,0.0044305523,-0.0606795111,-0.0129114394,-0.025431409,0.0285212523
0.07,-0.0098511791,-0.0996790516,0.0051977528,-0.0707852389,-0.0150489319,-0.0288938126,0.032577949
0.08,-0.0112091312,-0.113023272,0.0059736764,-0.0808887605,-0.0171828076,-0.0321345115,0.0364400289
0.09,-0.0125547436,-0.1261435814,0.0067585258,-0.0909900523,-0.0193132694,-0.0351535291,0.0401095123
0.1,-0.0138880162,-0.1390399798,0.0075525109,-0.10108909,-0.0214405271,-0.0379508898,0.0435886022
0.11,-0.0152089489,-0.1517124671,0.0083558492,-0.1111858477,-0.0235647981,-0.0405266194,0.0468797034
0.12,-0.0165175419,-0.1641610434,0.0091687657,-0.1212802984,-0.0256863076,-0.042880745,0.0499854448
0.13,-0.0178137951,-0.1763857087,0.0099914939,-0.131372414,-0.027805289,-0.0450132947,0.0529087024
0.14,-0.0190977085,-0.188386463,0.0108242757,-0.1414621647,-0.0299219843,-0.0469242983,0.0556526272
0.15,-0.0203692821,-0.2001633063,0.0116673623,-0.1515495194,-0.0320366445,-0.0486137869,0.0582206739
0.16,-0.021628516,-0.2117162385,0.0125210142,-0.1616344451,-0.0341495302,-0.0500817934,0.060616635
0.17,-0.02287541,-0.2230452597,0.0133855018,-0.1717169075,-0.0362609118,-0.0513283522,0.0628446772
0.18,-0.0241099643,-0.2341503699,0.0142611061,-0.1817968703,-0.0383710703,-0.0523534995,0.0649093826
0.19,-0.0253321787,-0.245031569,0.0151481191,-0.1918742953,-0.0404802978,-0.0531572737,0.0668157935
0.2,-0.0265420534,-0.2556888572,0.0160468444,-0.2019491423,-0.0425888978,-0.0537397149,0.0685694624
0.21,-0.0277395883,-0.2661222343,0.016957598,-0.2120213687,-0.0446971863,-0.0541008656,0.0701765068
0.22,-0.0289247834,-0.2763317004,0.0178807085,-0.2220909299,-0.0468054918,-0.0542407705,0.0716436686
0.23,-0.0300976387,-0.2863172555,0.0188165182,-0.2321577785,-0.0489141569,-0.0541594769,0.0729783782
0.24,-0.0312581542,-0.2960788995,0.019765384,-0.2422218646,-0.0510235382,-0.0538570349,0.0741888243
0.25,-0.0324063299,-0.3056166325,0.0207276776,-0.2522831353,-0.0531340075,-0.0533334972,0.0752840267
0.26,-0.0335421658,-0.3149304545,0.0217037871,-0.2623415348,-0.0552459529,-0.0525889198,0.076273913
0.27,-0.034665662,-0.3240203655,0.0226941173,-0.2723970037,-0.0573597793,-0.0516233618,0.0771693965
0.28,-0.0357768183,-0.3328863654,0.023699091,-0.2824494793,-0.0594759094,-0.0504368861,0.077982455
0.29,-0.0368756349,-0.3415284544,0.0247191503,-0.292498895,-0.0615947852,-0.0490295594,0.0787262044
0.3,-0.0379621117,-0.3499466323,0.0257547573,-0.30254518,-0.0637168689,-0.0474014522,0.0794149675
0.31,-0.0390362487,-0.3581408992,0.0268063954,-0.3125882592,-0.0658426441,-0.0455526399,0.080064329
0.32,-0.0400980459,-0.366111255,0.0278745711,-0.3226280526,-0.067972617,-0.0434832025,0.080691174
0.33,-0.0411475033,-0.3738576999,0.028959815,-0.3326644749,-0.0701073183,-0.041193225,0.0813137003
0.34,-0.0421586688,-0.3814269618,0.0300626834,-0.3426974354,-0.0722213521,-0.0387295264,0.0819505944
0.35,-0.0430471978,-0.3889709072,0.0311837602,-0.3527268372,-0.074230958,-0.0362440699,0.0826067051
0.36,-0.0438066023,-0.3965012181,0.0323236586,-0.3627525769,-0.0761302609,-0.0337486412,0.083275371
0.37,-0.0444368824,-0.4040178944,0.033483023,-0.3727745437,-0.0779199054,-0.0312433507,0.0839503343
0.38,-0.044938038,-0.4115209363,0.0346625313,-0.3827926192,-0.0796005694,-0.0287283171,0.0846260412
0.39,-0.0453100692,-0.4190103436,0.0358628973,-0.3928066765,-0.0811729664,-0.0262036672,0.0852976122
0.4,-0.0455529759,-0.4264861165,0.0370848728,-0.4028165793,-0.0826378486,-0.0236695372,0.085960811
0.41,-0.045666758,-0.4339482548,0.038329251,-0.4128221812,-0.083996009,-0.0211260736,0.0866120114
0.42,-0.0456514158,-0.4413967586,0.0395968691,-0.4228233249,-0.0852482848,-0.0185734337,0.0872481662
0.43,-0.045506949,-0.448831628,0.0408886116,-0.4328198407,-0.0863955606,-0.0160117872,0.0878667754
0.44,-0.0452333578,-0.4562528628,0.0422054143,-0.4428115457,-0.0874387721,-0.0134413171,0.0884658571
0.45,-0.0448306421,-0.4636604631,0.0435482677,-0.4527982422,-0.0883789098,-0.0108622209,0.0890439192
0.46,-0.0442988019,-0.4710544288,0.0449182219,-0.4627797165,-0.0892170238,-0.0082747124,0.0895999341
0.47,-0.0436378373,-0.4784347601,0.0463163909,-0.4727557368,-0.0899542282,-0.0056790233,0.090133315
0.48,-0.0428477482,-0.4858014569,0.0477439583,-0.482726052,-0.0905917064,-0.0030754049,0.0906438933
0.49,-0.0419285346,-0.4931545191,0.0492021828,-0.4926903886,-0.0911307174,-0.0004641306,0.0911318993
0.5,-0.0408801965,-0.5004939469,0.050692405,-0.5026484491,-0.0915726015,0.0021545022,0.0915979433
0.51,-0.039702734,-0.5078197401,0.0522160539,-0.5125999089,-0.0919187878,0.0047801688,0.0920429985
0.52,-0.038396147,-0.5151318989,0.0537746555,-0.5225444132,-0.0921708024,0.0074125144,0.0924683848
0.53,-0.0369604355,-0.5224304231,0.0553698412,-0.5324815736,-0.0923302767,0.0100511505,0.0928757536
0.54,-0.0353955995,-0.5297153128,0.0570033578,-0.5424109636,-0.0923989573,0.0126956508,0.0932670728
0.55,-0.0337016391,-0.536986568,0.0586770783,-0.5523321146,-0.0923787174,0.0153455466,0.0936446113
0.56,-0.0318785542,-0.5442441887,0.0603930142,-0.5622445097,-0.0922715684,0.018000321,0.0940109243
0.57,-0.0299263448,-0.5514881749,0.0621533295,-0.5721475783,-0.0920796743,0.0206594034,0.0943688368
0.58,-0.027845011,-0.5587185266,0.0639603557,-0.5820406882,-0.0918053666,0.0233221616,0.0947214261
0.59,-0.0256345526,-0.5659352437,0.0658166097,-0.5919231376,-0.0914511624,0.0259878939,0.0950720029
0.6,-0.0232949698,-0.5731383264,0.0677248135,-0.6017941454,-0.0910197834,0.028655819,0.0954240899
0.61,-0.0208262626,-0.5803277745,0.0696879163,-0.6116528394,-0.0905141788,0.0313250648,0.0957813983
0.62,-0.0182284308,-0.5875035882,0.0717091199,-0.621498243,-0.0899375507,0.0339946548,0.0961478007
0.63,-0.0155014746,-0.5946657673,0.0737919081,-0.6313292594,-0.0892933827,0.0366634922,0.0965273011
0.64,-0.0126453939,-0.6018143119,0.0759400794,-0.6411446527,-0.0885854733,0.0393303408,0.0969240001
0.65,-0.0096601888,-0.608949222,0.078157785,-0.6509430252,-0.0878179738,0.0419938032,0.0973420568
0.66,-0.0065458591,-0.6160704976,0.0804495727,-0.6607227907,-0.0869954319,0.0446522931,0.0977856454
0.67,-0.0032922105,-0.6231787257,0.0828204368,-0.670482142,-0.0861126473,0.0473034163,0.0982496882
0.68,0.0002332854,-0.6302815365,0.0852758762,-0.6802190118,-0.0850425909,0.0499374752,0.0986204527
0.69,0.0040714065,-0.6373812781,0.0878219624,-0.6899310249,-0.0837505559,0.0525497469,0.0988717933
0.7,0.008222153,-0.6444779502,0.0904654173,-0.6996154401,-0.0822432643,0.0551374899,0.0990156417
0.71,0.0126855247,-0.651571553,0.0932137048,-0.7092690781,-0.0805281801,0.0576975251,0.0990645859
0.72,0.0174615217,-0.6586620865,0.0960751377,-0.7188882329,-0.0786136161,0.0602261464,0.0990317593
0.73,0.0225501439,-0.6657495506,0.0990590031,-0.7284685608,-0.0765088592,0.0627190103,0.0989306817
0.74,0.0279513914,-0.6728339453,0.1021757086,-0.7380049413,-0.0742243172,0.065170996,0.0987750373
0.75,0.0336652642,-0.6799152707,0.1054369551,-0.7474913012,-0.0717716909,0.0675760305,0.0985783724
0.76,0.0396917622,-0.6869935267,0.1088559383,-0.7569203905,-0.0691641761,0.0699268638,0.0983536961
0.77,0.0460308855,-0.6940687134,0.1124475852,-0.7662834955,-0.0664166997,0.0722147821,0.0981129592
0.78,0.0526826341,-0.7011408307,0.1162288286,-0.7755700674,-0.0635461945,0.0744292367,0.0978663891
0.79,0.0596470079,-0.7082098787,0.1202189225,-0.7847672392,-0.0605719146,0.0765573605,0.0976216487
0.8,0.066924007,-0.7152758573,0.1244398001,-0.7938591933,-0.0575157931,0.078583336,0.0973827868
0.81,0.0745136314,-0.7223387665,0.1289164641,-0.8028263279,-0.0544028328,0.0804875614,0.0971489359
0.82,0.082415881,-0.7293986064,0.1336773926,-0.8116441544,-0.0512615115,0.0822455479,0.0969127067
0.83,0.0906307559,-0.736455377,0.1387549121,-0.8202818363,-0.0481241561,0.0838264593,0.0966582106
0.84,0.0991582561,-0.7435090782,0.1441854502,-0.8287002593,-0.0450271941,0.0851911812,0.0963586299
0.85,0.1079983815,-0.75055971,0.1500094966,-0.8368495062,-0.0420111151,0.0862897962,0.0959732396
0.86,0.1171511322,-0.7576072724,0.1562709719,-0.8446656265,-0.0391198397,0.0870583541,0.0954437995
0.87,0.1266165082,-0.7646517656,0.1630154978,-0.8520666831,-0.0363989897,0.0874149175,0.0946903071
0.88,0.1363945094,-0.7716931893,0.170286776,-0.8589483248,-0.0338922665,0.0872551355,0.0936063267
0.89,0.1464851359,-0.7787315437,0.1781199954,-0.8651797402,-0.0316348595,0.0864481965,0.0920546306
0.9,0.1568883877,-0.7857668288,0.1865311668,-0.8706019678,-0.0296427791,0.084835139,0.0898648717
0.91,0.1676042647,-0.7927990445,0.1955021711,-0.8750321264,-0.0278979064,0.082233082,0.0868364725
0.92,0.178632767,-0.7998281908,0.2049640308,-0.8782782603,-0.0263312638,0.0784500695,0.082751126
0.93,0.1899738946,-0.8068542678,0.2147855231,-0.8801677164,-0.0248116285,0.0733134487,0.0773981826
0.94,0.2016276474,-0.8138772754,0.2247776081,-0.8805846475,-0.0231499607,0.0667073721,0.0706101563
0.95,0.2135940255,-0.8208972137,0.2347198284,-0.8795017682,-0.0211258029,0.0586045545,0.062296014
0.96,0.2258730288,-0.8279140826,0.2444011878,-0.8769886178,-0.018528159,0.0490745353,0.0524557212
0.97,0.2384646575,-0.8349278821,0.253656493,-0.8731910936,-0.0151918356,0.0382632115,0.0411687408
0.98,0.2513689114,-0.8419386123,0.2623829229,-0.8682947772,-0.0110140115,0.0263561649,0.0285649414
0.99,0.2645857905,-0.8489462732,0.2705361333,-0.862490266,-0.0059503428,0.0135439928,0.0147934554
1,0.2781152949,-0.8559508647,0.2781152949,-0.8559508647,0,-0,0
