xi,s1,s2
0,-1.58187165126116e-27,4.11598514299462e-27
0.01,0.00156762959720437,-0.0275316653217117
0.02,0.0030706077711482,-0.0516532671735562
0.03,0.00447756744442902,-0.0729992860558376
0.04,0.00577468334475923,-0.0920881650790381
0.05,0.00696076863681658,-0.109340988185311
0.06,0.00804324420342619,-0.125097761030464
0.07,0.00903488480982017,-0.139631509802339
0.08,0.00995125146834296,-0.153160403138814
0.09,0.0108087244045944,-0.16585809219595
0.1,0.0116230561096248,-0.177862453804113
0.11,0.01240836904642,-0.189282911537224
0.12,0.0131765276625366,-0.200206499407562
0.13,0.0139368194443716,-0.210702822785903
0.14,0.014695884832172,-0.22082806103403
0.15,0.0154578408985152,-0.230628146224002
0.16,0.0162245487766124,-0.240141242205848
0.17,0.0169959799084102,-0.24939963817267
0.18,0.0177706412660893,-0.258431160759449
0.19,0.0185460247841824,-0.267260198599147
0.2,0.0193190513231552,-0.275908423147015
0.21,0.0200864845689191,-0.284395279471305
0.22,0.0208452953563646,-0.292738310595924
0.23,0.0215929619886312,-0.300953368867842
0.24,0.022327697207449,-0.30905475770938
0.25,0.0230485975535117,-0.317055337002848
0.26,0.0237557159393147,-0.32496661524249
0.27,0.024450063303369,-0.332798841539321
0.28,0.0251335496181869,-0.340561101609483
0.29,0.0258088765885538,-0.348261416904257
0.3,0.0264793941013469,-0.355906845049664
0.31,0.027148931569919,-0.363503579867973
0.32,0.0278216143608248,-0.37105704942082
0.33,0.0285016745352786,-0.37857201068123
0.34,0.0291932641823422,-0.3860526396095
0.35,0.0299002786654548,-0.393502615575481
0.36,0.030626196148524,-0.40092519923745
0.37,0.0313739388124108,-0.408323303155361
0.38,0.0321457602172512,-0.415699554583909
0.39,0.032943162310667,-0.423056350058437
0.4,0.0337668446265308,-0.43039590155437
0.41,0.0346166872635592,-0.437720274168443
0.42,0.0354917682776209,-0.445031415437647
0.43,0.0363904151662546,-0.452331176579418
0.44,0.0373102891685062,-0.459621326104229
0.45,0.0382485001478005,-0.466903556419344
0.46,0.0392017488701789,-0.474179484210151
0.47,0.0401664925348402,-0.481450645553079
0.48,0.0411391284585374,-0.488718486881747
0.49,0.0421161898599887,-0.495984353095594
0.5,0.043094546735077,-0.503249474267899
0.51,0.0440716038582881,-0.510514952577655
0.52,0.0450454870074595,-0.517781751254417
0.53,0.0460152078649771,-0.525050687437485
0.54,0.0469807984758946,-0.532322430772775
0.55,0.047943407642048,-0.539597509302348
0.56,0.0489053534242893,-0.546876323880884
0.57,0.0498701277349517,-0.554159172029722
0.58,0.0508423508127157,-0.561446281815348
0.59,0.0518276751821056,-0.568737856015546
0.6,0.0528326405099002,-0.576034126512709
0.61,0.0538644825808043,-0.583335418530098
0.62,0.0549309014247799,-0.590642224003159
0.63,0.0560397954384993,-0.597955283054272
0.64,0.0571989701534359,-0.605275672215649
0.65,0.0584158321131692,-0.612604897721339
0.66,0.0596970801325368,-0.619944991865665
0.67,0.0610484080213257,-0.627298610101641
0.68,0.0624742346652502,-0.634669126229282
0.69,0.0639774791670256,-0.642060722699978
0.7,0.0655594005604017,-0.649478472739416
0.71,0.0672195234200783,-0.656928410667814
0.72,0.0689556725004856,-0.664417586472577
0.73,0.0707641413464662,-0.671954100364714
0.74,0.0726400216289554,-0.679547112726709
0.75,0.0745777217688166,-0.687206824535822
0.76,0.0765717052213681,-0.694944423022682
0.77,0.0786174804371462,-0.702771986904853
0.78,0.0807128732656996,-0.710702343444113
0.79,0.0828596007995285,-0.71874886140685
0.8,0.0850651433646767,-0.726925149759192
0.81,0.0873448861821219,-0.735244616010016
0.82,0.089724476875367,-0.743719822100383
0.83,0.0922423196502188,-0.752361559722932
0.84,0.0949521016233282,-0.761177550939805
0.85,0.0979252214266462,-0.770170663952644
0.86,0.101252964865537,-0.779336517863244
0.87,0.105048247058876,-0.788660334248429
0.88,0.109446715140037,-0.79811287735773
0.89,0.114606980248269,-0.807645308727468
0.9,0.120709722190539,-0.817182765989817
0.91,0.127955384804503,-0.826616459640469
0.92,0.136560154703856,-0.835794065513503
0.93,0.146749890737888,-0.844508174697067
0.94,0.158751646147668,-0.852482546608515
0.95,0.172782400051859,-0.859355894932615
0.96,0.189034589545741,-0.864662920111469
0.97,0.207658008347618,-0.8678122860598
0.98,0.228737612577372,-0.86806122276424
0.99,0.252266748902482,-0.864486420410293
1,0.278115294937453,-0.855950864665638
