cable,fx,fy,fz,fn
1,-70.04130343,51.9894211,37.10602311,94.79209378
2,70.04130343,51.9894211,37.10602311,94.79209378
3,70.04130343,-51.9894211,37.10602311,94.79209378
4,-70.04130343,-51.9894211,37.10602311,94.79209378
5,-71.11435012,52.78590937,-34.90613061,95.19475288
6,71.11435012,52.78590937,-34.90613061,95.19475288
7,71.11435012,-52.78590937,-34.90613061,95.19475288
8,-71.11435012,-52.78590937,-34.90613061,95.19475288
