xi,s1,s2
0,0,0
0.01,0.000718759007899098,-0.0101185281433818
0.02,0.00144515754416966,-0.0202349704999181
0.03,0.00217936170381723,-0.0303493091320727
0.04,0.00292154304330926,-0.040461525308402
0.05,0.00367187882199311,-0.0505715994592009
0.06,0.00443055225696318,-0.0606795111291504
0.07,0.00519775279228419,-0.0707852389267189
0.08,0.00597367638354836,-0.0808887604700637
0.09,0.00675852579882367,-0.0909900523291409
0.1,0.00755251093713535,-0.101089089963712
0.11,0.0083558491657171,-0.111185847656909
0.12,0.00916876567736999,-0.121280298443975
0.13,0.00999149386938062,-0.131372414035773
0.14,0.0108242757455721,-0.14146216473661
0.15,0.0116673623431976,-0.151549519355876
0.16,0.0125210141865341,-0.161634445112944
0.17,0.0133855017691971,-0.171716907534741
0.18,0.0142611060673799,-0.181796870345305
0.19,0.0151481190864138,-0.191874295346597
0.2,0.0160468444432725,-0.201949142289755
0.21,0.0169575979878785,-0.212021368735877
0.22,0.017880708466344,-0.222090929905332
0.23,0.0188165182295701,-0.232157778514487
0.24,0.0197653839909628,-0.242221864598601
0.25,0.020727677637386,-0.252283135319513
0.26,0.021703787097882,-0.262341534756569
0.27,0.0226941172751411,-0.27239700367908
0.28,0.02369909104521,-0.282449479298364
0.29,0.0247191503314916,-0.292498894997233
0.3,0.0257547572597219,-0.302545180034471
0.31,0.0268063954013191,-0.312588259221602
0.32,0.0278745711132898,-0.322628052568856
0.33,0.0289598149837775,-0.332664474896875
0.34,0.0300626833933358,-0.342697435410226
0.35,0.0311837602031482,-0.352726837228312
0.36,0.0323236585826917,-0.362752576868599
0.37,0.0334830229907935,-0.372774543676481
0.38,0.0346625313256674,-0.382792619195224
0.39,0.0358628972613839,-0.392806676468561
0.4,0.0370848727903451,-0.402816579267413
0.41,0.0383292509937549,-0.412822181230971
0.42,0.0395968690648339,-0.422823324910909
0.43,0.0408886116126872,-0.4328198407058
0.44,0.0422054142783564,-0.442811545670805
0.45,0.0435482676987512,-0.452798242185335
0.46,0.0449182218589497,-0.462779716458628
0.47,0.0463163908788928,-0.472755736849884
0.48,0.0477439582869043,-0.482726051975681
0.49,0.0492021828398901,-0.492690388572768
0.5,0.050692404958712,-0.502648449078763
0.51,0.052216053857284,-0.512599908886602
0.52,0.0537746554556997,-0.522544413220615
0.53,0.0553698411814591,-0.532481573572358
0.54,0.0570033577790289,-0.542410963622664
0.55,0.0586770782669946,-0.552332114562045
0.56,0.0603930142045177,-0.562244509704167
0.57,0.062153329455388,-0.572147578265691
0.58,0.0639603556694829,-0.582040688159417
0.59,0.0658166097389511,-0.591923137615016
0.6,0.0677248135311553,-0.601794145401014
0.61,0.0696879162538629,-0.611652839370973
0.62,0.0717091198722171,-0.621498242993054
0.63,0.0737919080739011,-0.631329259441676
0.64,0.0759400793713696,-0.641144652727817
0.65,0.0781577850413577,-0.650943025214068
0.66,0.0804495727360483,-0.66072279069308
0.67,0.0828204367619499,-0.670482141991735
0.68,0.0852758762171068,-0.680219011782237
0.69,0.087821962410755,-0.689931024913688
0.7,0.0904654172682835,-0.699615440093893
0.71,0.0932137047542281,-0.709269078110267
0.72,0.096075137730882,-0.718888232924469
0.73,0.0990590031088172,-0.72846856082937
0.74,0.102175708626437,-0.738004941310498
0.75,0.10543695508609,-0.747491301155461
0.76,0.108855938302436,-0.7569203904937
0.77,0.112447585240453,-0.766283495534861
0.78,0.116228828560129,-0.775570067412873
0.79,0.120218922531129,-0.784767239213798
0.8,0.124439800102736,-0.793859193319658
0.81,0.128916464143939,-0.80282632792027
0.82,0.133677392560932,-0.811644154374955
0.83,0.138754912059935,-0.82028183628862
0.84,0.144185450208449,-0.828700259303397
0.85,0.150009496592881,-0.836849506182118
0.86,0.156270971934033,-0.844665626509584
0.87,0.163015497846183,-0.852066683082446
0.88,0.170286775957797,-0.858948324813692
0.89,0.178119995421626,-0.865179740245662
0.9,0.186531166819266,-0.870601967799385
0.91,0.195502171095761,-0.875032126443431
0.92,0.20496403080651,-0.878278260293555
0.93,0.214785523082994,-0.88016771644844
0.94,0.2247776080699,-0.880584647451513
0.95,0.234719828410398,-0.879501768211853
0.96,0.244401187799155,-0.87698861783708
0.97,0.253656493026254,-0.873191093590971
0.98,0.262382922900796,-0.868294777192813
0.99,0.270536133329308,-0.862490266003388
1,0.278115294937452,-0.855950864665637
